{"text_format":"1","workbook":"xlsx","n_sheets":38,"sheets":["Disclaimer","Prelim&Gen Flysheet","Section A","Civil Works Flysheet","Section C1","Section C2","Section C3","Section C4","Section C5","Section C6","Section C7","M&E Flysheet ","ME1","ME2","ME3","ME4","ME5","ME6","ME7","ME8","ME9","ME10","ME11","ME12","ME13","ME14","ME15","ME16","ME17","ME18","ME19","ME20","ME21","ME22","SS&66kV line Flysheet ","Section SS1","Summary Flysheet ","Summary"],"not_rendered":{"charts":0,"images":0,"macros":0,"external_links":0,"defined_names":212,"comments":6,"pivot_tables":0},"unopened":[],"bounds":{"document_bytes":16777216,"sheet_cells":100000,"rows_first":2000,"rows_last":500,"rows_between":2000,"halvings":0,"cell_chars":16384,"cell_head_chars":4096},"cells_cut":0,"cells_raw":0,"read":"whole","date_system":"1900"}

{"sheet":"Disclaimer","index":0,"n_rows":13,"n_cols":3,"rows_kept":13,"cut":false,"hidden":false,"merged":[]}
[null,null,"DISCLAIMER"]
[]
[]
[null,null,"This electronic file is made available for the convenience of prospective tenderers and no responsibility is accepted by the Engineer or the Employer for the accuracy of the data in this file or for any discrepancy between the data in this file and the Bill of Quantities bound into the relevant tender document.  Tenderers or others using the information in this file do so at their own risk.  This file and the data therein, including any hard copy produced from this file are the copyright of Aurecon South Africa (Pty) Ltd.  This file will not be amended to take account of any Notice(s) to Tenderers issued."]
[]
[null,null,"Notwithstanding the provision of this electronic file, tenders may not be submitted in electronic form nor may tenders be submitted on a print-out made from this file.  "]
[null,null,"The requirements of the Conditions of Tender of the relevant tender document, must be strictly adhered to."]
[]
[null,null,"AFWYSING"]
[]
[null,null,"Hierdie elektroniese leêr word vir die gerief van voornemende tenderaars beskikbaar gestel en geen verantwoordelikheid word deur die Ingenieur of die Werkgewer aanvaar nie vir die akkuraatheid van die data in hierdie leêr of enige teenstrydigheid tussen die data in hierdie leêr en die Hoeveelheidslys ingebind in die betrokke tender dokument.  Tenderaars en ander gebruik die inligting in heirdie leêr op eie risiko.  Hierdie leêr en data daarin, asook enige herprodusering van hierdie leêr, is kopiereg van Aurecon Suid-Afrika (Edms) Bpk.  Hierdie leêr sal nie aangepas word om enige Kennisgewing(s) aan Tenderaars in ag te neem nie."]
[]
[null,null,"Nieteenstaande die beskikbaarstelling van hierdie elektroniese leêr, mag tenders nie in elektroniese vorm of as 'n drukstuk van hierdie elektroniese leêr ingedien word nie.  Die vereistes van die Tendervoorwaardes van die betrokke tender dokument moet ten strengste nagekom word. "]

{"sheet":"Prelim&Gen Flysheet","index":1,"n_rows":22,"n_cols":1,"rows_kept":22,"cut":false,"hidden":false,"merged":[[21,0,21,9]]}
[]
[]
[]
[]
[]
[]
[]
[]
[]
[]
[]
[]
[]
[]
[]
[]
[]
[]
[]
[]
[]
["Preliminary and General"]

{"sheet":"Section A","index":2,"n_rows":349,"n_cols":8,"rows_kept":349,"cut":false,"hidden":false,"merged":[]}
["Item No","Item No","Payment Clause","Short Description","Unit","Quantity","Rate","Amount\n R             c"]
[]
["A.",null,"SANS","SECTION: A"]
[null,null,"1200 A","PRELIMINARY AND GENERAL"]
[]
[{"$f":"IF($E6<>\"\",MAX($A$1:INDIRECT(CONCATENATE(\"$A$\",ROW()-1)))+1,\"\")","v":""},{"$f":"IF(A6<>\"\",$A$3&A6,\"\")","v":""},null,"Fixed-charge items:"]
[{"$f":"IF($E7<>\"\",MAX($A$1:INDIRECT(CONCATENATE(\"$A$\",ROW()-1)))+1,\"\")","v":""},""]
[{"$f":"IF($E8<>\"\",MAX($A$1:INDIRECT(CONCATENATE(\"$A$\",ROW()-1)))+1,\"\")","v":1},{"$f":"IF(A8<>\"\",$A$3&A8,\"\")","v":"A.1"},"8.3.1","Contractual requirements: Refer to Section C3.1"," Sum","-","-"," "]
[{"$f":"IF($E9<>\"\",MAX($A$1:INDIRECT(CONCATENATE(\"$A$\",ROW()-1)))+1,\"\")","v":""},{"$f":"IF(A9<>\"\",$A$3&A9,\"\")","v":""}]
[{"$f":"IF($E10<>\"\",MAX($A$1:INDIRECT(CONCATENATE(\"$A$\",ROW()-1)))+1,\"\")","v":2},"A.2","Project Spec. PS 9","Detailed design of Engineering: Mechanical and Electrical - Pump Station","Sum","-"]
[{"$f":"IF($E11<>\"\",MAX($A$1:INDIRECT(CONCATENATE(\"$A$\",ROW()-1)))+1,\"\")","v":""},""]
[{"$f":"IF($E12<>\"\",MAX($A$1:INDIRECT(CONCATENATE(\"$A$\",ROW()-1)))+1,\"\")","v":""},""," ","Establishment of facilities on the Site"]
[{"$f":"IF($E13<>\"\",MAX($A$1:INDIRECT(CONCATENATE(\"$A$\",ROW()-1)))+1,\"\")","v":""},""]
[{"$f":"IF($E14<>\"\",MAX($A$1:INDIRECT(CONCATENATE(\"$A$\",ROW()-1)))+1,\"\")","v":3},"A.3","PSA 8.3.2.1\nPSAB 8.2.1","Facilities for the Engineer "," Sum  ","-","-"]
[{"$f":"IF($E15<>\"\",MAX($A$1:INDIRECT(CONCATENATE(\"$A$\",ROW()-1)))+1,\"\")","v":""},""]
[{"$f":"IF($E16<>\"\",MAX($A$1:INDIRECT(CONCATENATE(\"$A$\",ROW()-1)))+1,\"\")","v":4},"A.4","PSA 8.3.2.2","Facilities for the Contractor including offices, storage sheds, workshops, living  accommodation, ablution and  latrine facilities, tools and  equipment, water supplies,  electric power, communications and setting out of Works","Sum","-","-"]
[{"$f":"IF($E17<>\"\",MAX($A$1:INDIRECT(CONCATENATE(\"$A$\",ROW()-1)))+1,\"\")","v":""},""]
[{"$f":"IF($E18<>\"\",MAX($A$1:INDIRECT(CONCATENATE(\"$A$\",ROW()-1)))+1,\"\")","v":5},"A.5","PSA 8.8.1","Deal with access, including construction of temporary access roads","Sum","-","-"]
[{"$f":"IF($E19<>\"\",MAX($A$1:INDIRECT(CONCATENATE(\"$A$\",ROW()-1)))+1,\"\")","v":""},""]
[{"$f":"IF($E20<>\"\",MAX($A$1:INDIRECT(CONCATENATE(\"$A$\",ROW()-1)))+1,\"\")","v":6},"A.6","PSA 8.8.1","Remove temporary site roads and reinstate site","Sum","-","-"]
[{"$f":"IF($E21<>\"\",MAX($A$1:INDIRECT(CONCATENATE(\"$A$\",ROW()-1)))+1,\"\")","v":""},""]
[{"$f":"IF($E22<>\"\",MAX($A$1:INDIRECT(CONCATENATE(\"$A$\",ROW()-1)))+1,\"\")","v":7},"A.7","PSA 8.8.2","Deal with traffic"," Sum","-","-"]
[{"$f":"IF($E23<>\"\",MAX($A$1:INDIRECT(CONCATENATE(\"$A$\",ROW()-1)))+1,\"\")","v":""},""]
[{"$f":"IF($E24<>\"\",MAX($A$1:INDIRECT(CONCATENATE(\"$A$\",ROW()-1)))+1,\"\")","v":""},"","PSA 8.8.7","Deal with water"]
[{"$f":"IF($E25<>\"\",MAX($A$1:INDIRECT(CONCATENATE(\"$A$\",ROW()-1)))+1,\"\")","v":""},""]
[{"$f":"IF($E26<>\"\",MAX($A$1:INDIRECT(CONCATENATE(\"$A$\",ROW()-1)))+1,\"\")","v":8},"A.8",null,"Deal with surface water"," Sum","-","-"]
[{"$f":"IF($E27<>\"\",MAX($A$1:INDIRECT(CONCATENATE(\"$A$\",ROW()-1)))+1,\"\")","v":""},""]
[{"$f":"IF($E28<>\"\",MAX($A$1:INDIRECT(CONCATENATE(\"$A$\",ROW()-1)))+1,\"\")","v":9},"A.9",null,"Deal with subsurface water"," Sum","-","-"]
[{"$f":"IF($E29<>\"\",MAX($A$1:INDIRECT(CONCATENATE(\"$A$\",ROW()-1)))+1,\"\")","v":""},""]
[{"$f":"IF($E30<>\"\",MAX($A$1:INDIRECT(CONCATENATE(\"$A$\",ROW()-1)))+1,\"\")","v":10},"A.10","8.3.3","Other fixed-charge obligations","Sum","-","-"]
[{"$f":"IF($E31<>\"\",MAX($A$1:INDIRECT(CONCATENATE(\"$A$\",ROW()-1)))+1,\"\")","v":""},""]
[{"$f":"IF($E32<>\"\",MAX($A$1:INDIRECT(CONCATENATE(\"$A$\",ROW()-1)))+1,\"\")","v":11},"A.11","PSA 8.3.4","Removal of Engineer's and Contractor's site establishment and reinstatement of site on completion","   Sum","-","-"]
[{"$f":"IF($E33<>\"\",MAX($A$1:INDIRECT(CONCATENATE(\"$A$\",ROW()-1)))+1,\"\")","v":""},""]
[{"$f":"IF($E34<>\"\",MAX($A$1:INDIRECT(CONCATENATE(\"$A$\",ROW()-1)))+1,\"\")","v":""},"","PSA 8.12","Health and safety:"]
[{"$f":"IF($E35<>\"\",MAX($A$1:INDIRECT(CONCATENATE(\"$A$\",ROW()-1)))+1,\"\")","v":""},""]
[{"$f":"IF($E36<>\"\",MAX($A$1:INDIRECT(CONCATENATE(\"$A$\",ROW()-1)))+1,\"\")","v":12},"A.12"," ","General safety obligations","Sum","-","-"]
[]
[{"$f":"IF($E38<>\"\",MAX($A$1:INDIRECT(CONCATENATE(\"$A$\",ROW()-1)))+1,\"\")","v":13},{"$f":"IF(A38<>\"\",$A$3&A38,\"\")","v":"A.13"}," ","Risk assessment","Sum","-","-"]
[{"$f":"IF($E39<>\"\",MAX($A$1:INDIRECT(CONCATENATE(\"$A$\",ROW()-1)))+1,\"\")","v":""},""]
[{"$f":"IF($E40<>\"\",MAX($A$1:INDIRECT(CONCATENATE(\"$A$\",ROW()-1)))+1,\"\")","v":14},"A.14"," ","Health and safety plan","Sum","-","-"]
[{"$f":"IF($E41<>\"\",MAX($A$1:INDIRECT(CONCATENATE(\"$A$\",ROW()-1)))+1,\"\")","v":""},""]
[{"$f":"IF($E42<>\"\",MAX($A$1:INDIRECT(CONCATENATE(\"$A$\",ROW()-1)))+1,\"\")","v":15},"A.15"," ","Training","Sum","-","-"]
[{"$f":"IF($E43<>\"\",MAX($A$1:INDIRECT(CONCATENATE(\"$A$\",ROW()-1)))+1,\"\")","v":""},""]
[{"$f":"IF($E44<>\"\",MAX($A$1:INDIRECT(CONCATENATE(\"$A$\",ROW()-1)))+1,\"\")","v":16},"A.16"," ","Medical assessment of employees","Sum","-","-"]
[]
[{"$f":"IF($E46<>\"\",MAX($A$1:INDIRECT(CONCATENATE(\"$A$\",ROW()-1)))+1,\"\")","v":""},{"$f":"IF(A46<>\"\",$A$3&A46,\"\")","v":""},null," Carried forward / …"]
[{"$f":"IF($E47<>\"\",MAX($A$1:INDIRECT(CONCATENATE(\"$A$\",ROW()-1)))+1,\"\")","v":""},"",null," Brought forward / …"]
[]
[{"$f":"IF($E49<>\"\",MAX($A$1:INDIRECT(CONCATENATE(\"$A$\",ROW()-1)))+1,\"\")","v":17},"A.17",null,"All other costs to comply with the requirements of the OHS Act and Health and Safety specification","Sum","-","-"]
[{"$f":"IF($E50<>\"\",MAX($A$1:INDIRECT(CONCATENATE(\"$A$\",ROW()-1)))+1,\"\")","v":""},""]
[{"$f":"IF($E51<>\"\",MAX($A$1:INDIRECT(CONCATENATE(\"$A$\",ROW()-1)))+1,\"\")","v":""},"",null,"Time-related items:"]
[{"$f":"IF($E52<>\"\",MAX($A$1:INDIRECT(CONCATENATE(\"$A$\",ROW()-1)))+1,\"\")","v":""},""]
[{"$f":"IF($E53<>\"\",MAX($A$1:INDIRECT(CONCATENATE(\"$A$\",ROW()-1)))+1,\"\")","v":18},"A.18","8.4.1","Contractual requirements: Refer to Section C3.1"," Sum","-","-"]
[{"$f":"IF($E54<>\"\",MAX($A$1:INDIRECT(CONCATENATE(\"$A$\",ROW()-1)))+1,\"\")","v":""},""]
[{"$f":"IF($E55<>\"\",MAX($A$1:INDIRECT(CONCATENATE(\"$A$\",ROW()-1)))+1,\"\")","v":""},""," ","Operation and maintenance of facilities on Site"]
[{"$f":"IF($E56<>\"\",MAX($A$1:INDIRECT(CONCATENATE(\"$A$\",ROW()-1)))+1,\"\")","v":""},""]
[{"$f":"IF($E57<>\"\",MAX($A$1:INDIRECT(CONCATENATE(\"$A$\",ROW()-1)))+1,\"\")","v":19},"A.19","PSA 8.4.2.1\nPSAB 8.2.1","Facilities for Engineer "," Sum  ","-","-"]
[{"$f":"IF($E58<>\"\",MAX($A$1:INDIRECT(CONCATENATE(\"$A$\",ROW()-1)))+1,\"\")","v":""},""]
[{"$f":"IF($E59<>\"\",MAX($A$1:INDIRECT(CONCATENATE(\"$A$\",ROW()-1)))+1,\"\")","v":20},"A.20","PSA 8.4.2.2","Facilities for Contractor"," Sum","-","-"]
[{"$f":"IF($E60<>\"\",MAX($A$1:INDIRECT(CONCATENATE(\"$A$\",ROW()-1)))+1,\"\")","v":""},""]
[{"$f":"IF($E61<>\"\",MAX($A$1:INDIRECT(CONCATENATE(\"$A$\",ROW()-1)))+1,\"\")","v":21},"A.21","PSA 8.8.1","Deal with access, including construction and maintenance of temporary access roads","Sum","-","-"]
[{"$f":"IF($E62<>\"\",MAX($A$1:INDIRECT(CONCATENATE(\"$A$\",ROW()-1)))+1,\"\")","v":""},""]
[{"$f":"IF($E63<>\"\",MAX($A$1:INDIRECT(CONCATENATE(\"$A$\",ROW()-1)))+1,\"\")","v":22},"A.22","PSA 8.8.2","Deal with traffic"," Sum","-","-"]
[{"$f":"IF($E64<>\"\",MAX($A$1:INDIRECT(CONCATENATE(\"$A$\",ROW()-1)))+1,\"\")","v":""},""]
[{"$f":"IF($E65<>\"\",MAX($A$1:INDIRECT(CONCATENATE(\"$A$\",ROW()-1)))+1,\"\")","v":""},"","PSA 8.8.7","Deal with water"]
[{"$f":"IF($E66<>\"\",MAX($A$1:INDIRECT(CONCATENATE(\"$A$\",ROW()-1)))+1,\"\")","v":""},""]
[{"$f":"IF($E67<>\"\",MAX($A$1:INDIRECT(CONCATENATE(\"$A$\",ROW()-1)))+1,\"\")","v":23},"A.23",null,"Deal with surface water"," Sum","-","-"]
[{"$f":"IF($E68<>\"\",MAX($A$1:INDIRECT(CONCATENATE(\"$A$\",ROW()-1)))+1,\"\")","v":""},""]
[{"$f":"IF($E69<>\"\",MAX($A$1:INDIRECT(CONCATENATE(\"$A$\",ROW()-1)))+1,\"\")","v":24},"A.24",null,"Deal with subsurface water"," Sum","-","-"]
[{"$f":"IF($E70<>\"\",MAX($A$1:INDIRECT(CONCATENATE(\"$A$\",ROW()-1)))+1,\"\")","v":""},""]
[{"$f":"IF($E71<>\"\",MAX($A$1:INDIRECT(CONCATENATE(\"$A$\",ROW()-1)))+1,\"\")","v":25},"A.25",null,"Deal with sewer flow"," Sum","-","-"]
[{"$f":"IF($E72<>\"\",MAX($A$1:INDIRECT(CONCATENATE(\"$A$\",ROW()-1)))+1,\"\")","v":""},""]
[{"$f":"IF($E73<>\"\",MAX($A$1:INDIRECT(CONCATENATE(\"$A$\",ROW()-1)))+1,\"\")","v":26},"A.26","PSA 8.4.3\n8.4.4","Supervision and company and head office overhead costs"," Sum","-","-"]
[{"$f":"IF($E74<>\"\",MAX($A$1:INDIRECT(CONCATENATE(\"$A$\",ROW()-1)))+1,\"\")","v":""},""]
[{"$f":"IF($E75<>\"\",MAX($A$1:INDIRECT(CONCATENATE(\"$A$\",ROW()-1)))+1,\"\")","v":27},"A.27","8.4.5","Other time-related obligations ","Sum ","-","-"]
[{"$f":"IF($E76<>\"\",MAX($A$1:INDIRECT(CONCATENATE(\"$A$\",ROW()-1)))+1,\"\")","v":""},""]
[{"$f":"IF($E77<>\"\",MAX($A$1:INDIRECT(CONCATENATE(\"$A$\",ROW()-1)))+1,\"\")","v":""},"","PSA 8.12","Health and safety:"]
[{"$f":"IF($E78<>\"\",MAX($A$1:INDIRECT(CONCATENATE(\"$A$\",ROW()-1)))+1,\"\")","v":""},""]
[{"$f":"IF($E79<>\"\",MAX($A$1:INDIRECT(CONCATENATE(\"$A$\",ROW()-1)))+1,\"\")","v":28},"A.28"," ","General safety obligations","Sum","-","-"]
[{"$f":"IF($E80<>\"\",MAX($A$1:INDIRECT(CONCATENATE(\"$A$\",ROW()-1)))+1,\"\")","v":""},""]
[{"$f":"IF($E81<>\"\",MAX($A$1:INDIRECT(CONCATENATE(\"$A$\",ROW()-1)))+1,\"\")","v":29},"A.29"," ","Health and safety plan","Sum","-","-"]
[{"$f":"IF($E82<>\"\",MAX($A$1:INDIRECT(CONCATENATE(\"$A$\",ROW()-1)))+1,\"\")","v":""},""]
[{"$f":"IF($E83<>\"\",MAX($A$1:INDIRECT(CONCATENATE(\"$A$\",ROW()-1)))+1,\"\")","v":30},"A.30",null,"All other costs to comply with the requirements of the OHS Act and Health and Safety specification","Sum","-","-"]
[{"$f":"IF($E84<>\"\",MAX($A$1:INDIRECT(CONCATENATE(\"$A$\",ROW()-1)))+1,\"\")","v":""},""]
[{"$f":"IF($E85<>\"\",MAX($A$1:INDIRECT(CONCATENATE(\"$A$\",ROW()-1)))+1,\"\")","v":""},"",null,"Provisional sums"]
[{"$f":"IF($E86<>\"\",MAX($A$1:INDIRECT(CONCATENATE(\"$A$\",ROW()-1)))+1,\"\")","v":""},""]
[{"$f":"IF($E87<>\"\",MAX($A$1:INDIRECT(CONCATENATE(\"$A$\",ROW()-1)))+1,\"\")","v":31},"A.31","PSA 8.5.1","Maintenance and photocopy paper to be paid by the Employer","Prov Sum","-","-",30000]
[{"$f":"IF($E88<>\"\",MAX($A$1:INDIRECT(CONCATENATE(\"$A$\",ROW()-1)))+1,\"\")","v":""},""]
[{"$f":"IF($E89<>\"\",MAX($A$1:INDIRECT(CONCATENATE(\"$A$\",ROW()-1)))+1,\"\")","v":32},"A.32",null,"Percentage adjustment on the item above for Contractor's overheads and profit (State % and extend as an amount)","%",30000," "," "]
[]
[{"$f":"IF($E91<>\"\",MAX($A$1:INDIRECT(CONCATENATE(\"$A$\",ROW()-1)))+1,\"\")","v":""},{"$f":"IF(A91<>\"\",$A$3&A91,\"\")","v":""},null," Carried forward / …"]
[{"$f":"IF($E92<>\"\",MAX($A$1:INDIRECT(CONCATENATE(\"$A$\",ROW()-1)))+1,\"\")","v":""},"",null," Brought forward / …"]
[]
[{"$f":"IF($E94<>\"\",MAX($A$1:INDIRECT(CONCATENATE(\"$A$\",ROW()-1)))+1,\"\")","v":33},"A.33","PSA 8.5.2","Pipeline: Independent inspectorate for testing of pipes, linings and coatings at factory","Prov Sum","-","-",250000]
[{"$f":"IF($E95<>\"\",MAX($A$1:INDIRECT(CONCATENATE(\"$A$\",ROW()-1)))+1,\"\")","v":""},""]
[{"$f":"IF($E96<>\"\",MAX($A$1:INDIRECT(CONCATENATE(\"$A$\",ROW()-1)))+1,\"\")","v":34},"A.34",null,"Percentage adjustment on the item above for Contractor's overheads and profit (State % and extend as an amount)","   %",250000]
[{"$f":"IF($E97<>\"\",MAX($A$1:INDIRECT(CONCATENATE(\"$A$\",ROW()-1)))+1,\"\")","v":""},""]
[{"$f":"IF($E98<>\"\",MAX($A$1:INDIRECT(CONCATENATE(\"$A$\",ROW()-1)))+1,\"\")","v":35},"A.35",null,"Pump station and Reservoir: Independent inspectorate for testing of pipe specials, valves, linings and coatings at the factory","Prov Sum","-","-",250000]
[{"$f":"IF($E99<>\"\",MAX($A$1:INDIRECT(CONCATENATE(\"$A$\",ROW()-1)))+1,\"\")","v":""},""]
[{"$f":"IF($E100<>\"\",MAX($A$1:INDIRECT(CONCATENATE(\"$A$\",ROW()-1)))+1,\"\")","v":36},"A.36",null,"Percentage adjustment on the item above for Contractor's overheads and profit (State % and extend as an amount)","   %",250000]
[{"$f":"IF($E101<>\"\",MAX($A$1:INDIRECT(CONCATENATE(\"$A$\",ROW()-1)))+1,\"\")","v":""},""]
[{"$f":"IF($E102<>\"\",MAX($A$1:INDIRECT(CONCATENATE(\"$A$\",ROW()-1)))+1,\"\")","v":37},{"$f":"IF(A102<>\"\",$A$3&A102,\"\")","v":"A.37"},null,"Pipeline: Independent inspectorate for testing of field welds and joint repairs","Prov Sum","-","-",250000]
[{"$f":"IF($E103<>\"\",MAX($A$1:INDIRECT(CONCATENATE(\"$A$\",ROW()-1)))+1,\"\")","v":""},""]
[{"$f":"IF($E104<>\"\",MAX($A$1:INDIRECT(CONCATENATE(\"$A$\",ROW()-1)))+1,\"\")","v":38},"A.38",null,"Percentage adjustment on the item above for Contractor's overheads and profit (State % and extend as an amount)","   %",250000]
[{"$f":"IF($E105<>\"\",MAX($A$1:INDIRECT(CONCATENATE(\"$A$\",ROW()-1)))+1,\"\")","v":""},""]
[{"$f":"IF($E106<>\"\",MAX($A$1:INDIRECT(CONCATENATE(\"$A$\",ROW()-1)))+1,\"\")","v":39},"A.39",null,"Independent inspectorate for testing and inspection of cathodic protection systems ","Prov Sum","-","-",1500000]
[{"$f":"IF($E107<>\"\",MAX($A$1:INDIRECT(CONCATENATE(\"$A$\",ROW()-1)))+1,\"\")","v":""},""]
[{"$f":"IF($E108<>\"\",MAX($A$1:INDIRECT(CONCATENATE(\"$A$\",ROW()-1)))+1,\"\")","v":40},"A.40",null,"Percentage adjustment on the item above for Contractor's overheads and profit (State % and extend as an amount)","   %",1500000]
[{"$f":"IF($E109<>\"\",MAX($A$1:INDIRECT(CONCATENATE(\"$A$\",ROW()-1)))+1,\"\")","v":""},""]
[{"$f":"IF($E110<>\"\",MAX($A$1:INDIRECT(CONCATENATE(\"$A$\",ROW()-1)))+1,\"\")","v":""},"",null,"Existing services"]
[{"$f":"IF($E111<>\"\",MAX($A$1:INDIRECT(CONCATENATE(\"$A$\",ROW()-1)))+1,\"\")","v":""},""]
[{"$f":"IF($E112<>\"\",MAX($A$1:INDIRECT(CONCATENATE(\"$A$\",ROW()-1)))+1,\"\")","v":""},"","PSA 8.8.4.1","Provision of equipment for detecting services"]
[{"$f":"IF($E113<>\"\",MAX($A$1:INDIRECT(CONCATENATE(\"$A$\",ROW()-1)))+1,\"\")","v":""},""]
[{"$f":"IF($E114<>\"\",MAX($A$1:INDIRECT(CONCATENATE(\"$A$\",ROW()-1)))+1,\"\")","v":41},"A.41",null,"Water and sewer pipes ","Sum ","-","-"]
[{"$f":"IF($E115<>\"\",MAX($A$1:INDIRECT(CONCATENATE(\"$A$\",ROW()-1)))+1,\"\")","v":""},""]
[{"$f":"IF($E116<>\"\",MAX($A$1:INDIRECT(CONCATENATE(\"$A$\",ROW()-1)))+1,\"\")","v":42},"A.42",null,"Electrical and other cables ","Sum ","-","-"]
[{"$f":"IF($E117<>\"\",MAX($A$1:INDIRECT(CONCATENATE(\"$A$\",ROW()-1)))+1,\"\")","v":""},""]
[{"$f":"IF($E118<>\"\",MAX($A$1:INDIRECT(CONCATENATE(\"$A$\",ROW()-1)))+1,\"\")","v":43},"A.43",null,"Other","Sum ","-","-"]
[{"$f":"IF($E119<>\"\",MAX($A$1:INDIRECT(CONCATENATE(\"$A$\",ROW()-1)))+1,\"\")","v":""},""]
[{"$f":"IF($E120<>\"\",MAX($A$1:INDIRECT(CONCATENATE(\"$A$\",ROW()-1)))+1,\"\")","v":""},"","PSA 8.8.4.2","Hand excavation necessary for locating and exposing existing services in all materials"]
[{"$f":"IF($E121<>\"\",MAX($A$1:INDIRECT(CONCATENATE(\"$A$\",ROW()-1)))+1,\"\")","v":""},""]
[{"$f":"IF($E122<>\"\",MAX($A$1:INDIRECT(CONCATENATE(\"$A$\",ROW()-1)))+1,\"\")","v":44},"A.44",null,"In roadways","m³",300]
[{"$f":"IF($E123<>\"\",MAX($A$1:INDIRECT(CONCATENATE(\"$A$\",ROW()-1)))+1,\"\")","v":""},""]
[{"$f":"IF($E124<>\"\",MAX($A$1:INDIRECT(CONCATENATE(\"$A$\",ROW()-1)))+1,\"\")","v":45},"A.45",null,"In all other areas","m³",1000]
[{"$f":"IF($E125<>\"\",MAX($A$1:INDIRECT(CONCATENATE(\"$A$\",ROW()-1)))+1,\"\")","v":""},""]
[{"$f":"IF($E126<>\"\",MAX($A$1:INDIRECT(CONCATENATE(\"$A$\",ROW()-1)))+1,\"\")","v":46},"A.46","PSA 8.5.1","Locating, protection, alteration and relocation of existing services carried out by authorities or Contractor","Prov Sum","-","-",300000]
[]
[{"$f":"IF($E128<>\"\",MAX($A$1:INDIRECT(CONCATENATE(\"$A$\",ROW()-1)))+1,\"\")","v":""},{"$f":"IF(A128<>\"\",$A$3&A128,\"\")","v":""},null," Carried forward / …"]
[{"$f":"IF($E129<>\"\",MAX($A$1:INDIRECT(CONCATENATE(\"$A$\",ROW()-1)))+1,\"\")","v":""},"",null," Brought forward / …"]
[]
[{"$f":"IF($E131<>\"\",MAX($A$1:INDIRECT(CONCATENATE(\"$A$\",ROW()-1)))+1,\"\")","v":47},"A.47",null,"Percentage adjustment on the item above for Contractor's overheads and profit (State % and extend as an amount)","   %",300000]
[{"$f":"IF($E132<>\"\",MAX($A$1:INDIRECT(CONCATENATE(\"$A$\",ROW()-1)))+1,\"\")","v":""},""]
[{"$f":"IF($E133<>\"\",MAX($A$1:INDIRECT(CONCATENATE(\"$A$\",ROW()-1)))+1,\"\")","v":""},"",null,"Facilities for Engineer"]
[{"$f":"IF($E134<>\"\",MAX($A$1:INDIRECT(CONCATENATE(\"$A$\",ROW()-1)))+1,\"\")","v":""},""]
[{"$f":"IF($E135<>\"\",MAX($A$1:INDIRECT(CONCATENATE(\"$A$\",ROW()-1)))+1,\"\")","v":48},"A.48","PSA 8.5.1","Telephone calls, faxes, photocopy paper and consumables to be paid by Employer","Prov Sum","-","-",20000]
[{"$f":"IF($E136<>\"\",MAX($A$1:INDIRECT(CONCATENATE(\"$A$\",ROW()-1)))+1,\"\")","v":""},""]
[{"$f":"IF($E137<>\"\",MAX($A$1:INDIRECT(CONCATENATE(\"$A$\",ROW()-1)))+1,\"\")","v":49},"A.49",null,"Percentage adjustment on the item above for Contractor's overheads and profit (State % and extend as an amount)","%",20000]
[{"$f":"IF($E138<>\"\",MAX($A$1:INDIRECT(CONCATENATE(\"$A$\",ROW()-1)))+1,\"\")","v":""},""]
[{"$f":"IF($E139<>\"\",MAX($A$1:INDIRECT(CONCATENATE(\"$A$\",ROW()-1)))+1,\"\")","v":50},"A.50",null,"Internet connection (min 4 mbps speed) including data usage to be paid by Employer","Prov Sum","-","-",50000]
[{"$f":"IF($E140<>\"\",MAX($A$1:INDIRECT(CONCATENATE(\"$A$\",ROW()-1)))+1,\"\")","v":""},""]
[{"$f":"IF($E141<>\"\",MAX($A$1:INDIRECT(CONCATENATE(\"$A$\",ROW()-1)))+1,\"\")","v":51},"A.51",null,"Percentage adjustment on the item above for Contractor's overheads and profit (State % and extend as an amount)","%",50000]
[{"$f":"IF($E142<>\"\",MAX($A$1:INDIRECT(CONCATENATE(\"$A$\",ROW()-1)))+1,\"\")","v":""},""]
[{"$f":"IF($E143<>\"\",MAX($A$1:INDIRECT(CONCATENATE(\"$A$\",ROW()-1)))+1,\"\")","v":52},"A.52",null,"Time lapse recording of construction activities using a remote control drone with camera and fixed camera located on a high point to monitor progress. Engineer to specify monitoring requirements and equipment details.","Prov Sum","-","-",50000]
[{"$f":"IF($E144<>\"\",MAX($A$1:INDIRECT(CONCATENATE(\"$A$\",ROW()-1)))+1,\"\")","v":""},""]
[{"$f":"IF($E145<>\"\",MAX($A$1:INDIRECT(CONCATENATE(\"$A$\",ROW()-1)))+1,\"\")","v":53},"A.53",null,"Percentage adjustment on the item above for Contractor's overheads and profit (State % and extend as an amount)","%",50000]
[{"$f":"IF($E146<>\"\",MAX($A$1:INDIRECT(CONCATENATE(\"$A$\",ROW()-1)))+1,\"\")","v":""},""]
[{"$f":"IF($E147<>\"\",MAX($A$1:INDIRECT(CONCATENATE(\"$A$\",ROW()-1)))+1,\"\")","v":""},"","8.7\nPSA 8.7","Daywork"]
[{"$f":"IF($E148<>\"\",MAX($A$1:INDIRECT(CONCATENATE(\"$A$\",ROW()-1)))+1,\"\")","v":""},""]
[{"$f":"IF($E149<>\"\",MAX($A$1:INDIRECT(CONCATENATE(\"$A$\",ROW()-1)))+1,\"\")","v":""},"",null,"Labour"]
[{"$f":"IF($E150<>\"\",MAX($A$1:INDIRECT(CONCATENATE(\"$A$\",ROW()-1)))+1,\"\")","v":""},""]
[{"$f":"IF($E151<>\"\",MAX($A$1:INDIRECT(CONCATENATE(\"$A$\",ROW()-1)))+1,\"\")","v":54},"A.54",null,"Skilled (incl. artisans)","h",1500]
[{"$f":"IF($E152<>\"\",MAX($A$1:INDIRECT(CONCATENATE(\"$A$\",ROW()-1)))+1,\"\")","v":""},""]
[{"$f":"IF($E153<>\"\",MAX($A$1:INDIRECT(CONCATENATE(\"$A$\",ROW()-1)))+1,\"\")","v":55},"A.55",null,"Semi-skilled","h",2000]
[{"$f":"IF($E154<>\"\",MAX($A$1:INDIRECT(CONCATENATE(\"$A$\",ROW()-1)))+1,\"\")","v":""},""]
[{"$f":"IF($E155<>\"\",MAX($A$1:INDIRECT(CONCATENATE(\"$A$\",ROW()-1)))+1,\"\")","v":56},"A.56",null,"Unskilled (incl flagmen)","h",4500]
[{"$f":"IF($E156<>\"\",MAX($A$1:INDIRECT(CONCATENATE(\"$A$\",ROW()-1)))+1,\"\")","v":""},""]
[{"$f":"IF($E157<>\"\",MAX($A$1:INDIRECT(CONCATENATE(\"$A$\",ROW()-1)))+1,\"\")","v":""},"",null,"Material"]
[{"$f":"IF($E158<>\"\",MAX($A$1:INDIRECT(CONCATENATE(\"$A$\",ROW()-1)))+1,\"\")","v":57},"A.57"," ","(Not subject to price adjustments)"," "]
[{"$f":"IF($E159<>\"\",MAX($A$1:INDIRECT(CONCATENATE(\"$A$\",ROW()-1)))+1,\"\")","v":""},""]
[{"$f":"IF($E160<>\"\",MAX($A$1:INDIRECT(CONCATENATE(\"$A$\",ROW()-1)))+1,\"\")","v":58},"A.58",null,"Net cost of goods or material","Prov Sum","-","-",400000]
[{"$f":"IF($E161<>\"\",MAX($A$1:INDIRECT(CONCATENATE(\"$A$\",ROW()-1)))+1,\"\")","v":""},""]
[{"$f":"IF($E162<>\"\",MAX($A$1:INDIRECT(CONCATENATE(\"$A$\",ROW()-1)))+1,\"\")","v":59},"A.59","   ","Percentage adjustment on the item above for Contractor's overheads and profit (State % and extend as an amount)","   %",400000]
[]
[]
[{"$f":"IF($E165<>\"\",MAX($A$1:INDIRECT(CONCATENATE(\"$A$\",ROW()-1)))+1,\"\")","v":""},{"$f":"IF(A165<>\"\",$A$3&A165,\"\")","v":""},null," Carried forward / …"]
[{"$f":"IF($E166<>\"\",MAX($A$1:INDIRECT(CONCATENATE(\"$A$\",ROW()-1)))+1,\"\")","v":""},"",null," Brought forward / …"]
[]
[{"$f":"IF($E168<>\"\",MAX($A$1:INDIRECT(CONCATENATE(\"$A$\",ROW()-1)))+1,\"\")","v":""},{"$f":"IF(A168<>\"\",$A$3&A168,\"\")","v":""},null,"Contractor's own plant"]
[{"$f":"IF($E169<>\"\",MAX($A$1:INDIRECT(CONCATENATE(\"$A$\",ROW()-1)))+1,\"\")","v":""},""]
[{"$f":"IF($E170<>\"\",MAX($A$1:INDIRECT(CONCATENATE(\"$A$\",ROW()-1)))+1,\"\")","v":""},"",null,"Bulldozer"]
[{"$f":"IF($E171<>\"\",MAX($A$1:INDIRECT(CONCATENATE(\"$A$\",ROW()-1)))+1,\"\")","v":""},""]
[{"$f":"IF($E172<>\"\",MAX($A$1:INDIRECT(CONCATENATE(\"$A$\",ROW()-1)))+1,\"\")","v":""},"",null,"Minimum power: 220 kW (35 t)"]
[{"$f":"IF($E173<>\"\",MAX($A$1:INDIRECT(CONCATENATE(\"$A$\",ROW()-1)))+1,\"\")","v":""},""]
[{"$f":"IF($E174<>\"\",MAX($A$1:INDIRECT(CONCATENATE(\"$A$\",ROW()-1)))+1,\"\")","v":""},"",null,"Manufacturer ............."]
[{"$f":"IF($E175<>\"\",MAX($A$1:INDIRECT(CONCATENATE(\"$A$\",ROW()-1)))+1,\"\")","v":""},""]
[{"$f":"IF($E176<>\"\",MAX($A$1:INDIRECT(CONCATENATE(\"$A$\",ROW()-1)))+1,\"\")","v":60},"A.60",null,"Model ....................","h",120]
[{"$f":"IF($E177<>\"\",MAX($A$1:INDIRECT(CONCATENATE(\"$A$\",ROW()-1)))+1,\"\")","v":""},""]
[{"$f":"IF($E178<>\"\",MAX($A$1:INDIRECT(CONCATENATE(\"$A$\",ROW()-1)))+1,\"\")","v":""},"",null,"Motor grader"]
[{"$f":"IF($E179<>\"\",MAX($A$1:INDIRECT(CONCATENATE(\"$A$\",ROW()-1)))+1,\"\")","v":""},""]
[{"$f":"IF($E180<>\"\",MAX($A$1:INDIRECT(CONCATENATE(\"$A$\",ROW()-1)))+1,\"\")","v":""},"",null,"Minimum power: 93 kW (similar to \"Cat 120B\")"]
[{"$f":"IF($E181<>\"\",MAX($A$1:INDIRECT(CONCATENATE(\"$A$\",ROW()-1)))+1,\"\")","v":""},""]
[{"$f":"IF($E182<>\"\",MAX($A$1:INDIRECT(CONCATENATE(\"$A$\",ROW()-1)))+1,\"\")","v":""},"",null,"Manufacturer ............."]
[{"$f":"IF($E183<>\"\",MAX($A$1:INDIRECT(CONCATENATE(\"$A$\",ROW()-1)))+1,\"\")","v":""},""]
[{"$f":"IF($E184<>\"\",MAX($A$1:INDIRECT(CONCATENATE(\"$A$\",ROW()-1)))+1,\"\")","v":61},"A.61",null,"Model .....................","h",120]
[{"$f":"IF($E185<>\"\",MAX($A$1:INDIRECT(CONCATENATE(\"$A$\",ROW()-1)))+1,\"\")","v":""},""]
[{"$f":"IF($E186<>\"\",MAX($A$1:INDIRECT(CONCATENATE(\"$A$\",ROW()-1)))+1,\"\")","v":""},"",null,"Excavator"]
[{"$f":"IF($E187<>\"\",MAX($A$1:INDIRECT(CONCATENATE(\"$A$\",ROW()-1)))+1,\"\")","v":""},""]
[{"$f":"IF($E188<>\"\",MAX($A$1:INDIRECT(CONCATENATE(\"$A$\",ROW()-1)))+1,\"\")","v":""},"",null,"Minimum power: 22 t"]
[{"$f":"IF($E189<>\"\",MAX($A$1:INDIRECT(CONCATENATE(\"$A$\",ROW()-1)))+1,\"\")","v":""},""]
[{"$f":"IF($E190<>\"\",MAX($A$1:INDIRECT(CONCATENATE(\"$A$\",ROW()-1)))+1,\"\")","v":""},"",null,"Manufacturer ............."]
[{"$f":"IF($E191<>\"\",MAX($A$1:INDIRECT(CONCATENATE(\"$A$\",ROW()-1)))+1,\"\")","v":""},""]
[{"$f":"IF($E192<>\"\",MAX($A$1:INDIRECT(CONCATENATE(\"$A$\",ROW()-1)))+1,\"\")","v":62},"A.62",null,"Model .....................","h",150]
[{"$f":"IF($E193<>\"\",MAX($A$1:INDIRECT(CONCATENATE(\"$A$\",ROW()-1)))+1,\"\")","v":""},""]
[{"$f":"IF($E194<>\"\",MAX($A$1:INDIRECT(CONCATENATE(\"$A$\",ROW()-1)))+1,\"\")","v":""},"",null,"Excavator"]
[{"$f":"IF($E195<>\"\",MAX($A$1:INDIRECT(CONCATENATE(\"$A$\",ROW()-1)))+1,\"\")","v":""},""]
[{"$f":"IF($E196<>\"\",MAX($A$1:INDIRECT(CONCATENATE(\"$A$\",ROW()-1)))+1,\"\")","v":""},"",null,"Minimum power: 33 t"]
[{"$f":"IF($E197<>\"\",MAX($A$1:INDIRECT(CONCATENATE(\"$A$\",ROW()-1)))+1,\"\")","v":""},""]
[{"$f":"IF($E198<>\"\",MAX($A$1:INDIRECT(CONCATENATE(\"$A$\",ROW()-1)))+1,\"\")","v":""},"",null,"Manufacturer ............."]
[{"$f":"IF($E199<>\"\",MAX($A$1:INDIRECT(CONCATENATE(\"$A$\",ROW()-1)))+1,\"\")","v":""},""]
[{"$f":"IF($E200<>\"\",MAX($A$1:INDIRECT(CONCATENATE(\"$A$\",ROW()-1)))+1,\"\")","v":63},"A.63",null,"Model .....................","h",300]
[{"$f":"IF($E201<>\"\",MAX($A$1:INDIRECT(CONCATENATE(\"$A$\",ROW()-1)))+1,\"\")","v":""},""]
[{"$f":"IF($E202<>\"\",MAX($A$1:INDIRECT(CONCATENATE(\"$A$\",ROW()-1)))+1,\"\")","v":""},"",null,"T.L. Backactor"]
[{"$f":"IF($E203<>\"\",MAX($A$1:INDIRECT(CONCATENATE(\"$A$\",ROW()-1)))+1,\"\")","v":""},""]
[{"$f":"IF($E204<>\"\",MAX($A$1:INDIRECT(CONCATENATE(\"$A$\",ROW()-1)))+1,\"\")","v":""},"",null,"Minimum power: 50 kW (similar to \"Case 580G\")"]
[{"$f":"IF($E205<>\"\",MAX($A$1:INDIRECT(CONCATENATE(\"$A$\",ROW()-1)))+1,\"\")","v":""},""]
[{"$f":"IF($E206<>\"\",MAX($A$1:INDIRECT(CONCATENATE(\"$A$\",ROW()-1)))+1,\"\")","v":""},"",null,"Manufacturer ............."]
[{"$f":"IF($E207<>\"\",MAX($A$1:INDIRECT(CONCATENATE(\"$A$\",ROW()-1)))+1,\"\")","v":""},""]
[{"$f":"IF($E208<>\"\",MAX($A$1:INDIRECT(CONCATENATE(\"$A$\",ROW()-1)))+1,\"\")","v":64},"A.64",null,"Model .....................","h",160]
[{"$f":"IF($E209<>\"\",MAX($A$1:INDIRECT(CONCATENATE(\"$A$\",ROW()-1)))+1,\"\")","v":""},""]
[{"$f":"IF($E210<>\"\",MAX($A$1:INDIRECT(CONCATENATE(\"$A$\",ROW()-1)))+1,\"\")","v":""},"",null,"Front-end loader"]
[{"$f":"IF($E211<>\"\",MAX($A$1:INDIRECT(CONCATENATE(\"$A$\",ROW()-1)))+1,\"\")","v":""},""]
[{"$f":"IF($E212<>\"\",MAX($A$1:INDIRECT(CONCATENATE(\"$A$\",ROW()-1)))+1,\"\")","v":""},"",null,"Minimum power: 145 kW (22 t)"]
[{"$f":"IF($E213<>\"\",MAX($A$1:INDIRECT(CONCATENATE(\"$A$\",ROW()-1)))+1,\"\")","v":""},""]
[{"$f":"IF($E214<>\"\",MAX($A$1:INDIRECT(CONCATENATE(\"$A$\",ROW()-1)))+1,\"\")","v":""},"",null,"Manufacturer ............."]
[]
[]
[]
[]
[{"$f":"IF($E219<>\"\",MAX($A$1:INDIRECT(CONCATENATE(\"$A$\",ROW()-1)))+1,\"\")","v":""},{"$f":"IF(A219<>\"\",$A$3&A219,\"\")","v":""},null," Carried forward / …"]
[{"$f":"IF($E220<>\"\",MAX($A$1:INDIRECT(CONCATENATE(\"$A$\",ROW()-1)))+1,\"\")","v":""},"",null," Brought forward / …"]
[]
[{"$f":"IF($E222<>\"\",MAX($A$1:INDIRECT(CONCATENATE(\"$A$\",ROW()-1)))+1,\"\")","v":65},"A.65",null,"Model .....................","h",160]
[{"$f":"IF($E223<>\"\",MAX($A$1:INDIRECT(CONCATENATE(\"$A$\",ROW()-1)))+1,\"\")","v":""},""]
[{"$f":"IF($E224<>\"\",MAX($A$1:INDIRECT(CONCATENATE(\"$A$\",ROW()-1)))+1,\"\")","v":""},"",null,"Vibrating plate compactor"]
[{"$f":"IF($E225<>\"\",MAX($A$1:INDIRECT(CONCATENATE(\"$A$\",ROW()-1)))+1,\"\")","v":""},""]
[{"$f":"IF($E226<>\"\",MAX($A$1:INDIRECT(CONCATENATE(\"$A$\",ROW()-1)))+1,\"\")","v":""},"",null,"Minimum power: 2 kW"]
[{"$f":"IF($E227<>\"\",MAX($A$1:INDIRECT(CONCATENATE(\"$A$\",ROW()-1)))+1,\"\")","v":""},""]
[{"$f":"IF($E228<>\"\",MAX($A$1:INDIRECT(CONCATENATE(\"$A$\",ROW()-1)))+1,\"\")","v":""},"",null,"Manufacturer .............."]
[{"$f":"IF($E229<>\"\",MAX($A$1:INDIRECT(CONCATENATE(\"$A$\",ROW()-1)))+1,\"\")","v":""},""]
[{"$f":"IF($E230<>\"\",MAX($A$1:INDIRECT(CONCATENATE(\"$A$\",ROW()-1)))+1,\"\")","v":66},"A.66",null,"Model .....................","h",300]
[{"$f":"IF($E231<>\"\",MAX($A$1:INDIRECT(CONCATENATE(\"$A$\",ROW()-1)))+1,\"\")","v":""},""]
[{"$f":"IF($E232<>\"\",MAX($A$1:INDIRECT(CONCATENATE(\"$A$\",ROW()-1)))+1,\"\")","v":""},{"$f":"IF(A232<>\"\",$A$3&A232,\"\")","v":""},null,"Tip truck"]
[{"$f":"IF($E233<>\"\",MAX($A$1:INDIRECT(CONCATENATE(\"$A$\",ROW()-1)))+1,\"\")","v":""},""]
[{"$f":"IF($E234<>\"\",MAX($A$1:INDIRECT(CONCATENATE(\"$A$\",ROW()-1)))+1,\"\")","v":67},"A.67",null,"Minimum load mass: 10 t Minimum load capacity: 6m3","h",120]
[{"$f":"IF($E235<>\"\",MAX($A$1:INDIRECT(CONCATENATE(\"$A$\",ROW()-1)))+1,\"\")","v":""},""]
[{"$f":"IF($E236<>\"\",MAX($A$1:INDIRECT(CONCATENATE(\"$A$\",ROW()-1)))+1,\"\")","v":""},"",null,"Water tank truck, with sprinkler"]
[{"$f":"IF($E237<>\"\",MAX($A$1:INDIRECT(CONCATENATE(\"$A$\",ROW()-1)))+1,\"\")","v":""},""]
[{"$f":"IF($E238<>\"\",MAX($A$1:INDIRECT(CONCATENATE(\"$A$\",ROW()-1)))+1,\"\")","v":68},"A.68",null,"Minimum capacity: 10 kl","h",300]
[{"$f":"IF($E239<>\"\",MAX($A$1:INDIRECT(CONCATENATE(\"$A$\",ROW()-1)))+1,\"\")","v":""},""]
[{"$f":"IF($E240<>\"\",MAX($A$1:INDIRECT(CONCATENATE(\"$A$\",ROW()-1)))+1,\"\")","v":""},"",null,"Mobile crane"]
[{"$f":"IF($E241<>\"\",MAX($A$1:INDIRECT(CONCATENATE(\"$A$\",ROW()-1)))+1,\"\")","v":""},""]
[{"$f":"IF($E242<>\"\",MAX($A$1:INDIRECT(CONCATENATE(\"$A$\",ROW()-1)))+1,\"\")","v":""},"",null,"Minimum capacity: 10 t"]
[{"$f":"IF($E243<>\"\",MAX($A$1:INDIRECT(CONCATENATE(\"$A$\",ROW()-1)))+1,\"\")","v":""},""]
[{"$f":"IF($E244<>\"\",MAX($A$1:INDIRECT(CONCATENATE(\"$A$\",ROW()-1)))+1,\"\")","v":""},"",null,"Manufacturer ............."]
[{"$f":"IF($E245<>\"\",MAX($A$1:INDIRECT(CONCATENATE(\"$A$\",ROW()-1)))+1,\"\")","v":""},""]
[{"$f":"IF($E246<>\"\",MAX($A$1:INDIRECT(CONCATENATE(\"$A$\",ROW()-1)))+1,\"\")","v":69},"A.69",null,"Model ....................","h",40]
[{"$f":"IF($E247<>\"\",MAX($A$1:INDIRECT(CONCATENATE(\"$A$\",ROW()-1)))+1,\"\")","v":""},""]
[{"$f":"IF($E248<>\"\",MAX($A$1:INDIRECT(CONCATENATE(\"$A$\",ROW()-1)))+1,\"\")","v":""},"",null,"Mobile crane"]
[{"$f":"IF($E249<>\"\",MAX($A$1:INDIRECT(CONCATENATE(\"$A$\",ROW()-1)))+1,\"\")","v":""},""]
[{"$f":"IF($E250<>\"\",MAX($A$1:INDIRECT(CONCATENATE(\"$A$\",ROW()-1)))+1,\"\")","v":""},"",null,"Minimum capacity: 30 t"]
[{"$f":"IF($E251<>\"\",MAX($A$1:INDIRECT(CONCATENATE(\"$A$\",ROW()-1)))+1,\"\")","v":""},""]
[{"$f":"IF($E252<>\"\",MAX($A$1:INDIRECT(CONCATENATE(\"$A$\",ROW()-1)))+1,\"\")","v":""},"",null,"Manufacturer ............."]
[{"$f":"IF($E253<>\"\",MAX($A$1:INDIRECT(CONCATENATE(\"$A$\",ROW()-1)))+1,\"\")","v":""},""]
[{"$f":"IF($E254<>\"\",MAX($A$1:INDIRECT(CONCATENATE(\"$A$\",ROW()-1)))+1,\"\")","v":70},"A.70",null,"Model ....................","h",170]
[{"$f":"IF($E255<>\"\",MAX($A$1:INDIRECT(CONCATENATE(\"$A$\",ROW()-1)))+1,\"\")","v":""},""]
[{"$f":"IF($E256<>\"\",MAX($A$1:INDIRECT(CONCATENATE(\"$A$\",ROW()-1)))+1,\"\")","v":""},"",null,"Sludge pump, 100mm dia with hoses"]
[{"$f":"IF($E257<>\"\",MAX($A$1:INDIRECT(CONCATENATE(\"$A$\",ROW()-1)))+1,\"\")","v":""},""]
[{"$f":"IF($E258<>\"\",MAX($A$1:INDIRECT(CONCATENATE(\"$A$\",ROW()-1)))+1,\"\")","v":""},"",null,"Minimum output power: 10 kW"]
[{"$f":"IF($E259<>\"\",MAX($A$1:INDIRECT(CONCATENATE(\"$A$\",ROW()-1)))+1,\"\")","v":""},""]
[{"$f":"IF($E260<>\"\",MAX($A$1:INDIRECT(CONCATENATE(\"$A$\",ROW()-1)))+1,\"\")","v":71},"A.71",null,"Manufacturer ..............","h",120]
[{"$f":"IF($E261<>\"\",MAX($A$1:INDIRECT(CONCATENATE(\"$A$\",ROW()-1)))+1,\"\")","v":""},""]
[{"$f":"IF($E262<>\"\",MAX($A$1:INDIRECT(CONCATENATE(\"$A$\",ROW()-1)))+1,\"\")","v":""},"",null,"Dewatering "]
[{"$f":"IF($E263<>\"\",MAX($A$1:INDIRECT(CONCATENATE(\"$A$\",ROW()-1)))+1,\"\")","v":""},""]
[{"$f":"IF($E264<>\"\",MAX($A$1:INDIRECT(CONCATENATE(\"$A$\",ROW()-1)))+1,\"\")","v":""},"",null,"Minimum output power: 15 kW (solids handling)"]
[{"$f":"IF($E265<>\"\",MAX($A$1:INDIRECT(CONCATENATE(\"$A$\",ROW()-1)))+1,\"\")","v":""},""]
[{"$f":"IF($E266<>\"\",MAX($A$1:INDIRECT(CONCATENATE(\"$A$\",ROW()-1)))+1,\"\")","v":""},"",null,"Manufacturer .............."]
[]
[]
[]
[]
[]
[{"$f":"IF($E272<>\"\",MAX($A$1:INDIRECT(CONCATENATE(\"$A$\",ROW()-1)))+1,\"\")","v":""},{"$f":"IF(A272<>\"\",$A$3&A272,\"\")","v":""},null," Carried forward / …"]
[{"$f":"IF($E273<>\"\",MAX($A$1:INDIRECT(CONCATENATE(\"$A$\",ROW()-1)))+1,\"\")","v":""},"",null," Brought forward / …"]
[]
[{"$f":"IF($E275<>\"\",MAX($A$1:INDIRECT(CONCATENATE(\"$A$\",ROW()-1)))+1,\"\")","v":72},"A.72",null,"Model .....................","h",120]
[{"$f":"IF($E276<>\"\",MAX($A$1:INDIRECT(CONCATENATE(\"$A$\",ROW()-1)))+1,\"\")","v":""},""]
[{"$f":"IF($E277<>\"\",MAX($A$1:INDIRECT(CONCATENATE(\"$A$\",ROW()-1)))+1,\"\")","v":""},"",null,"Generating set"]
[{"$f":"IF($E278<>\"\",MAX($A$1:INDIRECT(CONCATENATE(\"$A$\",ROW()-1)))+1,\"\")","v":""},""]
[{"$f":"IF($E279<>\"\",MAX($A$1:INDIRECT(CONCATENATE(\"$A$\",ROW()-1)))+1,\"\")","v":""},"",null,"Minimum output power: 10 kW"]
[{"$f":"IF($E280<>\"\",MAX($A$1:INDIRECT(CONCATENATE(\"$A$\",ROW()-1)))+1,\"\")","v":""},""]
[{"$f":"IF($E281<>\"\",MAX($A$1:INDIRECT(CONCATENATE(\"$A$\",ROW()-1)))+1,\"\")","v":""},"",null,"Manufacturer .............."]
[{"$f":"IF($E282<>\"\",MAX($A$1:INDIRECT(CONCATENATE(\"$A$\",ROW()-1)))+1,\"\")","v":""},""]
[{"$f":"IF($E283<>\"\",MAX($A$1:INDIRECT(CONCATENATE(\"$A$\",ROW()-1)))+1,\"\")","v":73},"A.73",null,"Model .....................","h",80]
[{"$f":"IF($E284<>\"\",MAX($A$1:INDIRECT(CONCATENATE(\"$A$\",ROW()-1)))+1,\"\")","v":""},""]
[{"$f":"IF($E285<>\"\",MAX($A$1:INDIRECT(CONCATENATE(\"$A$\",ROW()-1)))+1,\"\")","v":""},"",null,"Plant hired by the Contractor"]
[{"$f":"IF($E286<>\"\",MAX($A$1:INDIRECT(CONCATENATE(\"$A$\",ROW()-1)))+1,\"\")","v":""},""]
[{"$f":"IF($E287<>\"\",MAX($A$1:INDIRECT(CONCATENATE(\"$A$\",ROW()-1)))+1,\"\")","v":74},"A.74",null,"Net cost of hired plant","Prov Sum","-","-",400000]
[{"$f":"IF($E288<>\"\",MAX($A$1:INDIRECT(CONCATENATE(\"$A$\",ROW()-1)))+1,\"\")","v":""},""]
[{"$f":"IF($E289<>\"\",MAX($A$1:INDIRECT(CONCATENATE(\"$A$\",ROW()-1)))+1,\"\")","v":75},"A.75","   ","Percentage adjustment on the item above for Contractor's overheads and profit (State % and extend as an amount)","   %",400000]
[{"$f":"IF($E290<>\"\",MAX($A$1:INDIRECT(CONCATENATE(\"$A$\",ROW()-1)))+1,\"\")","v":""},""]
[{"$f":"IF($E291<>\"\",MAX($A$1:INDIRECT(CONCATENATE(\"$A$\",ROW()-1)))+1,\"\")","v":""},"",null,"Environmental management"]
[{"$f":"IF($E292<>\"\",MAX($A$1:INDIRECT(CONCATENATE(\"$A$\",ROW()-1)))+1,\"\")","v":""},""]
[{"$f":"IF($E293<>\"\",MAX($A$1:INDIRECT(CONCATENATE(\"$A$\",ROW()-1)))+1,\"\")","v":76},"A.76","PSA 8.13","Compliance with Enviromental Management Plan","Sum","-","-"]
[{"$f":"IF($E294<>\"\",MAX($A$1:INDIRECT(CONCATENATE(\"$A$\",ROW()-1)))+1,\"\")","v":""},""]
[{"$f":"IF($E295<>\"\",MAX($A$1:INDIRECT(CONCATENATE(\"$A$\",ROW()-1)))+1,\"\")","v":77},"A.77","PSA 8.10\nPSA 8.5.1","Environmental rehabiliation where required by the Engineer and Employer not covered under the specifications","Prov Sum","-","-",80000]
[{"$f":"IF($E296<>\"\",MAX($A$1:INDIRECT(CONCATENATE(\"$A$\",ROW()-1)))+1,\"\")","v":""},{"$f":"IF(A296<>\"\",$A$3&A296,\"\")","v":""}]
[{"$f":"IF($E297<>\"\",MAX($A$1:INDIRECT(CONCATENATE(\"$A$\",ROW()-1)))+1,\"\")","v":78},"A.78",null,"Percentage adjustment on the item above for Contractor's overheads and profit (State % and extend as an amount)","   %",80000]
[{"$f":"IF($E298<>\"\",MAX($A$1:INDIRECT(CONCATENATE(\"$A$\",ROW()-1)))+1,\"\")","v":""},""]
[{"$f":"IF($E299<>\"\",MAX($A$1:INDIRECT(CONCATENATE(\"$A$\",ROW()-1)))+1,\"\")","v":79},"A.79","PSA 8.10\nPSA 8.5.1","Environmental Control Officer","Prov Sum","-","-",180000]
[{"$f":"IF($E300<>\"\",MAX($A$1:INDIRECT(CONCATENATE(\"$A$\",ROW()-1)))+1,\"\")","v":""},""]
[{"$f":"IF($E301<>\"\",MAX($A$1:INDIRECT(CONCATENATE(\"$A$\",ROW()-1)))+1,\"\")","v":80},"A.80",null,"Percentage adjustment on the item above for Contractor's overheads and profit (State % and extend as an amount)","%",180000]
[{"$f":"IF($E302<>\"\",MAX($A$1:INDIRECT(CONCATENATE(\"$A$\",ROW()-1)))+1,\"\")","v":""},""]
[{"$f":"IF($E303<>\"\",MAX($A$1:INDIRECT(CONCATENATE(\"$A$\",ROW()-1)))+1,\"\")","v":""},"",null,"Miscellaneous"]
[{"$f":"IF($E304<>\"\",MAX($A$1:INDIRECT(CONCATENATE(\"$A$\",ROW()-1)))+1,\"\")","v":""},""]
[{"$f":"IF($E305<>\"\",MAX($A$1:INDIRECT(CONCATENATE(\"$A$\",ROW()-1)))+1,\"\")","v":81},"A.81","PSA 8.8.8","Survey for and preparation of as-built data","Sum","-","-"]
[{"$f":"IF($E306<>\"\",MAX($A$1:INDIRECT(CONCATENATE(\"$A$\",ROW()-1)))+1,\"\")","v":""},""]
[{"$f":"IF($E307<>\"\",MAX($A$1:INDIRECT(CONCATENATE(\"$A$\",ROW()-1)))+1,\"\")","v":82},"A.82","PSA 8.9","Obtain all wayleaves from the relevant service authorities (e.g. Eskom, Telkom, etc.)","Sum","-","-"]
[{"$f":"IF($E308<>\"\",MAX($A$1:INDIRECT(CONCATENATE(\"$A$\",ROW()-1)))+1,\"\")","v":""},""]
[{"$f":"IF($E309<>\"\",MAX($A$1:INDIRECT(CONCATENATE(\"$A$\",ROW()-1)))+1,\"\")","v":83},"A.83","PSA 8.14","Quaility management plan by Contractor","Sum","-","-"]
[{"$f":"IF($E310<>\"\",MAX($A$1:INDIRECT(CONCATENATE(\"$A$\",ROW()-1)))+1,\"\")","v":""},""]
[{"$f":"IF($E311<>\"\",MAX($A$1:INDIRECT(CONCATENATE(\"$A$\",ROW()-1)))+1,\"\")","v":84},"A.84","PSA 8.11","Provision of Security Personnel","Month",18]
[{"$f":"IF($E312<>\"\",MAX($A$1:INDIRECT(CONCATENATE(\"$A$\",ROW()-1)))+1,\"\")","v":""},""]
[{"$f":"IF($E313<>\"\",MAX($A$1:INDIRECT(CONCATENATE(\"$A$\",ROW()-1)))+1,\"\")","v":85},"A.85","PSA 8.10","Dealing with the Aquatic mitigation measures required in Specifications","Month",18]
[{"$f":"IF($E314<>\"\",MAX($A$1:INDIRECT(CONCATENATE(\"$A$\",ROW()-1)))+1,\"\")","v":""},""]
[{"$f":"IF($E315<>\"\",MAX($A$1:INDIRECT(CONCATENATE(\"$A$\",ROW()-1)))+1,\"\")","v":""},"",null," Carried forward / …"]
[{"$f":"IF($E316<>\"\",MAX($A$1:INDIRECT(CONCATENATE(\"$A$\",ROW()-1)))+1,\"\")","v":""},"",null," Brought forward / …"]
[{"$f":"IF($E317<>\"\",MAX($A$1:INDIRECT(CONCATENATE(\"$A$\",ROW()-1)))+1,\"\")","v":""},""]
[{"$f":"IF($E318<>\"\",MAX($A$1:INDIRECT(CONCATENATE(\"$A$\",ROW()-1)))+1,\"\")","v":86},"A.86","PSA 8.10","Dealing with the Heritage mitigation measures required in Specifications","Month",18]
[{"$f":"IF($E319<>\"\",MAX($A$1:INDIRECT(CONCATENATE(\"$A$\",ROW()-1)))+1,\"\")","v":""},""]
[{"$f":"IF($E320<>\"\",MAX($A$1:INDIRECT(CONCATENATE(\"$A$\",ROW()-1)))+1,\"\")","v":87},"A.87","PSA 8.10","Dealing with the Geomorphological mitigation measures required in Specifications","Month",18]
[{"$f":"IF($E321<>\"\",MAX($A$1:INDIRECT(CONCATENATE(\"$A$\",ROW()-1)))+1,\"\")","v":""},""]
[{"$f":"IF($E322<>\"\",MAX($A$1:INDIRECT(CONCATENATE(\"$A$\",ROW()-1)))+1,\"\")","v":88},"A.88","PSA 8.10","Dealing with the Botanical mitigation measures required in Specifications","Month",18]
[{"$f":"IF($E323<>\"\",MAX($A$1:INDIRECT(CONCATENATE(\"$A$\",ROW()-1)))+1,\"\")","v":""},""]
[{"$f":"IF($E324<>\"\",MAX($A$1:INDIRECT(CONCATENATE(\"$A$\",ROW()-1)))+1,\"\")","v":89},"A.89","PSA 8.10\nPSA 8.5.1","Occupational Health & Safety Training requested by the Employer or additional requirements not covered in the scope","Prov Sum","-","-",180000]
[{"$f":"IF($E325<>\"\",MAX($A$1:INDIRECT(CONCATENATE(\"$A$\",ROW()-1)))+1,\"\")","v":""},""]
[{"$f":"IF($E326<>\"\",MAX($A$1:INDIRECT(CONCATENATE(\"$A$\",ROW()-1)))+1,\"\")","v":90},"A.90",null,"Percentage adjustment on the item above for Contractor's overheads and profit (State % and extend as an amount)","%",180000]
[{"$f":"IF($E327<>\"\",MAX($A$1:INDIRECT(CONCATENATE(\"$A$\",ROW()-1)))+1,\"\")","v":""},""]
[{"$f":"IF($E328<>\"\",MAX($A$1:INDIRECT(CONCATENATE(\"$A$\",ROW()-1)))+1,\"\")","v":91},"A.91","PSA 8.10\nPSA 8.5.1","Stakeholder management and community facilitator","Prov Sum","-","-",200000]
[{"$f":"IF($E329<>\"\",MAX($A$1:INDIRECT(CONCATENATE(\"$A$\",ROW()-1)))+1,\"\")","v":""},""]
[{"$f":"IF($E330<>\"\",MAX($A$1:INDIRECT(CONCATENATE(\"$A$\",ROW()-1)))+1,\"\")","v":92},"A.92",null,"Percentage adjustment on the item above for Contractor's overheads and profit (State % and extend as an amount)","%",{"$f":"H328","v":200000}]
[{"$f":"IF($E331<>\"\",MAX($A$1:INDIRECT(CONCATENATE(\"$A$\",ROW()-1)))+1,\"\")","v":""},""]
[{"$f":"IF($E332<>\"\",MAX($A$1:INDIRECT(CONCATENATE(\"$A$\",ROW()-1)))+1,\"\")","v":93},"A.93","PSA 8.10\nPSA 8.5.1","Additional laboratory testing where instructed by Employer or Engineer","Prov Sum","-","-",250000]
[{"$f":"IF($E333<>\"\",MAX($A$1:INDIRECT(CONCATENATE(\"$A$\",ROW()-1)))+1,\"\")","v":""},""]
[{"$f":"IF($E334<>\"\",MAX($A$1:INDIRECT(CONCATENATE(\"$A$\",ROW()-1)))+1,\"\")","v":94},"A.94",null,"Percentage adjustment on the item above for Contractor's overheads and profit (State % and extend as an amount)","%",250000]
[{"$f":"IF($E335<>\"\",MAX($A$1:INDIRECT(CONCATENATE(\"$A$\",ROW()-1)))+1,\"\")","v":""},""]
[{"$f":"IF($E336<>\"\",MAX($A$1:INDIRECT(CONCATENATE(\"$A$\",ROW()-1)))+1,\"\")","v":95},"A.95","PSA 8.10\nPSA 8.5.1","Training as instructed by the Employer","Prov Sum","-","-",100000]
[{"$f":"IF($E337<>\"\",MAX($A$1:INDIRECT(CONCATENATE(\"$A$\",ROW()-1)))+1,\"\")","v":""},""]
[{"$f":"IF($E338<>\"\",MAX($A$1:INDIRECT(CONCATENATE(\"$A$\",ROW()-1)))+1,\"\")","v":96},"A.96",null,"Percentage adjustment on the item above for Contractor's overheads and profit (State % and extend as an amount)","%",100000]
[{"$f":"IF($E339<>\"\",MAX($A$1:INDIRECT(CONCATENATE(\"$A$\",ROW()-1)))+1,\"\")","v":""},""]
[{"$f":"IF($E340<>\"\",MAX($A$1:INDIRECT(CONCATENATE(\"$A$\",ROW()-1)))+1,\"\")","v":97},"A.97","PSA 8.10\nPSA 8.5.1","Institutional Social Development ","Prov Sum","-","-",180000]
[{"$f":"IF($E341<>\"\",MAX($A$1:INDIRECT(CONCATENATE(\"$A$\",ROW()-1)))+1,\"\")","v":""},""]
[{"$f":"IF($E342<>\"\",MAX($A$1:INDIRECT(CONCATENATE(\"$A$\",ROW()-1)))+1,\"\")","v":98},"A.98",null,"Percentage adjustment on the item above for Contractor's overheads and profit (State % and extend as an amount)","%",180000]
[{"$f":"IF($E343<>\"\",MAX($A$1:INDIRECT(CONCATENATE(\"$A$\",ROW()-1)))+1,\"\")","v":""},""]
[{"$f":"IF($E344<>\"\",MAX($A$1:INDIRECT(CONCATENATE(\"$A$\",ROW()-1)))+1,\"\")","v":99},"A.99","PSA 8.10\nPSA 8.5.1","Engineer and specialist construction monitoring fee on behalf of the Employer","Prov Sum","-","-",8700000]
[{"$f":"IF($E345<>\"\",MAX($A$1:INDIRECT(CONCATENATE(\"$A$\",ROW()-1)))+1,\"\")","v":""},""]
[{"$f":"IF($E346<>\"\",MAX($A$1:INDIRECT(CONCATENATE(\"$A$\",ROW()-1)))+1,\"\")","v":100},"A.100",null,"Percentage adjustment on the item above for Contractor's overheads and profit (State % and extend as an amount)","%",{"$f":"H344","v":8700000}]
[]
[{"$f":"IF($E348<>\"\",MAX($A$1:INDIRECT(CONCATENATE(\"$A$\",ROW()-1)))+1,\"\")","v":""},""]
[{"$f":"IF($E349<>\"\",MAX($A$1:INDIRECT(CONCATENATE(\"$A$\",ROW()-1)))+1,\"\")","v":""},null,null," TOTAL SECTION A\n Carried to Summary",null,null,"R"]

{"sheet":"Civil Works Flysheet","index":3,"n_rows":22,"n_cols":1,"rows_kept":22,"cut":false,"hidden":false,"merged":[[21,0,21,9]]}
[]
[]
[]
[]
[]
[]
[]
[]
[]
[]
[]
[]
[]
[]
[]
[]
[]
[]
[]
[]
[]
["Civil Works"]

{"sheet":"Section C1","index":4,"n_rows":668,"n_cols":12,"rows_kept":668,"cut":false,"hidden":false,"merged":[]}
["Item No","Item No","Payment Clause","Short Description","Unit","Quantity","Rate","Amount\n R             c"]
[]
["C1.",null,"SANS","SECTION: C1"]
[null,null,"1200 C","DN 700 STEEL PIPELINE"]
[]
[{"$f":"IF($E6<>\"\",MAX($A$1:INDIRECT(CONCATENATE(\"$A$\",ROW()-1)))+1,\"\")","v":""},{"$f":"IF(A6<>\"\",$A$3&A6,\"\")","v":""},null,"Excavation for DN 700 Steel Pipeline"]
[{"$f":"IF($E7<>\"\",MAX($A$1:INDIRECT(CONCATENATE(\"$A$\",ROW()-1)))+1,\"\")","v":""},""]
[{"$f":"IF($E8<>\"\",MAX($A$1:INDIRECT(CONCATENATE(\"$A$\",ROW()-1)))+1,\"\")","v":""},"",null,"Site Clearance"]
[{"$f":"IF($E9<>\"\",MAX($A$1:INDIRECT(CONCATENATE(\"$A$\",ROW()-1)))+1,\"\")","v":""},""]
[{"$f":"IF($E10<>\"\",MAX($A$1:INDIRECT(CONCATENATE(\"$A$\",ROW()-1)))+1,\"\")","v":1},"C1.1","8.2.1\nPSC 8.2.1","Clear and grub vegetation and trees including tree stumps up to 25m wide strip (Max. tree girth 1m)","m2",346000]
[{"$f":"IF($E11<>\"\",MAX($A$1:INDIRECT(CONCATENATE(\"$A$\",ROW()-1)))+1,\"\")","v":""},""]
[{"$f":"IF($E12<>\"\",MAX($A$1:INDIRECT(CONCATENATE(\"$A$\",ROW()-1)))+1,\"\")","v":""},"","8.2.2","Remove and grub trees and tree stumps of girth"]
[{"$f":"IF($E13<>\"\",MAX($A$1:INDIRECT(CONCATENATE(\"$A$\",ROW()-1)))+1,\"\")","v":""},""]
[{"$f":"IF($E14<>\"\",MAX($A$1:INDIRECT(CONCATENATE(\"$A$\",ROW()-1)))+1,\"\")","v":""},"",null,"Over      and       Up to"]
[{"$f":"IF($E15<>\"\",MAX($A$1:INDIRECT(CONCATENATE(\"$A$\",ROW()-1)))+1,\"\")","v":""},""]
[{"$f":"IF($E16<>\"\",MAX($A$1:INDIRECT(CONCATENATE(\"$A$\",ROW()-1)))+1,\"\")","v":2},"C1.2",null,"1 m                      2 m","No",30]
[{"$f":"IF($E17<>\"\",MAX($A$1:INDIRECT(CONCATENATE(\"$A$\",ROW()-1)))+1,\"\")","v":""},"",null,null,null,null,null,null,null,null,null," "]
[{"$f":"IF($E18<>\"\",MAX($A$1:INDIRECT(CONCATENATE(\"$A$\",ROW()-1)))+1,\"\")","v":3},"C1.3",null,"2 m                      3 m","No",10]
[{"$f":"IF($E19<>\"\",MAX($A$1:INDIRECT(CONCATENATE(\"$A$\",ROW()-1)))+1,\"\")","v":""},"",null,null,null,null," "," "]
[{"$f":"IF($E20<>\"\",MAX($A$1:INDIRECT(CONCATENATE(\"$A$\",ROW()-1)))+1,\"\")","v":4},"C1.4","PSC 8.2.11","Take down existing fence and reinstate (stock fence up to 1.8 m high)","m",3000]
[{"$f":"IF($E21<>\"\",MAX($A$1:INDIRECT(CONCATENATE(\"$A$\",ROW()-1)))+1,\"\")","v":""},""]
[{"$f":"IF($E22<>\"\",MAX($A$1:INDIRECT(CONCATENATE(\"$A$\",ROW()-1)))+1,\"\")","v":5},"C1.5","PSC 8.2.10","Remove 150 mm thick layer of topsoil to stockpile and maintain","m³",51870]
[{"$f":"IF($E23<>\"\",MAX($A$1:INDIRECT(CONCATENATE(\"$A$\",ROW()-1)))+1,\"\")","v":""},"",null,null,null,"."]
[{"$f":"IF($E24<>\"\",MAX($A$1:INDIRECT(CONCATENATE(\"$A$\",ROW()-1)))+1,\"\")","v":6},"C1.6","1200 D\n8.3.10\nPSD 8.3.10","Topsoiling","m²",346000]
[{"$f":"IF($E25<>\"\",MAX($A$1:INDIRECT(CONCATENATE(\"$A$\",ROW()-1)))+1,\"\")","v":""},""]
[{"$f":"IF($E26<>\"\",MAX($A$1:INDIRECT(CONCATENATE(\"$A$\",ROW()-1)))+1,\"\")","v":7},"C1.7","1200 A\nPSA 8.10","Temporary fencing where existing fencing has been taken down","m",2000]
[{"$f":"IF($E27<>\"\",MAX($A$1:INDIRECT(CONCATENATE(\"$A$\",ROW()-1)))+1,\"\")","v":""},""," "]
[{"$f":"IF($E28<>\"\",MAX($A$1:INDIRECT(CONCATENATE(\"$A$\",ROW()-1)))+1,\"\")","v":""},"","1200 DB ","EARTHWORKS"]
[{"$f":"IF($E29<>\"\",MAX($A$1:INDIRECT(CONCATENATE(\"$A$\",ROW()-1)))+1,\"\")","v":""},""]
[{"$f":"IF($E30<>\"\",MAX($A$1:INDIRECT(CONCATENATE(\"$A$\",ROW()-1)))+1,\"\")","v":""},"",null,"Trench Excavation"]
[{"$f":"IF($E31<>\"\",MAX($A$1:INDIRECT(CONCATENATE(\"$A$\",ROW()-1)))+1,\"\")","v":""},""]
[{"$f":"IF($E32<>\"\",MAX($A$1:INDIRECT(CONCATENATE(\"$A$\",ROW()-1)))+1,\"\")","v":""},"","8.3.2\nPSDB 8.3.2\nPSDB 8.3.3","Excavate in all materials for trenches, backfill, compact and disposal of surplus  material for:"]
[{"$f":"IF($E33<>\"\",MAX($A$1:INDIRECT(CONCATENATE(\"$A$\",ROW()-1)))+1,\"\")","v":""},""]
[{"$f":"IF($E34<>\"\",MAX($A$1:INDIRECT(CONCATENATE(\"$A$\",ROW()-1)))+1,\"\")","v":""},""," ","Pipes of up to DN 700 mm for depths:"]
[{"$f":"IF($E35<>\"\",MAX($A$1:INDIRECT(CONCATENATE(\"$A$\",ROW()-1)))+1,\"\")","v":""},""]
[{"$f":"IF($E36<>\"\",MAX($A$1:INDIRECT(CONCATENATE(\"$A$\",ROW()-1)))+1,\"\")","v":""},"",null,"Over      and       Up to"]
[{"$f":"IF($E37<>\"\",MAX($A$1:INDIRECT(CONCATENATE(\"$A$\",ROW()-1)))+1,\"\")","v":""},""]
[{"$f":"IF($E38<>\"\",MAX($A$1:INDIRECT(CONCATENATE(\"$A$\",ROW()-1)))+1,\"\")","v":8},"C1.8",null,"0 m                      2,0 m","  m",9815]
[{"$f":"IF($E39<>\"\",MAX($A$1:INDIRECT(CONCATENATE(\"$A$\",ROW()-1)))+1,\"\")","v":""},""]
[{"$f":"IF($E40<>\"\",MAX($A$1:INDIRECT(CONCATENATE(\"$A$\",ROW()-1)))+1,\"\")","v":9},"C1.9",null,"2,0 m                   3,0 m","  m",3828]
[]
[{"$f":"IF($E42<>\"\",MAX($A$1:INDIRECT(CONCATENATE(\"$A$\",ROW()-1)))+1,\"\")","v":10},"C1.10",null,"3,0 m                   4,0 m","  m",168]
[{"$f":"IF($E43<>\"\",MAX($A$1:INDIRECT(CONCATENATE(\"$A$\",ROW()-1)))+1,\"\")","v":""},""]
[{"$f":"IF($E44<>\"\",MAX($A$1:INDIRECT(CONCATENATE(\"$A$\",ROW()-1)))+1,\"\")","v":11},"C1.11",null,"4,0 m                   5,0 m","  m",20]
[]
[{"$f":"IF($E46<>\"\",MAX($A$1:INDIRECT(CONCATENATE(\"$A$\",ROW()-1)))+1,\"\")","v":""},""]
[]
[{"$f":"IF($E48<>\"\",MAX($A$1:INDIRECT(CONCATENATE(\"$A$\",ROW()-1)))+1,\"\")","v":""},{"$f":"IF(A48<>\"\",$A$3&A48,\"\")","v":""},null," Carried forward / …"]
[{"$f":"IF($E49<>\"\",MAX($A$1:INDIRECT(CONCATENATE(\"$A$\",ROW()-1)))+1,\"\")","v":""},"",null," Brought forward / …"]
[]
[{"$f":"IF($E51<>\"\",MAX($A$1:INDIRECT(CONCATENATE(\"$A$\",ROW()-1)))+1,\"\")","v":""},"","8.3.2\nPSD 8.3.2","Extra Over Items C1.8-C1.11 Trench Excavations above:"]
[{"$f":"IF($E52<>\"\",MAX($A$1:INDIRECT(CONCATENATE(\"$A$\",ROW()-1)))+1,\"\")","v":""},""]
[{"$f":"IF($E53<>\"\",MAX($A$1:INDIRECT(CONCATENATE(\"$A$\",ROW()-1)))+1,\"\")","v":12},"C1.12"," ","Hard rock excavation","m3",5173]
[{"$f":"IF($E54<>\"\",MAX($A$1:INDIRECT(CONCATENATE(\"$A$\",ROW()-1)))+1,\"\")","v":""},""]
[{"$f":"IF($E55<>\"\",MAX($A$1:INDIRECT(CONCATENATE(\"$A$\",ROW()-1)))+1,\"\")","v":13},"C1.13",null,"Blasting along pipeline","m3",5173]
[{"$f":"IF($E56<>\"\",MAX($A$1:INDIRECT(CONCATENATE(\"$A$\",ROW()-1)))+1,\"\")","v":""},""]
[{"$f":"IF($E57<>\"\",MAX($A$1:INDIRECT(CONCATENATE(\"$A$\",ROW()-1)))+1,\"\")","v":14},"C1.14",null,"Boulder excavation Class A","m3",200]
[{"$f":"IF($E58<>\"\",MAX($A$1:INDIRECT(CONCATENATE(\"$A$\",ROW()-1)))+1,\"\")","v":""},""]
[{"$f":"IF($E59<>\"\",MAX($A$1:INDIRECT(CONCATENATE(\"$A$\",ROW()-1)))+1,\"\")","v":15},"C1.15",null,"Boulder excavation Class B","m3",100]
[{"$f":"IF($E60<>\"\",MAX($A$1:INDIRECT(CONCATENATE(\"$A$\",ROW()-1)))+1,\"\")","v":""},""]
[{"$f":"IF($E61<>\"\",MAX($A$1:INDIRECT(CONCATENATE(\"$A$\",ROW()-1)))+1,\"\")","v":16},"C1.16","8.3.2\nPSDB 8.3.2","Hand excavation and backfill where ordered by the Engineer","m3",524]
[{"$f":"IF($E62<>\"\",MAX($A$1:INDIRECT(CONCATENATE(\"$A$\",ROW()-1)))+1,\"\")","v":""},""]
[{"$f":"IF($E63<>\"\",MAX($A$1:INDIRECT(CONCATENATE(\"$A$\",ROW()-1)))+1,\"\")","v":17},"C1.17",null,"Backfill stabilised by 5% where ordered by the Engineer","m3",209]
[{"$f":"IF($E64<>\"\",MAX($A$1:INDIRECT(CONCATENATE(\"$A$\",ROW()-1)))+1,\"\")","v":""},""]
[{"$f":"IF($E65<>\"\",MAX($A$1:INDIRECT(CONCATENATE(\"$A$\",ROW()-1)))+1,\"\")","v":18},"C1.18",null,"Soilcrete backfill where directed by the Engineer","m3",419]
[{"$f":"IF($E66<>\"\",MAX($A$1:INDIRECT(CONCATENATE(\"$A$\",ROW()-1)))+1,\"\")","v":""},""]
[{"$f":"IF($E67<>\"\",MAX($A$1:INDIRECT(CONCATENATE(\"$A$\",ROW()-1)))+1,\"\")","v":19},"C1.19","8.3.2    ","Excavation and disposal of unsuitable material from  trench bottom (only where  ordered in writing by the Engineer)","m3",209]
[{"$f":"IF($E68<>\"\",MAX($A$1:INDIRECT(CONCATENATE(\"$A$\",ROW()-1)))+1,\"\")","v":""},""]
[{"$f":"IF($E69<>\"\",MAX($A$1:INDIRECT(CONCATENATE(\"$A$\",ROW()-1)))+1,\"\")","v":""},"","PSDB 8.3.10","Supply and place the following to form sound foundation to pipework for unstable trench conditions:"]
[{"$f":"IF($E70<>\"\",MAX($A$1:INDIRECT(CONCATENATE(\"$A$\",ROW()-1)))+1,\"\")","v":""},{"$f":"IF(A70<>\"\",$A$3&A70,\"\")","v":""}]
[{"$f":"IF($E71<>\"\",MAX($A$1:INDIRECT(CONCATENATE(\"$A$\",ROW()-1)))+1,\"\")","v":20},"C1.20",null,"19 mm crushed stone","m3",419]
[{"$f":"IF($E72<>\"\",MAX($A$1:INDIRECT(CONCATENATE(\"$A$\",ROW()-1)))+1,\"\")","v":""},""]
[{"$f":"IF($E73<>\"\",MAX($A$1:INDIRECT(CONCATENATE(\"$A$\",ROW()-1)))+1,\"\")","v":21},"C1.21",null,"Geotextile filter blanket (Grade A7)","m2",2649]
[{"$f":"IF($E74<>\"\",MAX($A$1:INDIRECT(CONCATENATE(\"$A$\",ROW()-1)))+1,\"\")","v":""},""]
[{"$f":"IF($E75<>\"\",MAX($A$1:INDIRECT(CONCATENATE(\"$A$\",ROW()-1)))+1,\"\")","v":22},"C1.22","PSDB 8.3.9","Temporary stockpiling of wet material from trench excavation","m3",419]
[{"$f":"IF($E76<>\"\",MAX($A$1:INDIRECT(CONCATENATE(\"$A$\",ROW()-1)))+1,\"\")","v":""},""]
[{"$f":"IF($E77<>\"\",MAX($A$1:INDIRECT(CONCATENATE(\"$A$\",ROW()-1)))+1,\"\")","v":23},"C1.23","8.3.3.1","Make up deficiency in backfill material, fill and compact to 90% MAMDD using excess excavation material to low lying areas (where ordered by the Engineer)","m3",209]
[{"$f":"IF($E78<>\"\",MAX($A$1:INDIRECT(CONCATENATE(\"$A$\",ROW()-1)))+1,\"\")","v":""},""]
[{"$f":"IF($E79<>\"\",MAX($A$1:INDIRECT(CONCATENATE(\"$A$\",ROW()-1)))+1,\"\")","v":""},"","8.3.2\nPSDB 8.3.2","Extra-over to Items C1.8-C1.11 Trench Excavations for restricted working width:"]
[{"$f":"IF($E80<>\"\",MAX($A$1:INDIRECT(CONCATENATE(\"$A$\",ROW()-1)))+1,\"\")","v":""},""]
[{"$f":"IF($E81<>\"\",MAX($A$1:INDIRECT(CONCATENATE(\"$A$\",ROW()-1)))+1,\"\")","v":""},"",null,"Working width from 5 m up to 10 m:"]
[{"$f":"IF($E82<>\"\",MAX($A$1:INDIRECT(CONCATENATE(\"$A$\",ROW()-1)))+1,\"\")","v":""},""]
[{"$f":"IF($E83<>\"\",MAX($A$1:INDIRECT(CONCATENATE(\"$A$\",ROW()-1)))+1,\"\")","v":""},"",null,"Over      and       Up to"]
[{"$f":"IF($E84<>\"\",MAX($A$1:INDIRECT(CONCATENATE(\"$A$\",ROW()-1)))+1,\"\")","v":""},""]
[{"$f":"IF($E85<>\"\",MAX($A$1:INDIRECT(CONCATENATE(\"$A$\",ROW()-1)))+1,\"\")","v":24},"C1.24",null,"0 m                     2,0 m","m",485]
[{"$f":"IF($E86<>\"\",MAX($A$1:INDIRECT(CONCATENATE(\"$A$\",ROW()-1)))+1,\"\")","v":""},""]
[{"$f":"IF($E87<>\"\",MAX($A$1:INDIRECT(CONCATENATE(\"$A$\",ROW()-1)))+1,\"\")","v":25},"C1.25",null,"2,0 m                 3,0 m","m",120]
[]
[]
[{"$f":"IF($E90<>\"\",MAX($A$1:INDIRECT(CONCATENATE(\"$A$\",ROW()-1)))+1,\"\")","v":""},{"$f":"IF(A90<>\"\",$A$3&A90,\"\")","v":""},null," Carried forward / …"]
[{"$f":"IF($E91<>\"\",MAX($A$1:INDIRECT(CONCATENATE(\"$A$\",ROW()-1)))+1,\"\")","v":""},"",null," Brought forward / …"]
[]
[{"$f":"IF($E93<>\"\",MAX($A$1:INDIRECT(CONCATENATE(\"$A$\",ROW()-1)))+1,\"\")","v":26},"C1.26",null,"3,0 m                 4,0 m","m",10]
[{"$f":"IF($E94<>\"\",MAX($A$1:INDIRECT(CONCATENATE(\"$A$\",ROW()-1)))+1,\"\")","v":""},""]
[{"$f":"IF($E95<>\"\",MAX($A$1:INDIRECT(CONCATENATE(\"$A$\",ROW()-1)))+1,\"\")","v":27},"C1.27",null,"4,0 m                 5,0 m","m",15]
[{"$f":"IF($E96<>\"\",MAX($A$1:INDIRECT(CONCATENATE(\"$A$\",ROW()-1)))+1,\"\")","v":""},""]
[{"$f":"IF($E97<>\"\",MAX($A$1:INDIRECT(CONCATENATE(\"$A$\",ROW()-1)))+1,\"\")","v":""},"",null,"Working width from 10 m up to 15 m:"]
[{"$f":"IF($E98<>\"\",MAX($A$1:INDIRECT(CONCATENATE(\"$A$\",ROW()-1)))+1,\"\")","v":""},""]
[{"$f":"IF($E99<>\"\",MAX($A$1:INDIRECT(CONCATENATE(\"$A$\",ROW()-1)))+1,\"\")","v":""},"",null,"Over      and       Up to"]
[{"$f":"IF($E100<>\"\",MAX($A$1:INDIRECT(CONCATENATE(\"$A$\",ROW()-1)))+1,\"\")","v":""},""]
[{"$f":"IF($E101<>\"\",MAX($A$1:INDIRECT(CONCATENATE(\"$A$\",ROW()-1)))+1,\"\")","v":28},"C1.28",null,"0 m                     2,0 m","m",50]
[{"$f":"IF($E102<>\"\",MAX($A$1:INDIRECT(CONCATENATE(\"$A$\",ROW()-1)))+1,\"\")","v":""},""]
[{"$f":"IF($E103<>\"\",MAX($A$1:INDIRECT(CONCATENATE(\"$A$\",ROW()-1)))+1,\"\")","v":29},"C1.29",null,"2,0 m                 3,0 m","m",20]
[{"$f":"IF($E104<>\"\",MAX($A$1:INDIRECT(CONCATENATE(\"$A$\",ROW()-1)))+1,\"\")","v":""},""]
[{"$f":"IF($E105<>\"\",MAX($A$1:INDIRECT(CONCATENATE(\"$A$\",ROW()-1)))+1,\"\")","v":30},"C1.30",null,"3,0 m                 4,0 m","m",5]
[{"$f":"IF($E106<>\"\",MAX($A$1:INDIRECT(CONCATENATE(\"$A$\",ROW()-1)))+1,\"\")","v":""},""]
[{"$f":"IF($E107<>\"\",MAX($A$1:INDIRECT(CONCATENATE(\"$A$\",ROW()-1)))+1,\"\")","v":31},"C1.31",null,"4,0 m                 5,0 m","m",0]
[{"$f":"IF($E108<>\"\",MAX($A$1:INDIRECT(CONCATENATE(\"$A$\",ROW()-1)))+1,\"\")","v":""},""]
[{"$f":"IF($E109<>\"\",MAX($A$1:INDIRECT(CONCATENATE(\"$A$\",ROW()-1)))+1,\"\")","v":""},"",null,"Working width from 15 m up to 25 m:"]
[{"$f":"IF($E110<>\"\",MAX($A$1:INDIRECT(CONCATENATE(\"$A$\",ROW()-1)))+1,\"\")","v":""},""]
[{"$f":"IF($E111<>\"\",MAX($A$1:INDIRECT(CONCATENATE(\"$A$\",ROW()-1)))+1,\"\")","v":""},"",null,"Over      and       Up to"]
[{"$f":"IF($E112<>\"\",MAX($A$1:INDIRECT(CONCATENATE(\"$A$\",ROW()-1)))+1,\"\")","v":""},""]
[{"$f":"IF($E113<>\"\",MAX($A$1:INDIRECT(CONCATENATE(\"$A$\",ROW()-1)))+1,\"\")","v":32},"C1.32",null,"0 m                     2,0 m","m",9280]
[{"$f":"IF($E114<>\"\",MAX($A$1:INDIRECT(CONCATENATE(\"$A$\",ROW()-1)))+1,\"\")","v":""},""]
[{"$f":"IF($E115<>\"\",MAX($A$1:INDIRECT(CONCATENATE(\"$A$\",ROW()-1)))+1,\"\")","v":33},"C1.33",null,"2,0 m                 3,0 m","m",3688]
[{"$f":"IF($E116<>\"\",MAX($A$1:INDIRECT(CONCATENATE(\"$A$\",ROW()-1)))+1,\"\")","v":""},""]
[{"$f":"IF($E117<>\"\",MAX($A$1:INDIRECT(CONCATENATE(\"$A$\",ROW()-1)))+1,\"\")","v":34},"C1.34",null,"3,0 m                 4,0 m","m",153]
[{"$f":"IF($E118<>\"\",MAX($A$1:INDIRECT(CONCATENATE(\"$A$\",ROW()-1)))+1,\"\")","v":""},""]
[{"$f":"IF($E119<>\"\",MAX($A$1:INDIRECT(CONCATENATE(\"$A$\",ROW()-1)))+1,\"\")","v":35},"C1.35",null,"4,0 m                 5,0 m","m",5]
[{"$f":"IF($E120<>\"\",MAX($A$1:INDIRECT(CONCATENATE(\"$A$\",ROW()-1)))+1,\"\")","v":""},""]
[{"$f":"IF($E121<>\"\",MAX($A$1:INDIRECT(CONCATENATE(\"$A$\",ROW()-1)))+1,\"\")","v":""},"","8.3.4\nPSDB 8.3.4","Shoring by supporting sides of the excavation for trenches and at chambers with restricted access for support height of: (Provisional)"]
[{"$f":"IF($E122<>\"\",MAX($A$1:INDIRECT(CONCATENATE(\"$A$\",ROW()-1)))+1,\"\")","v":""},""]
[{"$f":"IF($E123<>\"\",MAX($A$1:INDIRECT(CONCATENATE(\"$A$\",ROW()-1)))+1,\"\")","v":""},"",null,"Over      and       Up to"]
[{"$f":"IF($E124<>\"\",MAX($A$1:INDIRECT(CONCATENATE(\"$A$\",ROW()-1)))+1,\"\")","v":""},""]
[{"$f":"IF($E125<>\"\",MAX($A$1:INDIRECT(CONCATENATE(\"$A$\",ROW()-1)))+1,\"\")","v":36},"C1.36",null,"0 m                     2,0 m","m",1472]
[{"$f":"IF($E126<>\"\",MAX($A$1:INDIRECT(CONCATENATE(\"$A$\",ROW()-1)))+1,\"\")","v":""},""]
[{"$f":"IF($E127<>\"\",MAX($A$1:INDIRECT(CONCATENATE(\"$A$\",ROW()-1)))+1,\"\")","v":37},"C1.37",null,"2,0 m                 3,0 m","m",574]
[{"$f":"IF($E128<>\"\",MAX($A$1:INDIRECT(CONCATENATE(\"$A$\",ROW()-1)))+1,\"\")","v":""},""]
[{"$f":"IF($E129<>\"\",MAX($A$1:INDIRECT(CONCATENATE(\"$A$\",ROW()-1)))+1,\"\")","v":38},"C1.38",null,"3,0 m                 4,0 m","m",25]
[{"$f":"IF($E130<>\"\",MAX($A$1:INDIRECT(CONCATENATE(\"$A$\",ROW()-1)))+1,\"\")","v":""},""]
[{"$f":"IF($E131<>\"\",MAX($A$1:INDIRECT(CONCATENATE(\"$A$\",ROW()-1)))+1,\"\")","v":39},"C1.39",null,"4,0 m                 5,0 m","m",3]
[{"$f":"IF($E132<>\"\",MAX($A$1:INDIRECT(CONCATENATE(\"$A$\",ROW()-1)))+1,\"\")","v":""},""]
[{"$f":"IF($E133<>\"\",MAX($A$1:INDIRECT(CONCATENATE(\"$A$\",ROW()-1)))+1,\"\")","v":""},"",null,"Existing services:"]
[{"$f":"IF($E134<>\"\",MAX($A$1:INDIRECT(CONCATENATE(\"$A$\",ROW()-1)))+1,\"\")","v":""},{"$f":"IF(A134<>\"\",$A$3&A134,\"\")","v":""}]
[{"$f":"IF($E135<>\"\",MAX($A$1:INDIRECT(CONCATENATE(\"$A$\",ROW()-1)))+1,\"\")","v":40},"C1.40","8.3.5\nPSDB 8.3.5","Existing services that intersect a trench:"," "]
[{"$f":"IF($E136<>\"\",MAX($A$1:INDIRECT(CONCATENATE(\"$A$\",ROW()-1)))+1,\"\")","v":""},""]
[{"$f":"IF($E137<>\"\",MAX($A$1:INDIRECT(CONCATENATE(\"$A$\",ROW()-1)))+1,\"\")","v":41},"C1.41",null,"Telkom and Neotel fibre-optic cable","No",2]
[]
[{"$f":"IF($E139<>\"\",MAX($A$1:INDIRECT(CONCATENATE(\"$A$\",ROW()-1)))+1,\"\")","v":42},"C1.42",null,"Overhead electric cable (medium voltage up to 11 kV)","No",3]
[]
[]
[{"$f":"IF($E142<>\"\",MAX($A$1:INDIRECT(CONCATENATE(\"$A$\",ROW()-1)))+1,\"\")","v":""},{"$f":"IF(A142<>\"\",$A$3&A142,\"\")","v":""},null," Carried forward / …"]
[{"$f":"IF($E143<>\"\",MAX($A$1:INDIRECT(CONCATENATE(\"$A$\",ROW()-1)))+1,\"\")","v":""},"",null," Brought forward / …"]
[]
[{"$f":"IF($E145<>\"\",MAX($A$1:INDIRECT(CONCATENATE(\"$A$\",ROW()-1)))+1,\"\")","v":43},"C1.43",null,"Overhead electric cable (high voltage up to 275 kV)","No",1]
[{"$f":"IF($E146<>\"\",MAX($A$1:INDIRECT(CONCATENATE(\"$A$\",ROW()-1)))+1,\"\")","v":""},""]
[{"$f":"IF($E147<>\"\",MAX($A$1:INDIRECT(CONCATENATE(\"$A$\",ROW()-1)))+1,\"\")","v":44},"C1.44",null,"Underground electrical cables (medium voltage up to 11 kV)","No",1]
[{"$f":"IF($E148<>\"\",MAX($A$1:INDIRECT(CONCATENATE(\"$A$\",ROW()-1)))+1,\"\")","v":""},""]
[{"$f":"IF($E149<>\"\",MAX($A$1:INDIRECT(CONCATENATE(\"$A$\",ROW()-1)))+1,\"\")","v":45},"C1.45"," ","Watermains of pipe diameters up to \nDN 500 mm"," No",5]
[{"$f":"IF($E150<>\"\",MAX($A$1:INDIRECT(CONCATENATE(\"$A$\",ROW()-1)))+1,\"\")","v":""},""]
[{"$f":"IF($E151<>\"\",MAX($A$1:INDIRECT(CONCATENATE(\"$A$\",ROW()-1)))+1,\"\")","v":46},"C1.46"," ","Sewer gravity mains of pipe diameters up to DN 300 mm","No",3]
[{"$f":"IF($E152<>\"\",MAX($A$1:INDIRECT(CONCATENATE(\"$A$\",ROW()-1)))+1,\"\")","v":""},""]
[{"$f":"IF($E153<>\"\",MAX($A$1:INDIRECT(CONCATENATE(\"$A$\",ROW()-1)))+1,\"\")","v":47},"C1.47",null,"Fences","No",11]
[{"$f":"IF($E154<>\"\",MAX($A$1:INDIRECT(CONCATENATE(\"$A$\",ROW()-1)))+1,\"\")","v":""},""]
[{"$f":"IF($E155<>\"\",MAX($A$1:INDIRECT(CONCATENATE(\"$A$\",ROW()-1)))+1,\"\")","v":48},"C1.48",null,"Stormwater pipes up to DN 600","No",5]
[{"$f":"IF($E156<>\"\",MAX($A$1:INDIRECT(CONCATENATE(\"$A$\",ROW()-1)))+1,\"\")","v":""},""]
[{"$f":"IF($E157<>\"\",MAX($A$1:INDIRECT(CONCATENATE(\"$A$\",ROW()-1)))+1,\"\")","v":49},"C1.49",null,"5m wide gravel track","No",10]
[{"$f":"IF($E158<>\"\",MAX($A$1:INDIRECT(CONCATENATE(\"$A$\",ROW()-1)))+1,\"\")","v":""},""]
[{"$f":"IF($E159<>\"\",MAX($A$1:INDIRECT(CONCATENATE(\"$A$\",ROW()-1)))+1,\"\")","v":50},"C1.50",null,"Stormwater channel crossings","No",15]
[{"$f":"IF($E160<>\"\",MAX($A$1:INDIRECT(CONCATENATE(\"$A$\",ROW()-1)))+1,\"\")","v":""},""]
[{"$f":"IF($E161<>\"\",MAX($A$1:INDIRECT(CONCATENATE(\"$A$\",ROW()-1)))+1,\"\")","v":51},"C1.51",null,"Surface Road","No",2]
[]
[{"$f":"IF($E163<>\"\",MAX($A$1:INDIRECT(CONCATENATE(\"$A$\",ROW()-1)))+1,\"\")","v":""},"","8.3.5\nPSDB 8.3.5","Services that adjoin a trench"]
[{"$f":"IF($E164<>\"\",MAX($A$1:INDIRECT(CONCATENATE(\"$A$\",ROW()-1)))+1,\"\")","v":""},""]
[{"$f":"IF($E165<>\"\",MAX($A$1:INDIRECT(CONCATENATE(\"$A$\",ROW()-1)))+1,\"\")","v":52},"C1.52",null,"Fences","m",2000]
[{"$f":"IF($E166<>\"\",MAX($A$1:INDIRECT(CONCATENATE(\"$A$\",ROW()-1)))+1,\"\")","v":""},""]
[{"$f":"IF($E167<>\"\",MAX($A$1:INDIRECT(CONCATENATE(\"$A$\",ROW()-1)))+1,\"\")","v":53},"C1.53",null,"5m wide gravel track","m",1390]
[{"$f":"IF($E168<>\"\",MAX($A$1:INDIRECT(CONCATENATE(\"$A$\",ROW()-1)))+1,\"\")","v":""},""]
[{"$f":"IF($E169<>\"\",MAX($A$1:INDIRECT(CONCATENATE(\"$A$\",ROW()-1)))+1,\"\")","v":54},"C1.54",null,"Sewer gravity mains of pipe diameters up to DN 300mm","m",100]
[{"$f":"IF($E170<>\"\",MAX($A$1:INDIRECT(CONCATENATE(\"$A$\",ROW()-1)))+1,\"\")","v":""},""]
[{"$f":"IF($E171<>\"\",MAX($A$1:INDIRECT(CONCATENATE(\"$A$\",ROW()-1)))+1,\"\")","v":55},"C1.55",null,"Watermains of pipe diameters up to \nDN 500 mm","m",300]
[{"$f":"IF($E172<>\"\",MAX($A$1:INDIRECT(CONCATENATE(\"$A$\",ROW()-1)))+1,\"\")","v":""},""]
[{"$f":"IF($E173<>\"\",MAX($A$1:INDIRECT(CONCATENATE(\"$A$\",ROW()-1)))+1,\"\")","v":56},"C1.56",null,"Medium voltage electric cable (up to 11 kV)","m",1500]
[{"$f":"IF($E174<>\"\",MAX($A$1:INDIRECT(CONCATENATE(\"$A$\",ROW()-1)))+1,\"\")","v":""},""]
[{"$f":"IF($E175<>\"\",MAX($A$1:INDIRECT(CONCATENATE(\"$A$\",ROW()-1)))+1,\"\")","v":57},"C1.57",null,"Telkom and Neotel fibre-optic cable","m",500]
[{"$f":"IF($E176<>\"\",MAX($A$1:INDIRECT(CONCATENATE(\"$A$\",ROW()-1)))+1,\"\")","v":""},""]
[{"$f":"IF($E177<>\"\",MAX($A$1:INDIRECT(CONCATENATE(\"$A$\",ROW()-1)))+1,\"\")","v":58},"C1.58",null,"Overhead Telkom Line","m",738]
[]
[{"$f":"IF($E179<>\"\",MAX($A$1:INDIRECT(CONCATENATE(\"$A$\",ROW()-1)))+1,\"\")","v":""},"","SANS"]
[{"$f":"IF($E180<>\"\",MAX($A$1:INDIRECT(CONCATENATE(\"$A$\",ROW()-1)))+1,\"\")","v":""},"","1200 D\nPSD 8.3.14\nPSD 8.3.15","Survey and protection of structures / buildings"]
[{"$f":"IF($E181<>\"\",MAX($A$1:INDIRECT(CONCATENATE(\"$A$\",ROW()-1)))+1,\"\")","v":""},""]
[{"$f":"IF($E182<>\"\",MAX($A$1:INDIRECT(CONCATENATE(\"$A$\",ROW()-1)))+1,\"\")","v":59},"C1.59",null,"Existing structures at CH 1400 to CH 1600","Sum","-","-"]
[]
[{"$f":"IF($E184<>\"\",MAX($A$1:INDIRECT(CONCATENATE(\"$A$\",ROW()-1)))+1,\"\")","v":60},"C1.60",null,"Existing structures at CH 2040 to CH 2300","Sum","-","-"]
[{"$f":"IF($E185<>\"\",MAX($A$1:INDIRECT(CONCATENATE(\"$A$\",ROW()-1)))+1,\"\")","v":""},""]
[{"$f":"IF($E186<>\"\",MAX($A$1:INDIRECT(CONCATENATE(\"$A$\",ROW()-1)))+1,\"\")","v":61},"C1.61",null,"Existing structures and services at CH 2920 - CH 3440","Sum","-","-"]
[]
[{"$f":"IF($E188<>\"\",MAX($A$1:INDIRECT(CONCATENATE(\"$A$\",ROW()-1)))+1,\"\")","v":""},{"$f":"IF(A188<>\"\",$A$3&A188,\"\")","v":""},null," Carried forward / …"]
[{"$f":"IF($E189<>\"\",MAX($A$1:INDIRECT(CONCATENATE(\"$A$\",ROW()-1)))+1,\"\")","v":""},"",null," Brought forward / …"]
[]
[{"$f":"IF($E191<>\"\",MAX($A$1:INDIRECT(CONCATENATE(\"$A$\",ROW()-1)))+1,\"\")","v":""},"",null,"Stream and donga crossings:"]
[{"$f":"IF($E192<>\"\",MAX($A$1:INDIRECT(CONCATENATE(\"$A$\",ROW()-1)))+1,\"\")","v":""},""]
[null,null,"SANS"]
[{"$f":"IF($E194<>\"\",MAX($A$1:INDIRECT(CONCATENATE(\"$A$\",ROW()-1)))+1,\"\")","v":62},"C1.62","1200 DK\n8.2\nPSDK 8.2.2","Construct gabions of the following dimensions complete with stone"," "]
[{"$f":"IF($E195<>\"\",MAX($A$1:INDIRECT(CONCATENATE(\"$A$\",ROW()-1)))+1,\"\")","v":""},""]
[{"$f":"IF($E196<>\"\",MAX($A$1:INDIRECT(CONCATENATE(\"$A$\",ROW()-1)))+1,\"\")","v":63},"C1.63",null,"3.0 m x 1.0 m x 0.5 m","m3",150]
[{"$f":"IF($E197<>\"\",MAX($A$1:INDIRECT(CONCATENATE(\"$A$\",ROW()-1)))+1,\"\")","v":""},""]
[{"$f":"IF($E198<>\"\",MAX($A$1:INDIRECT(CONCATENATE(\"$A$\",ROW()-1)))+1,\"\")","v":64},"C1.64",null,"3.0 m x 1.0 m x 1.0 m","m3",300]
[{"$f":"IF($E199<>\"\",MAX($A$1:INDIRECT(CONCATENATE(\"$A$\",ROW()-1)))+1,\"\")","v":""},""]
[{"$f":"IF($E200<>\"\",MAX($A$1:INDIRECT(CONCATENATE(\"$A$\",ROW()-1)))+1,\"\")","v":65},"C1.65","8.2.4","Supply and Place geotextile Grade A2 behind gabions and mattress","m2",3150]
[{"$f":"IF($E201<>\"\",MAX($A$1:INDIRECT(CONCATENATE(\"$A$\",ROW()-1)))+1,\"\")","v":""},{"$f":"IF(A201<>\"\",$A$3&A201,\"\")","v":""}]
[{"$f":"IF($E202<>\"\",MAX($A$1:INDIRECT(CONCATENATE(\"$A$\",ROW()-1)))+1,\"\")","v":66},"C1.66","PSDK 8.2.8","Riprap at stream and donga crossings","m3",1000]
[{"$f":"IF($E203<>\"\",MAX($A$1:INDIRECT(CONCATENATE(\"$A$\",ROW()-1)))+1,\"\")","v":""},""]
[{"$f":"IF($E204<>\"\",MAX($A$1:INDIRECT(CONCATENATE(\"$A$\",ROW()-1)))+1,\"\")","v":""},"","1200 DB  \n8.3.6","Finishing"]
[{"$f":"IF($E205<>\"\",MAX($A$1:INDIRECT(CONCATENATE(\"$A$\",ROW()-1)))+1,\"\")","v":""},""]
[{"$f":"IF($E206<>\"\",MAX($A$1:INDIRECT(CONCATENATE(\"$A$\",ROW()-1)))+1,\"\")","v":67},"C1.67","8.3.6.1\nPSDB 8.3.6.1","Subbase (Material type G5) of 150mm thickness compacted to 95% MAMDD","m2",70]
[{"$f":"IF($E207<>\"\",MAX($A$1:INDIRECT(CONCATENATE(\"$A$\",ROW()-1)))+1,\"\")","v":""},""]
[{"$f":"IF($E208<>\"\",MAX($A$1:INDIRECT(CONCATENATE(\"$A$\",ROW()-1)))+1,\"\")","v":68},"C1.68","8.3.6.1\nPSDB 8.3.6.1","Gravel (Material type G5) of 150mm thickness compacted to 95% MAMDD","m2",100]
[{"$f":"IF($E209<>\"\",MAX($A$1:INDIRECT(CONCATENATE(\"$A$\",ROW()-1)))+1,\"\")","v":""},""]
[{"$f":"IF($E210<>\"\",MAX($A$1:INDIRECT(CONCATENATE(\"$A$\",ROW()-1)))+1,\"\")","v":""},"","1200 D\n8.3.3\nPSD 8.3.3","Restricted excavation"]
[{"$f":"IF($E211<>\"\",MAX($A$1:INDIRECT(CONCATENATE(\"$A$\",ROW()-1)))+1,\"\")","v":""},""]
[{"$f":"IF($E212<>\"\",MAX($A$1:INDIRECT(CONCATENATE(\"$A$\",ROW()-1)))+1,\"\")","v":69},"C1.69",null,"Valve Chambers","m3",1500]
[{"$f":"IF($E213<>\"\",MAX($A$1:INDIRECT(CONCATENATE(\"$A$\",ROW()-1)))+1,\"\")","v":""},""]
[{"$f":"IF($E214<>\"\",MAX($A$1:INDIRECT(CONCATENATE(\"$A$\",ROW()-1)))+1,\"\")","v":70},"C1.70",null,"Excavate for chambers (not scheduled elsewhere) and earthmats for AC mitigation to expose sleeve openings and use excess material for embankment or backfill or dispose as ordered by the Engineer","m3",251]
[{"$f":"IF($E215<>\"\",MAX($A$1:INDIRECT(CONCATENATE(\"$A$\",ROW()-1)))+1,\"\")","v":""},""]
[{"$f":"IF($E216<>\"\",MAX($A$1:INDIRECT(CONCATENATE(\"$A$\",ROW()-1)))+1,\"\")","v":""},"","8.3.2                PSD 8.3.2","Extra over for Restricted Excavation above:"]
[{"$f":"IF($E217<>\"\",MAX($A$1:INDIRECT(CONCATENATE(\"$A$\",ROW()-1)))+1,\"\")","v":""},""]
[{"$f":"IF($E218<>\"\",MAX($A$1:INDIRECT(CONCATENATE(\"$A$\",ROW()-1)))+1,\"\")","v":71},"C1.71",null,"Hard Rock excavation","m3",751]
[]
[{"$f":"IF($E220<>\"\",MAX($A$1:INDIRECT(CONCATENATE(\"$A$\",ROW()-1)))+1,\"\")","v":""},"","1200 LB","Bedding & Blanket"]
[{"$f":"IF($E221<>\"\",MAX($A$1:INDIRECT(CONCATENATE(\"$A$\",ROW()-1)))+1,\"\")","v":""},""," "]
[{"$f":"IF($E222<>\"\",MAX($A$1:INDIRECT(CONCATENATE(\"$A$\",ROW()-1)))+1,\"\")","v":""},"","PSLB 8.2.1","From trench excavation (incl screening):"]
[{"$f":"IF($E223<>\"\",MAX($A$1:INDIRECT(CONCATENATE(\"$A$\",ROW()-1)))+1,\"\")","v":""},""]
[{"$f":"IF($E224<>\"\",MAX($A$1:INDIRECT(CONCATENATE(\"$A$\",ROW()-1)))+1,\"\")","v":72},"C1.72",null,"Selected granular material","m3",679]
[{"$f":"IF($E225<>\"\",MAX($A$1:INDIRECT(CONCATENATE(\"$A$\",ROW()-1)))+1,\"\")","v":""},""]
[{"$f":"IF($E226<>\"\",MAX($A$1:INDIRECT(CONCATENATE(\"$A$\",ROW()-1)))+1,\"\")","v":73},"C1.73",null,"Selected fill material","m3",210]
[]
[{"$f":"IF($E228<>\"\",MAX($A$1:INDIRECT(CONCATENATE(\"$A$\",ROW()-1)))+1,\"\")","v":""},{"$f":"IF(A228<>\"\",$A$3&A228,\"\")","v":""},null," Carried forward / …"]
[{"$f":"IF($E229<>\"\",MAX($A$1:INDIRECT(CONCATENATE(\"$A$\",ROW()-1)))+1,\"\")","v":""},"",null," Brought forward / …"]
[]
[{"$f":"IF($E231<>\"\",MAX($A$1:INDIRECT(CONCATENATE(\"$A$\",ROW()-1)))+1,\"\")","v":""},"","8.2.2.3\nPSLB 8.2.2.3","From commercial sources:"]
[{"$f":"IF($E232<>\"\",MAX($A$1:INDIRECT(CONCATENATE(\"$A$\",ROW()-1)))+1,\"\")","v":""},""]
[{"$f":"IF($E233<>\"\",MAX($A$1:INDIRECT(CONCATENATE(\"$A$\",ROW()-1)))+1,\"\")","v":74},"C1.74",null,"Selected granular material","m3",13577]
[{"$f":"IF($E234<>\"\",MAX($A$1:INDIRECT(CONCATENATE(\"$A$\",ROW()-1)))+1,\"\")","v":""},""]
[{"$f":"IF($E235<>\"\",MAX($A$1:INDIRECT(CONCATENATE(\"$A$\",ROW()-1)))+1,\"\")","v":75},"C1.75",null,"Selected fill material","m3",4190]
[{"$f":"IF($E236<>\"\",MAX($A$1:INDIRECT(CONCATENATE(\"$A$\",ROW()-1)))+1,\"\")","v":""},""]
[{"$f":"IF($E237<>\"\",MAX($A$1:INDIRECT(CONCATENATE(\"$A$\",ROW()-1)))+1,\"\")","v":""},"",null,"Extra-over to Items C1.70 - C1.73 Bedding and Blanket above:"]
[{"$f":"IF($E238<>\"\",MAX($A$1:INDIRECT(CONCATENATE(\"$A$\",ROW()-1)))+1,\"\")","v":""},""]
[{"$f":"IF($E239<>\"\",MAX($A$1:INDIRECT(CONCATENATE(\"$A$\",ROW()-1)))+1,\"\")","v":76},"C1.76","PSLB 8.2.6","Cement stabilisation at 5% by volume to fill material","m3",280]
[]
[{"$f":"IF($E241<>\"\",MAX($A$1:INDIRECT(CONCATENATE(\"$A$\",ROW()-1)))+1,\"\")","v":77},{"$f":"IF(A241<>\"\",$A$3&A241,\"\")","v":"C1.77"},"PSLB 8.2.7","20 MPa concrete bedding for pipeline","m4",280]
[]
[{"$f":"IF($E243<>\"\",MAX($A$1:INDIRECT(CONCATENATE(\"$A$\",ROW()-1)))+1,\"\")","v":""},"","SANS"]
[{"$f":"IF($E244<>\"\",MAX($A$1:INDIRECT(CONCATENATE(\"$A$\",ROW()-1)))+1,\"\")","v":""},"","1200 A","Slope stabilisation"]
[{"$f":"IF($E245<>\"\",MAX($A$1:INDIRECT(CONCATENATE(\"$A$\",ROW()-1)))+1,\"\")","v":""},""]
[{"$f":"IF($E246<>\"\",MAX($A$1:INDIRECT(CONCATENATE(\"$A$\",ROW()-1)))+1,\"\")","v":78},"C1.78","PSA 8.10","Cross embankments","m3",1605]
[{"$f":"IF($E247<>\"\",MAX($A$1:INDIRECT(CONCATENATE(\"$A$\",ROW()-1)))+1,\"\")","v":""},""]
[{"$f":"IF($E248<>\"\",MAX($A$1:INDIRECT(CONCATENATE(\"$A$\",ROW()-1)))+1,\"\")","v":79},"C1.79","PSA 8.10","Cross walls","m3",100]
[{"$f":"IF($E249<>\"\",MAX($A$1:INDIRECT(CONCATENATE(\"$A$\",ROW()-1)))+1,\"\")","v":""},""]
[{"$f":"IF($E250<>\"\",MAX($A$1:INDIRECT(CONCATENATE(\"$A$\",ROW()-1)))+1,\"\")","v":80},"C1.80","PSA 8.10","Concrete anchor blocks","m3",20]
[{"$f":"IF($E251<>\"\",MAX($A$1:INDIRECT(CONCATENATE(\"$A$\",ROW()-1)))+1,\"\")","v":""},""]
[{"$f":"IF($E252<>\"\",MAX($A$1:INDIRECT(CONCATENATE(\"$A$\",ROW()-1)))+1,\"\")","v":81},"C1.81","PSA 8.10","Grassing by means of hydroseeding","m²",4000]
[{"$f":"IF($E253<>\"\",MAX($A$1:INDIRECT(CONCATENATE(\"$A$\",ROW()-1)))+1,\"\")","v":""},""]
[{"$f":"IF($E254<>\"\",MAX($A$1:INDIRECT(CONCATENATE(\"$A$\",ROW()-1)))+1,\"\")","v":""},"",null,"PIPELINES:"]
[{"$f":"IF($E255<>\"\",MAX($A$1:INDIRECT(CONCATENATE(\"$A$\",ROW()-1)))+1,\"\")","v":""},""]
[{"$f":"IF($E256<>\"\",MAX($A$1:INDIRECT(CONCATENATE(\"$A$\",ROW()-1)))+1,\"\")","v":""},"","DWS 1130","Supply of DN 700 Steel pipes"]
[{"$f":"IF($E257<>\"\",MAX($A$1:INDIRECT(CONCATENATE(\"$A$\",ROW()-1)))+1,\"\")","v":""},""]
[{"$f":"IF($E258<>\"\",MAX($A$1:INDIRECT(CONCATENATE(\"$A$\",ROW()-1)))+1,\"\")","v":""},"","10","Supply of the following pipes manufactured from Grade X52 steel, including lining and coating in accordance with DWS 9900 C7:"]
[{"$f":"IF($E259<>\"\",MAX($A$1:INDIRECT(CONCATENATE(\"$A$\",ROW()-1)))+1,\"\")","v":""},""]
[{"$f":"IF($E260<>\"\",MAX($A$1:INDIRECT(CONCATENATE(\"$A$\",ROW()-1)))+1,\"\")","v":82},"C1.82",null,"DN 700, 11.1 mm wall thickness","m",2000]
[{"$f":"IF($E261<>\"\",MAX($A$1:INDIRECT(CONCATENATE(\"$A$\",ROW()-1)))+1,\"\")","v":""},""]
[{"$f":"IF($E262<>\"\",MAX($A$1:INDIRECT(CONCATENATE(\"$A$\",ROW()-1)))+1,\"\")","v":83},"C1.83",null,"DN 700, 9.3 mm wall thickness","m",4000]
[{"$f":"IF($E263<>\"\",MAX($A$1:INDIRECT(CONCATENATE(\"$A$\",ROW()-1)))+1,\"\")","v":""},""]
[{"$f":"IF($E264<>\"\",MAX($A$1:INDIRECT(CONCATENATE(\"$A$\",ROW()-1)))+1,\"\")","v":84},"C1.84",null,"DN 700, 7 mm wall thickness","m",7831]
[]
[85,{"$f":"IF(A266<>\"\",$A$3&A266,\"\")","v":"C1.85"},null,"Extra over to coat pipeline with Fusion Bonded Medium Density Polyethylene as an alternative coating option","m",13831,"-","Rate Only"]
[]
[86,{"$f":"IF(A268<>\"\",$A$3&A268,\"\")","v":"C1.86"},null,"Extra over to coat pipeline with 3LPE as an alternative coating option","m",1381,"-","Rate Only"]
[]
[]
[]
[]
[]
[{"$f":"IF($E274<>\"\",MAX($A$1:INDIRECT(CONCATENATE(\"$A$\",ROW()-1)))+1,\"\")","v":""},{"$f":"IF(A274<>\"\",$A$3&A274,\"\")","v":""},null," Carried forward / …"]
[{"$f":"IF($E275<>\"\",MAX($A$1:INDIRECT(CONCATENATE(\"$A$\",ROW()-1)))+1,\"\")","v":""},"",null," Brought forward / …"]
[]
[{"$f":"IF($E277<>\"\",MAX($A$1:INDIRECT(CONCATENATE(\"$A$\",ROW()-1)))+1,\"\")","v":""},{"$f":"IF(A277<>\"\",$A$3&A277,\"\")","v":""},"DWS 1130","Supply of specials "]
[{"$f":"IF($E278<>\"\",MAX($A$1:INDIRECT(CONCATENATE(\"$A$\",ROW()-1)))+1,\"\")","v":""},""]
[{"$f":"IF($E279<>\"\",MAX($A$1:INDIRECT(CONCATENATE(\"$A$\",ROW()-1)))+1,\"\")","v":""},"","10","Supply of the following bends manufactured from Grade X52 or S355JR steel, including lining and coating in accordance with DWS 9900 C7:"]
[{"$f":"IF($E280<>\"\",MAX($A$1:INDIRECT(CONCATENATE(\"$A$\",ROW()-1)))+1,\"\")","v":""},"",null,"DN 700, t=11.1 mm"]
[{"$f":"IF($E281<>\"\",MAX($A$1:INDIRECT(CONCATENATE(\"$A$\",ROW()-1)))+1,\"\")","v":""},""]
[{"$f":"IF($E282<>\"\",MAX($A$1:INDIRECT(CONCATENATE(\"$A$\",ROW()-1)))+1,\"\")","v":87},"C1.87",null,"11.25° up to 22.5° ","No",10]
[]
[{"$f":"IF($E284<>\"\",MAX($A$1:INDIRECT(CONCATENATE(\"$A$\",ROW()-1)))+1,\"\")","v":88},"C1.88",null,"22.5° up to 45° ","No",11]
[{"$f":"IF($E285<>\"\",MAX($A$1:INDIRECT(CONCATENATE(\"$A$\",ROW()-1)))+1,\"\")","v":""},""]
[{"$f":"IF($E286<>\"\",MAX($A$1:INDIRECT(CONCATENATE(\"$A$\",ROW()-1)))+1,\"\")","v":89},"C1.89",null,"45° up to 67.5° ","No",13]
[{"$f":"IF($E287<>\"\",MAX($A$1:INDIRECT(CONCATENATE(\"$A$\",ROW()-1)))+1,\"\")","v":""},""]
[{"$f":"IF($E288<>\"\",MAX($A$1:INDIRECT(CONCATENATE(\"$A$\",ROW()-1)))+1,\"\")","v":90},"C1.90",null,"67.5° up to 90.0° ","No",5]
[]
[{"$f":"IF($E290<>\"\",MAX($A$1:INDIRECT(CONCATENATE(\"$A$\",ROW()-1)))+1,\"\")","v":91},{"$f":"IF(A290<>\"\",$A$3&A290,\"\")","v":"C1.91"},null,"Blank flange, PN 40","No",2]
[]
[{"$f":"IF($E292<>\"\",MAX($A$1:INDIRECT(CONCATENATE(\"$A$\",ROW()-1)))+1,\"\")","v":92},{"$f":"IF(A292<>\"\",$A$3&A292,\"\")","v":"C1.92"},null,"Blank flange, PN 63","No",2]
[]
[93,{"$f":"IF(A294<>\"\",$A$3&A294,\"\")","v":"C1.93"},null,"Extra over to coat bends with Fusion Bonded Medium Density Polyethylene as an alternative coating option","No",30,"-","Rate Only"]
[]
[94,{"$f":"IF(A296<>\"\",$A$3&A296,\"\")","v":"C1.94"},null,"Extra over to coat bends with 3LPE as an alternative coating option","No",39,"-","Rate Only"]
[]
[{"$f":"IF($E298<>\"\",MAX($A$1:INDIRECT(CONCATENATE(\"$A$\",ROW()-1)))+1,\"\")","v":""},"","DWS 1110\n20.14.1\n20.14.2","Lay and bed steel pipes complete with couplings: (supplied above)"]
[{"$f":"IF($E299<>\"\",MAX($A$1:INDIRECT(CONCATENATE(\"$A$\",ROW()-1)))+1,\"\")","v":""},""]
[{"$f":"IF($E300<>\"\",MAX($A$1:INDIRECT(CONCATENATE(\"$A$\",ROW()-1)))+1,\"\")","v":95},"C1.95",null,"DN 700, 11.1 mm wall thickness","m",2000]
[{"$f":"IF($E301<>\"\",MAX($A$1:INDIRECT(CONCATENATE(\"$A$\",ROW()-1)))+1,\"\")","v":""},""]
[{"$f":"IF($E302<>\"\",MAX($A$1:INDIRECT(CONCATENATE(\"$A$\",ROW()-1)))+1,\"\")","v":96},"C1.96",null,"DN 700, 9.3 mm wall thickness","m",4000]
[{"$f":"IF($E303<>\"\",MAX($A$1:INDIRECT(CONCATENATE(\"$A$\",ROW()-1)))+1,\"\")","v":""},""]
[{"$f":"IF($E304<>\"\",MAX($A$1:INDIRECT(CONCATENATE(\"$A$\",ROW()-1)))+1,\"\")","v":97},"C1.97",null,"DN 700, 7 mm wall thickness","m",7831]
[{"$f":"IF($E305<>\"\",MAX($A$1:INDIRECT(CONCATENATE(\"$A$\",ROW()-1)))+1,\"\")","v":""},""]
[{"$f":"IF($E306<>\"\",MAX($A$1:INDIRECT(CONCATENATE(\"$A$\",ROW()-1)))+1,\"\")","v":""},"","DWS 1110\n20.14.1\n20.14.2\n20.14.3","Lay and bed steel specials complete with couplings: (supplied above)"]
[]
[{"$f":"IF($E308<>\"\",MAX($A$1:INDIRECT(CONCATENATE(\"$A$\",ROW()-1)))+1,\"\")","v":""},"",null,"DN 700, t=11.1 mm"]
[{"$f":"IF($E309<>\"\",MAX($A$1:INDIRECT(CONCATENATE(\"$A$\",ROW()-1)))+1,\"\")","v":""},""]
[{"$f":"IF($E310<>\"\",MAX($A$1:INDIRECT(CONCATENATE(\"$A$\",ROW()-1)))+1,\"\")","v":98},"C1.98",null,"11.25° up to 22.5° ","No",10]
[{"$f":"IF($E311<>\"\",MAX($A$1:INDIRECT(CONCATENATE(\"$A$\",ROW()-1)))+1,\"\")","v":""},""]
[{"$f":"IF($E312<>\"\",MAX($A$1:INDIRECT(CONCATENATE(\"$A$\",ROW()-1)))+1,\"\")","v":99},"C1.99",null,"22.5° up to 45° ","No",11]
[{"$f":"IF($E313<>\"\",MAX($A$1:INDIRECT(CONCATENATE(\"$A$\",ROW()-1)))+1,\"\")","v":""},""]
[{"$f":"IF($E314<>\"\",MAX($A$1:INDIRECT(CONCATENATE(\"$A$\",ROW()-1)))+1,\"\")","v":100},"C1.100",null,"45° up to 67.5° ","No",13]
[{"$f":"IF($E315<>\"\",MAX($A$1:INDIRECT(CONCATENATE(\"$A$\",ROW()-1)))+1,\"\")","v":""},""]
[{"$f":"IF($E316<>\"\",MAX($A$1:INDIRECT(CONCATENATE(\"$A$\",ROW()-1)))+1,\"\")","v":101},"C1.101",null,"67.5° up to 90.0° ","No",5]
[]
[]
[{"$f":"IF($E319<>\"\",MAX($A$1:INDIRECT(CONCATENATE(\"$A$\",ROW()-1)))+1,\"\")","v":""},{"$f":"IF(A319<>\"\",$A$3&A319,\"\")","v":""},null," Carried forward / …"]
[{"$f":"IF($E320<>\"\",MAX($A$1:INDIRECT(CONCATENATE(\"$A$\",ROW()-1)))+1,\"\")","v":""},"",null," Brought forward / …"]
[]
[{"$f":"IF($E322<>\"\",MAX($A$1:INDIRECT(CONCATENATE(\"$A$\",ROW()-1)))+1,\"\")","v":102},"C1.102","DWS 1110\n20.14.3","Extra-over to Items C1.95 - C1.97 Lay and bed steel pipes,  for additional mitres where ordered by the Engineer:"," "]
[{"$f":"IF($E323<>\"\",MAX($A$1:INDIRECT(CONCATENATE(\"$A$\",ROW()-1)))+1,\"\")","v":""},""]
[{"$f":"IF($E324<>\"\",MAX($A$1:INDIRECT(CONCATENATE(\"$A$\",ROW()-1)))+1,\"\")","v":103},"C1.103",null,"DN 700","No",20]
[]
[{"$f":"IF($E326<>\"\",MAX($A$1:INDIRECT(CONCATENATE(\"$A$\",ROW()-1)))+1,\"\")","v":""},"","SANS"]
[{"$f":"IF($E327<>\"\",MAX($A$1:INDIRECT(CONCATENATE(\"$A$\",ROW()-1)))+1,\"\")","v":104},"C1.104","1200 A\nPSA 8.10","Temporary closure pipes where ordered by the Engineer","No",10]
[{"$f":"IF($E328<>\"\",MAX($A$1:INDIRECT(CONCATENATE(\"$A$\",ROW()-1)))+1,\"\")","v":""},""]
[{"$f":"IF($E329<>\"\",MAX($A$1:INDIRECT(CONCATENATE(\"$A$\",ROW()-1)))+1,\"\")","v":105},"C1.105","1200 LB\nPSLB 8.2.4","Concrete encasing of pipes at stream and river crossings including 100 kg/m3 reinforcement as per drawing 106777-0501-DRG-CC-0102","m³",400]
[]
[{"$f":"IF($E331<>\"\",MAX($A$1:INDIRECT(CONCATENATE(\"$A$\",ROW()-1)))+1,\"\")","v":""},"","DWS 1110\n20.22.1\n20.22.2","Marker Posts and benchmarks"]
[{"$f":"IF($E332<>\"\",MAX($A$1:INDIRECT(CONCATENATE(\"$A$\",ROW()-1)))+1,\"\")","v":""},""]
[{"$f":"IF($E333<>\"\",MAX($A$1:INDIRECT(CONCATENATE(\"$A$\",ROW()-1)))+1,\"\")","v":""},""," ","Supply and install:"]
[{"$f":"IF($E334<>\"\",MAX($A$1:INDIRECT(CONCATENATE(\"$A$\",ROW()-1)))+1,\"\")","v":""},""]
[{"$f":"IF($E335<>\"\",MAX($A$1:INDIRECT(CONCATENATE(\"$A$\",ROW()-1)))+1,\"\")","v":106},"C1.106",null,"Route marker posts as per Dwg No 106777-0501-DRG-CC-0103","No",70]
[{"$f":"IF($E336<>\"\",MAX($A$1:INDIRECT(CONCATENATE(\"$A$\",ROW()-1)))+1,\"\")","v":""},""]
[{"$f":"IF($E337<>\"\",MAX($A$1:INDIRECT(CONCATENATE(\"$A$\",ROW()-1)))+1,\"\")","v":107},"C1.107",null,"Marking of all pipeline structures","No",35]
[]
[{"$f":"IF($E339<>\"\",MAX($A$1:INDIRECT(CONCATENATE(\"$A$\",ROW()-1)))+1,\"\")","v":""},"",null,"Miscellaneous"]
[{"$f":"IF($E340<>\"\",MAX($A$1:INDIRECT(CONCATENATE(\"$A$\",ROW()-1)))+1,\"\")","v":""},""]
[{"$f":"IF($E341<>\"\",MAX($A$1:INDIRECT(CONCATENATE(\"$A$\",ROW()-1)))+1,\"\")","v":108},"C1.108","DWA 1110\n20.19","Hydrostatic testing of complete pipeline","m",13831]
[]
[{"$f":"IF($E343<>\"\",MAX($A$1:INDIRECT(CONCATENATE(\"$A$\",ROW()-1)))+1,\"\")","v":109},{"$f":"IF(A343<>\"\",$A$3&A343,\"\")","v":"C1.109"},"DWA 1110\n20.20","Sterilization of complete pipeline","m",13831]
[{"$f":"IF($E344<>\"\",MAX($A$1:INDIRECT(CONCATENATE(\"$A$\",ROW()-1)))+1,\"\")","v":""},""]
[{"$f":"IF($E345<>\"\",MAX($A$1:INDIRECT(CONCATENATE(\"$A$\",ROW()-1)))+1,\"\")","v":110},"C1.110","DWA 1110\n20.23","Lightning protection of complete pipeline","Sum","-","-"]
[{"$f":"IF($E346<>\"\",MAX($A$1:INDIRECT(CONCATENATE(\"$A$\",ROW()-1)))+1,\"\")","v":""},""]
[{"$f":"IF($E347<>\"\",MAX($A$1:INDIRECT(CONCATENATE(\"$A$\",ROW()-1)))+1,\"\")","v":111},"C1.111","1200 A\nPSA 8.10","Connect to pump station discharge pipework","Sum","-","-"]
[{"$f":"IF($E348<>\"\",MAX($A$1:INDIRECT(CONCATENATE(\"$A$\",ROW()-1)))+1,\"\")","v":""},""]
[{"$f":"IF($E349<>\"\",MAX($A$1:INDIRECT(CONCATENATE(\"$A$\",ROW()-1)))+1,\"\")","v":112},"C1.112","PSA 8.10","Pipe lining integrity testing","m",13831]
[{"$f":"IF($E350<>\"\",MAX($A$1:INDIRECT(CONCATENATE(\"$A$\",ROW()-1)))+1,\"\")","v":""},""]
[{"$f":"IF($E351<>\"\",MAX($A$1:INDIRECT(CONCATENATE(\"$A$\",ROW()-1)))+1,\"\")","v":""},"",null,"Pipeline Cathodic Protection"]
[{"$f":"IF($E352<>\"\",MAX($A$1:INDIRECT(CONCATENATE(\"$A$\",ROW()-1)))+1,\"\")","v":""},""]
[{"$f":"IF($E353<>\"\",MAX($A$1:INDIRECT(CONCATENATE(\"$A$\",ROW()-1)))+1,\"\")","v":113},"C1.113","PSA 8.5.1","DN 700 Pipeline Cathodic protection","Prov \nSum","-","-",5000000]
[{"$f":"IF($E354<>\"\",MAX($A$1:INDIRECT(CONCATENATE(\"$A$\",ROW()-1)))+1,\"\")","v":""},{"$f":"IF(A354<>\"\",$A$3&A354,\"\")","v":""}]
[{"$f":"IF($E355<>\"\",MAX($A$1:INDIRECT(CONCATENATE(\"$A$\",ROW()-1)))+1,\"\")","v":114},"C1.114","PSA 8.5.1","Percentage adjustment on Item C1.113 for Contractor's overheads and profit (State % and extend as an amount)","%",5000000]
[]
[]
[]
[]
[{"$f":"IF($E360<>\"\",MAX($A$1:INDIRECT(CONCATENATE(\"$A$\",ROW()-1)))+1,\"\")","v":""},{"$f":"IF(A360<>\"\",$A$3&A360,\"\")","v":""},null," Carried forward / …"]
[{"$f":"IF($E361<>\"\",MAX($A$1:INDIRECT(CONCATENATE(\"$A$\",ROW()-1)))+1,\"\")","v":""},"",null," Brought forward / …"]
[]
[{"$f":"IF($E363<>\"\",MAX($A$1:INDIRECT(CONCATENATE(\"$A$\",ROW()-1)))+1,\"\")","v":""},"",null,"PIPELINES: PIPEWORK SPECIALS AND VALVE CHAMBERS"]
[{"$f":"IF($E364<>\"\",MAX($A$1:INDIRECT(CONCATENATE(\"$A$\",ROW()-1)))+1,\"\")","v":""},""]
[{"$f":"IF($E365<>\"\",MAX($A$1:INDIRECT(CONCATENATE(\"$A$\",ROW()-1)))+1,\"\")","v":""},"","DWS 1130\n10\nDWS 1110\n20.14.1\n20.14.2","Supply, deliver, laying, bedding and jointing of fittings and pipe specials on main pipeline and within valve chambers complete with couplings and pipe supports as scheduled. All steel pipework manufactured Grade X52 or S 355 JR  steel unless otherwise stated and lined and coated as specified in DWS 9900 C7"]
[{"$f":"IF($E366<>\"\",MAX($A$1:INDIRECT(CONCATENATE(\"$A$\",ROW()-1)))+1,\"\")","v":""},""]
[{"$f":"IF($E367<>\"\",MAX($A$1:INDIRECT(CONCATENATE(\"$A$\",ROW()-1)))+1,\"\")","v":""},"",null,"AIR VALVE INSTALLATION (100mm)"]
[{"$f":"IF($E368<>\"\",MAX($A$1:INDIRECT(CONCATENATE(\"$A$\",ROW()-1)))+1,\"\")","v":""},""]
[{"$f":"IF($E369<>\"\",MAX($A$1:INDIRECT(CONCATENATE(\"$A$\",ROW()-1)))+1,\"\")","v":""},"",null,"PN 63: Dwg 106777-0501-DRG-CC-0111"]
[{"$f":"IF($E370<>\"\",MAX($A$1:INDIRECT(CONCATENATE(\"$A$\",ROW()-1)))+1,\"\")","v":""},""]
[{"$f":"IF($E371<>\"\",MAX($A$1:INDIRECT(CONCATENATE(\"$A$\",ROW()-1)))+1,\"\")","v":115},"C1.115",null,"DN 700 x DN 700 equal tee; barrel 3840 mm F/F; branch 900mm C/F branch flanged; barrel plain ended; 11.1mm wall thickness","No",5]
[{"$f":"IF($E372<>\"\",MAX($A$1:INDIRECT(CONCATENATE(\"$A$\",ROW()-1)))+1,\"\")","v":""},""]
[{"$f":"IF($E373<>\"\",MAX($A$1:INDIRECT(CONCATENATE(\"$A$\",ROW()-1)))+1,\"\")","v":116},"C1.116",null,"DN 700 blank flange with DN 100 stub; stub 4 mm wall thickness; flanged both ends; 300 mm F/F; 4 No. per assembly 50 x 50 x 10 mm thick web plate welded to blank flange and stub.","No",5]
[{"$f":"IF($E374<>\"\",MAX($A$1:INDIRECT(CONCATENATE(\"$A$\",ROW()-1)))+1,\"\")","v":""},""]
[{"$f":"IF($E375<>\"\",MAX($A$1:INDIRECT(CONCATENATE(\"$A$\",ROW()-1)))+1,\"\")","v":""},"",null,"PN 40: Dwg 106777-0501-DRG-CC-0111"]
[{"$f":"IF($E376<>\"\",MAX($A$1:INDIRECT(CONCATENATE(\"$A$\",ROW()-1)))+1,\"\")","v":""},""]
[{"$f":"IF($E377<>\"\",MAX($A$1:INDIRECT(CONCATENATE(\"$A$\",ROW()-1)))+1,\"\")","v":117},"C1.117",null,"DN 700 x DN 700 equal tee; barrel 3840 mm F/F; branch 900mm C/F branch flanged; barrel plain ended; 9.3mm wall thickness","No",7]
[{"$f":"IF($E378<>\"\",MAX($A$1:INDIRECT(CONCATENATE(\"$A$\",ROW()-1)))+1,\"\")","v":""},""]
[{"$f":"IF($E379<>\"\",MAX($A$1:INDIRECT(CONCATENATE(\"$A$\",ROW()-1)))+1,\"\")","v":118},"C1.118",null,"DN 700 x DN 700 equal tee; barrel 3840 mm F/F; branch 900mm C/F branch flanged; barrel plain ended; 7.0mm wall thickness","No",11]
[{"$f":"IF($E380<>\"\",MAX($A$1:INDIRECT(CONCATENATE(\"$A$\",ROW()-1)))+1,\"\")","v":""},""]
[{"$f":"IF($E381<>\"\",MAX($A$1:INDIRECT(CONCATENATE(\"$A$\",ROW()-1)))+1,\"\")","v":119},"C1.119",null,"DN 700 blank flange with DN 100 stub; stub 4 mm wall thickness; flanged both ends; 300 mm F/F; 4 No. per assembly 50 x 50 x 10 mm thick web plate welded to blank flange and stub.","No",18]
[]
[{"$f":"IF($E383<>\"\",MAX($A$1:INDIRECT(CONCATENATE(\"$A$\",ROW()-1)))+1,\"\")","v":""},"",null,"SCOUR VALVE INSTALLATION (Type 1)"]
[{"$f":"IF($E384<>\"\",MAX($A$1:INDIRECT(CONCATENATE(\"$A$\",ROW()-1)))+1,\"\")","v":""},""]
[{"$f":"IF($E385<>\"\",MAX($A$1:INDIRECT(CONCATENATE(\"$A$\",ROW()-1)))+1,\"\")","v":""},"",null,"PN 63: Dwg 106777-0501-DRG-CC-0116"]
[{"$f":"IF($E386<>\"\",MAX($A$1:INDIRECT(CONCATENATE(\"$A$\",ROW()-1)))+1,\"\")","v":""},""]
[{"$f":"IF($E387<>\"\",MAX($A$1:INDIRECT(CONCATENATE(\"$A$\",ROW()-1)))+1,\"\")","v":120},"C1.120",null,"DN 700 x DN 200 plain ended scour tee; barrel 11.1 mm wall thickness, branch 4 mm wall thickness; barrel 1600 mm F/F with 90 degree flanged branch 900 mm C/F","No",1]
[]
[{"$f":"IF($E389<>\"\",MAX($A$1:INDIRECT(CONCATENATE(\"$A$\",ROW()-1)))+1,\"\")","v":""},{"$f":"IF(A389<>\"\",$A$3&A389,\"\")","v":""},null," Carried forward / …"]
[{"$f":"IF($E390<>\"\",MAX($A$1:INDIRECT(CONCATENATE(\"$A$\",ROW()-1)))+1,\"\")","v":""},"",null," Brought forward / …"]
[]
[{"$f":"IF($E392<>\"\",MAX($A$1:INDIRECT(CONCATENATE(\"$A$\",ROW()-1)))+1,\"\")","v":121},"C1.121",null,"DN 200 restrained flange adaptor","No",2]
[{"$f":"IF($E393<>\"\",MAX($A$1:INDIRECT(CONCATENATE(\"$A$\",ROW()-1)))+1,\"\")","v":""},""]
[{"$f":"IF($E394<>\"\",MAX($A$1:INDIRECT(CONCATENATE(\"$A$\",ROW()-1)))+1,\"\")","v":122},"C1.122",null,"DN 200 pipe, 4 mm wall thickness; loose flange one end with restraining flange at other end 1100 mm F/F","No",1]
[{"$f":"IF($E395<>\"\",MAX($A$1:INDIRECT(CONCATENATE(\"$A$\",ROW()-1)))+1,\"\")","v":""},""]
[{"$f":"IF($E396<>\"\",MAX($A$1:INDIRECT(CONCATENATE(\"$A$\",ROW()-1)))+1,\"\")","v":123},"C1.123",null,"DN 200 pipe; 4 mm wall thickness; flanged one end with restrained flange at other end; 1700 mm F/F","No",1]
[{"$f":"IF($E397<>\"\",MAX($A$1:INDIRECT(CONCATENATE(\"$A$\",ROW()-1)))+1,\"\")","v":""},""]
[{"$f":"IF($E398<>\"\",MAX($A$1:INDIRECT(CONCATENATE(\"$A$\",ROW()-1)))+1,\"\")","v":124},"C1.124",null,"DN 200 flanged jet disperser","No",1]
[]
[{"$f":"IF($E400<>\"\",MAX($A$1:INDIRECT(CONCATENATE(\"$A$\",ROW()-1)))+1,\"\")","v":""},"",null,"PN 40: Dwg 106777-0501-DRG-CC-0116"]
[{"$f":"IF($E401<>\"\",MAX($A$1:INDIRECT(CONCATENATE(\"$A$\",ROW()-1)))+1,\"\")","v":""},""]
[{"$f":"IF($E402<>\"\",MAX($A$1:INDIRECT(CONCATENATE(\"$A$\",ROW()-1)))+1,\"\")","v":125},"C1.125",null,"DN 700 x DN 200 plain ended scour tee; barrel 9.3 mm wall thickness, branch 4 mm wall thickness; barrel 1600 mm F/F with 90 degree flanged branch 900 mm C/F","No",1]
[{"$f":"IF($E403<>\"\",MAX($A$1:INDIRECT(CONCATENATE(\"$A$\",ROW()-1)))+1,\"\")","v":""},""]
[{"$f":"IF($E404<>\"\",MAX($A$1:INDIRECT(CONCATENATE(\"$A$\",ROW()-1)))+1,\"\")","v":126},"C1.126",null,"DN 700 x DN 200 plain ended scour tee; barrel 7.0 mm wall thickness, branch 4 mm wall thickness; barrel 1600 mm F/F with 90 degree flanged branch 900 mm C/F","No",1]
[{"$f":"IF($E405<>\"\",MAX($A$1:INDIRECT(CONCATENATE(\"$A$\",ROW()-1)))+1,\"\")","v":""},""]
[{"$f":"IF($E406<>\"\",MAX($A$1:INDIRECT(CONCATENATE(\"$A$\",ROW()-1)))+1,\"\")","v":127},"C1.127",null,"DN 200 restrained flange adaptor","No",4]
[{"$f":"IF($E407<>\"\",MAX($A$1:INDIRECT(CONCATENATE(\"$A$\",ROW()-1)))+1,\"\")","v":""},""]
[{"$f":"IF($E408<>\"\",MAX($A$1:INDIRECT(CONCATENATE(\"$A$\",ROW()-1)))+1,\"\")","v":128},"C1.128",null,"DN 200 pipe, 4 mm wall thickness; loose flange one end with restraining flange at other end 1100 mm F/F","No",2]
[{"$f":"IF($E409<>\"\",MAX($A$1:INDIRECT(CONCATENATE(\"$A$\",ROW()-1)))+1,\"\")","v":""},""]
[{"$f":"IF($E410<>\"\",MAX($A$1:INDIRECT(CONCATENATE(\"$A$\",ROW()-1)))+1,\"\")","v":129},"C1.129",null,"DN 200 pipe; 4 mm wall thickness; flanged one end with restrained flange at other end; 1700 mm F/F","No",2]
[{"$f":"IF($E411<>\"\",MAX($A$1:INDIRECT(CONCATENATE(\"$A$\",ROW()-1)))+1,\"\")","v":""},""]
[{"$f":"IF($E412<>\"\",MAX($A$1:INDIRECT(CONCATENATE(\"$A$\",ROW()-1)))+1,\"\")","v":130},"C1.130",null,"DN 200 flanged jet disperser","No",2]
[]
[{"$f":"IF($E414<>\"\",MAX($A$1:INDIRECT(CONCATENATE(\"$A$\",ROW()-1)))+1,\"\")","v":""},"",null,"SCOUR VALVE INSTALLATION (Type 2)"]
[{"$f":"IF($E415<>\"\",MAX($A$1:INDIRECT(CONCATENATE(\"$A$\",ROW()-1)))+1,\"\")","v":""},""]
[{"$f":"IF($E416<>\"\",MAX($A$1:INDIRECT(CONCATENATE(\"$A$\",ROW()-1)))+1,\"\")","v":""},"",null,"PN 40: Dwg 106777-0501-DRG-CC-0118"]
[{"$f":"IF($E417<>\"\",MAX($A$1:INDIRECT(CONCATENATE(\"$A$\",ROW()-1)))+1,\"\")","v":""},""]
[{"$f":"IF($E418<>\"\",MAX($A$1:INDIRECT(CONCATENATE(\"$A$\",ROW()-1)))+1,\"\")","v":131},{"$f":"IF(A418<>\"\",$A$3&A418,\"\")","v":"C1.131"},null,"DN 700 x DN 200 plain ended scour tee; barrel 7.0 mm wall thickness, branch 4 mm wall thickness; barrel 1600 mm F/F with 90 degree flanged branch 900 mm C/F","No",1]
[{"$f":"IF($E419<>\"\",MAX($A$1:INDIRECT(CONCATENATE(\"$A$\",ROW()-1)))+1,\"\")","v":""},""]
[{"$f":"IF($E420<>\"\",MAX($A$1:INDIRECT(CONCATENATE(\"$A$\",ROW()-1)))+1,\"\")","v":132},"C1.132",null,"DN 200 restrained flanged adaptor","No",3]
[{"$f":"IF($E421<>\"\",MAX($A$1:INDIRECT(CONCATENATE(\"$A$\",ROW()-1)))+1,\"\")","v":""},""]
[{"$f":"IF($E422<>\"\",MAX($A$1:INDIRECT(CONCATENATE(\"$A$\",ROW()-1)))+1,\"\")","v":133},"C1.133",null,"DN 200 pipe, 4 mm wall thickness; flanged one end, 1100 mm F/F","No",1]
[]
[]
[{"$f":"IF($E425<>\"\",MAX($A$1:INDIRECT(CONCATENATE(\"$A$\",ROW()-1)))+1,\"\")","v":""},{"$f":"IF(A425<>\"\",$A$3&A425,\"\")","v":""},null," Carried forward / …"]
[{"$f":"IF($E426<>\"\",MAX($A$1:INDIRECT(CONCATENATE(\"$A$\",ROW()-1)))+1,\"\")","v":""},"",null," Brought forward / …"]
[]
[{"$f":"IF($E428<>\"\",MAX($A$1:INDIRECT(CONCATENATE(\"$A$\",ROW()-1)))+1,\"\")","v":134},"C1.134",null,"DN 200 plain ended pipe, 4 mm wall thickness, 600 mm F/F","No",1]
[]
[{"$f":"IF($E430<>\"\",MAX($A$1:INDIRECT(CONCATENATE(\"$A$\",ROW()-1)))+1,\"\")","v":135},"C1.135",null,"DN 200 pipe, 4 mm wall thickness; flanged one end; 850 mm F/F","No",1]
[]
[{"$f":"IF($E432<>\"\",MAX($A$1:INDIRECT(CONCATENATE(\"$A$\",ROW()-1)))+1,\"\")","v":""},"",null,"SCOUR VALVE INSTALLATION (Type 3)"]
[{"$f":"IF($E433<>\"\",MAX($A$1:INDIRECT(CONCATENATE(\"$A$\",ROW()-1)))+1,\"\")","v":""},""]
[{"$f":"IF($E434<>\"\",MAX($A$1:INDIRECT(CONCATENATE(\"$A$\",ROW()-1)))+1,\"\")","v":""},"",null,"PN 63: Dwg 106777-0501-DRG-CC-0120"]
[{"$f":"IF($E435<>\"\",MAX($A$1:INDIRECT(CONCATENATE(\"$A$\",ROW()-1)))+1,\"\")","v":""},""]
[{"$f":"IF($E436<>\"\",MAX($A$1:INDIRECT(CONCATENATE(\"$A$\",ROW()-1)))+1,\"\")","v":136},"C1.136",null,"DN 700 x DN 700 equal tee; barrel, 11.1 mm wall thickness, 3840 mm F/F; branch 900 mm C/F; branch flanged","No",1]
[{"$f":"IF($E437<>\"\",MAX($A$1:INDIRECT(CONCATENATE(\"$A$\",ROW()-1)))+1,\"\")","v":""},""]
[{"$f":"IF($E438<>\"\",MAX($A$1:INDIRECT(CONCATENATE(\"$A$\",ROW()-1)))+1,\"\")","v":137},"C1.137",null,"DN 700 blank flange with DN 25 nipple","No",1]
[{"$f":"IF($E439<>\"\",MAX($A$1:INDIRECT(CONCATENATE(\"$A$\",ROW()-1)))+1,\"\")","v":""},""]
[{"$f":"IF($E440<>\"\",MAX($A$1:INDIRECT(CONCATENATE(\"$A$\",ROW()-1)))+1,\"\")","v":138},"C1.138",null,"DN 25 screw type ball valve","No",1]
[{"$f":"IF($E441<>\"\",MAX($A$1:INDIRECT(CONCATENATE(\"$A$\",ROW()-1)))+1,\"\")","v":""},""]
[{"$f":"IF($E442<>\"\",MAX($A$1:INDIRECT(CONCATENATE(\"$A$\",ROW()-1)))+1,\"\")","v":""},"",null,"PN 40: Dwg 106777-0501-DRG-CC-0120"]
[{"$f":"IF($E443<>\"\",MAX($A$1:INDIRECT(CONCATENATE(\"$A$\",ROW()-1)))+1,\"\")","v":""},""]
[{"$f":"IF($E444<>\"\",MAX($A$1:INDIRECT(CONCATENATE(\"$A$\",ROW()-1)))+1,\"\")","v":139},"C1.139",null,"DN 700 x DN 700 equal tee; barrel, 9.3 mm wall thickness, 3840 mm F/F; branch 900 mm C/F; branch flanged","No",2]
[{"$f":"IF($E445<>\"\",MAX($A$1:INDIRECT(CONCATENATE(\"$A$\",ROW()-1)))+1,\"\")","v":""},""]
[{"$f":"IF($E446<>\"\",MAX($A$1:INDIRECT(CONCATENATE(\"$A$\",ROW()-1)))+1,\"\")","v":140},"C1.140",null,"DN 700 x DN 700 equal tee; barrel, 7.0 mm wall thickness, 3840 mm F/F; branch 900 mm C/F; branch flanged","No",3]
[{"$f":"IF($E447<>\"\",MAX($A$1:INDIRECT(CONCATENATE(\"$A$\",ROW()-1)))+1,\"\")","v":""},""]
[{"$f":"IF($E448<>\"\",MAX($A$1:INDIRECT(CONCATENATE(\"$A$\",ROW()-1)))+1,\"\")","v":141},"C1.141",null,"DN 700 blank flange with DN 25 nipple","No",5]
[{"$f":"IF($E449<>\"\",MAX($A$1:INDIRECT(CONCATENATE(\"$A$\",ROW()-1)))+1,\"\")","v":""},""]
[{"$f":"IF($E450<>\"\",MAX($A$1:INDIRECT(CONCATENATE(\"$A$\",ROW()-1)))+1,\"\")","v":142},"C1.142",null,"DN 25 screw type ball valve","No",5]
[]
[{"$f":"IF($E452<>\"\",MAX($A$1:INDIRECT(CONCATENATE(\"$A$\",ROW()-1)))+1,\"\")","v":""},"",null,"NON-RETURN VALVE INSTALLATION"]
[{"$f":"IF($E453<>\"\",MAX($A$1:INDIRECT(CONCATENATE(\"$A$\",ROW()-1)))+1,\"\")","v":""},""]
[{"$f":"IF($E454<>\"\",MAX($A$1:INDIRECT(CONCATENATE(\"$A$\",ROW()-1)))+1,\"\")","v":""},"",null,"PN 40: Dwg 106777-0501-DRG-CC-0124"]
[{"$f":"IF($E455<>\"\",MAX($A$1:INDIRECT(CONCATENATE(\"$A$\",ROW()-1)))+1,\"\")","v":""},""]
[{"$f":"IF($E456<>\"\",MAX($A$1:INDIRECT(CONCATENATE(\"$A$\",ROW()-1)))+1,\"\")","v":143},"C1.143",null,"DN 700 pipe; 7mm wall thickness; flanged one end; 1100mm F/F","No",1]
[]
[{"$f":"IF($E458<>\"\",MAX($A$1:INDIRECT(CONCATENATE(\"$A$\",ROW()-1)))+1,\"\")","v":144},{"$f":"IF(A458<>\"\",$A$3&A458,\"\")","v":"C1.144"},null,"DN 700 x DN 400 reducing tee; barrel 7mm wall thickness; branch 4mm wall thickness; barrel flanged; barrel 1400mm F/F; branch 800mm C/F; flanged.","No",1]
[{"$f":"IF($E459<>\"\",MAX($A$1:INDIRECT(CONCATENATE(\"$A$\",ROW()-1)))+1,\"\")","v":""},""]
[{"$f":"IF($E460<>\"\",MAX($A$1:INDIRECT(CONCATENATE(\"$A$\",ROW()-1)))+1,\"\")","v":""},"",null,"DN 700 x DN 200 lateral tee, 45 degrees; barrel 7mm wall thickness; branch 4mm wall thickness; barrel flanged one end; barrel 2077mm F/F; branch 1500mm C/F, plain ended"]
[{"$f":"IF($E461<>\"\",MAX($A$1:INDIRECT(CONCATENATE(\"$A$\",ROW()-1)))+1,\"\")","v":""},""]
[{"$f":"IF($E462<>\"\",MAX($A$1:INDIRECT(CONCATENATE(\"$A$\",ROW()-1)))+1,\"\")","v":145},"C1.145",null,"DN 700 restrained flange adaptor","No",1]
[]
[{"$f":"IF($E464<>\"\",MAX($A$1:INDIRECT(CONCATENATE(\"$A$\",ROW()-1)))+1,\"\")","v":146},"C1.146",null,"DN 700 restrained flange adaptor","No",1]
[]
[{"$f":"IF($E466<>\"\",MAX($A$1:INDIRECT(CONCATENATE(\"$A$\",ROW()-1)))+1,\"\")","v":""},{"$f":"IF(A466<>\"\",$A$3&A466,\"\")","v":""},null," Carried forward / …"]
[{"$f":"IF($E467<>\"\",MAX($A$1:INDIRECT(CONCATENATE(\"$A$\",ROW()-1)))+1,\"\")","v":""},"",null," Brought forward / …"]
[]
[{"$f":"IF($E469<>\"\",MAX($A$1:INDIRECT(CONCATENATE(\"$A$\",ROW()-1)))+1,\"\")","v":147},"C1.147",null,"DN 700 straight pipe; 7mm wall thickness; flanged; 1000mm F/F","No",1]
[{"$f":"IF($E470<>\"\",MAX($A$1:INDIRECT(CONCATENATE(\"$A$\",ROW()-1)))+1,\"\")","v":""},""]
[{"$f":"IF($E471<>\"\",MAX($A$1:INDIRECT(CONCATENATE(\"$A$\",ROW()-1)))+1,\"\")","v":148},"C1.148",null,"DN 700 x DN 200 lateral tee, 45 degrees; barrel 7mm wall thickness; branch 4mm wall thickness; barrel flanged with PN 40 puddle flange; barrel 3213mm F/F; branch 1500mm C/F; flanged","No",1]
[{"$f":"IF($E472<>\"\",MAX($A$1:INDIRECT(CONCATENATE(\"$A$\",ROW()-1)))+1,\"\")","v":""},""]
[{"$f":"IF($E473<>\"\",MAX($A$1:INDIRECT(CONCATENATE(\"$A$\",ROW()-1)))+1,\"\")","v":149},"C1.149",null,"DN 700 blank flange","No",1]
[{"$f":"IF($E474<>\"\",MAX($A$1:INDIRECT(CONCATENATE(\"$A$\",ROW()-1)))+1,\"\")","v":""},""]
[{"$f":"IF($E475<>\"\",MAX($A$1:INDIRECT(CONCATENATE(\"$A$\",ROW()-1)))+1,\"\")","v":150},"C1.150",null,"DN 400 restrained flange adaptor","No",1]
[{"$f":"IF($E476<>\"\",MAX($A$1:INDIRECT(CONCATENATE(\"$A$\",ROW()-1)))+1,\"\")","v":""},""]
[{"$f":"IF($E477<>\"\",MAX($A$1:INDIRECT(CONCATENATE(\"$A$\",ROW()-1)))+1,\"\")","v":151},"C1.151",null,"DN 700 straight pipe; 4mm wall thickness; plain ended; 1270mm F/F","No",1]
[{"$f":"IF($E478<>\"\",MAX($A$1:INDIRECT(CONCATENATE(\"$A$\",ROW()-1)))+1,\"\")","v":""},""]
[{"$f":"IF($E479<>\"\",MAX($A$1:INDIRECT(CONCATENATE(\"$A$\",ROW()-1)))+1,\"\")","v":152},"C1.152",null,"DN 400 flange adaptor for DN 400 PVC pipe","No",1]
[{"$f":"IF($E480<>\"\",MAX($A$1:INDIRECT(CONCATENATE(\"$A$\",ROW()-1)))+1,\"\")","v":""},""]
[{"$f":"IF($E481<>\"\",MAX($A$1:INDIRECT(CONCATENATE(\"$A$\",ROW()-1)))+1,\"\")","v":153},"C1.153",null,"DN 200 45 degree bend, CF 652 mm and CF 270 mm; flanged","No",1]
[{"$f":"IF($E482<>\"\",MAX($A$1:INDIRECT(CONCATENATE(\"$A$\",ROW()-1)))+1,\"\")","v":""},""]
[{"$f":"IF($E483<>\"\",MAX($A$1:INDIRECT(CONCATENATE(\"$A$\",ROW()-1)))+1,\"\")","v":154},"C1.154",null,"DN 200 straight pipe; 4mm wall thickness; flanged; 682mm F/F","No",2]
[{"$f":"IF($E484<>\"\",MAX($A$1:INDIRECT(CONCATENATE(\"$A$\",ROW()-1)))+1,\"\")","v":""},""]
[{"$f":"IF($E485<>\"\",MAX($A$1:INDIRECT(CONCATENATE(\"$A$\",ROW()-1)))+1,\"\")","v":155},"C1.155",null,"DN 200 straight pipe; 4mm wall thickness; flanged; 682mm F/F","No",1]
[]
[{"$f":"IF($E487<>\"\",MAX($A$1:INDIRECT(CONCATENATE(\"$A$\",ROW()-1)))+1,\"\")","v":156},"C1.156",null,"DN 4200 45 degree bend, CF 402 mm and CF 167 mm; flanged","No",1]
[{"$f":"IF($E488<>\"\",MAX($A$1:INDIRECT(CONCATENATE(\"$A$\",ROW()-1)))+1,\"\")","v":""},""]
[{"$f":"IF($E489<>\"\",MAX($A$1:INDIRECT(CONCATENATE(\"$A$\",ROW()-1)))+1,\"\")","v":157},"C1.157",null,"DN 200 orifice plate, 6mm thick with 110 mm hole drilled in the middle","No",3]
[{"$f":"IF($E490<>\"\",MAX($A$1:INDIRECT(CONCATENATE(\"$A$\",ROW()-1)))+1,\"\")","v":""},""]
[{"$f":"IF($E491<>\"\",MAX($A$1:INDIRECT(CONCATENATE(\"$A$\",ROW()-1)))+1,\"\")","v":158},"C1.158",null,"DN 200 restrained flange adaptor","No",4]
[{"$f":"IF($E492<>\"\",MAX($A$1:INDIRECT(CONCATENATE(\"$A$\",ROW()-1)))+1,\"\")","v":""},""]
[{"$f":"IF($E493<>\"\",MAX($A$1:INDIRECT(CONCATENATE(\"$A$\",ROW()-1)))+1,\"\")","v":""},"",null,"VALVES"]
[{"$f":"IF($E494<>\"\",MAX($A$1:INDIRECT(CONCATENATE(\"$A$\",ROW()-1)))+1,\"\")","v":""},""]
[{"$f":"IF($E495<>\"\",MAX($A$1:INDIRECT(CONCATENATE(\"$A$\",ROW()-1)))+1,\"\")","v":""},"","DWS 2510\n6\nAUR 7012\n15\nDWS 1110\n20.15-A","Supply, deliver, lay, install and test valves complete as scheduled and shown on drawings."]
[]
[{"$f":"IF($E497<>\"\",MAX($A$1:INDIRECT(CONCATENATE(\"$A$\",ROW()-1)))+1,\"\")","v":""},"",null,"PN 63: Dwg 106777-0501-DRG-CC-0111"]
[{"$f":"IF($E498<>\"\",MAX($A$1:INDIRECT(CONCATENATE(\"$A$\",ROW()-1)))+1,\"\")","v":""},""]
[{"$f":"IF($E499<>\"\",MAX($A$1:INDIRECT(CONCATENATE(\"$A$\",ROW()-1)))+1,\"\")","v":159},"C1.159",null,"DN 100 flanged flanged wedge gate valve supplied with handwheel","No",5]
[{"$f":"IF($E500<>\"\",MAX($A$1:INDIRECT(CONCATENATE(\"$A$\",ROW()-1)))+1,\"\")","v":""},""]
[{"$f":"IF($E501<>\"\",MAX($A$1:INDIRECT(CONCATENATE(\"$A$\",ROW()-1)))+1,\"\")","v":160},"C1.160",null,"DN 100 flanged air valve","No",5]
[]
[]
[]
[{"$f":"IF($E505<>\"\",MAX($A$1:INDIRECT(CONCATENATE(\"$A$\",ROW()-1)))+1,\"\")","v":""},{"$f":"IF(A505<>\"\",$A$3&A505,\"\")","v":""},null," Carried forward / …"]
[{"$f":"IF($E506<>\"\",MAX($A$1:INDIRECT(CONCATENATE(\"$A$\",ROW()-1)))+1,\"\")","v":""},"",null," Brought forward / …"]
[]
[{"$f":"IF($E508<>\"\",MAX($A$1:INDIRECT(CONCATENATE(\"$A$\",ROW()-1)))+1,\"\")","v":""},"",null,"PN 40: Dwg 106777-0501-DRG-CC-0111"]
[{"$f":"IF($E509<>\"\",MAX($A$1:INDIRECT(CONCATENATE(\"$A$\",ROW()-1)))+1,\"\")","v":""},""]
[{"$f":"IF($E510<>\"\",MAX($A$1:INDIRECT(CONCATENATE(\"$A$\",ROW()-1)))+1,\"\")","v":161},"C1.161",null,"DN 100 flanged wedge gate valve supplied with handwheel","No",18]
[{"$f":"IF($E511<>\"\",MAX($A$1:INDIRECT(CONCATENATE(\"$A$\",ROW()-1)))+1,\"\")","v":""},""]
[{"$f":"IF($E512<>\"\",MAX($A$1:INDIRECT(CONCATENATE(\"$A$\",ROW()-1)))+1,\"\")","v":162},"C1.162",null,"DN 100 flanged air valve","No",18]
[{"$f":"IF($E513<>\"\",MAX($A$1:INDIRECT(CONCATENATE(\"$A$\",ROW()-1)))+1,\"\")","v":""},""]
[{"$f":"IF($E514<>\"\",MAX($A$1:INDIRECT(CONCATENATE(\"$A$\",ROW()-1)))+1,\"\")","v":""},"",null,"PN 63: Dwg 106777-0501-DRG-CC-0116"]
[{"$f":"IF($E515<>\"\",MAX($A$1:INDIRECT(CONCATENATE(\"$A$\",ROW()-1)))+1,\"\")","v":""},""]
[{"$f":"IF($E516<>\"\",MAX($A$1:INDIRECT(CONCATENATE(\"$A$\",ROW()-1)))+1,\"\")","v":163},"C1.163",null,"DN 200 flanged flanged wedge gate valve supplied with handwheel","No",1]
[{"$f":"IF($E517<>\"\",MAX($A$1:INDIRECT(CONCATENATE(\"$A$\",ROW()-1)))+1,\"\")","v":""},""]
[{"$f":"IF($E518<>\"\",MAX($A$1:INDIRECT(CONCATENATE(\"$A$\",ROW()-1)))+1,\"\")","v":""},"",null,"PN 40: Dwg 106777-0501-DRG-CC-0116 & 118"]
[{"$f":"IF($E519<>\"\",MAX($A$1:INDIRECT(CONCATENATE(\"$A$\",ROW()-1)))+1,\"\")","v":""},""]
[{"$f":"IF($E520<>\"\",MAX($A$1:INDIRECT(CONCATENATE(\"$A$\",ROW()-1)))+1,\"\")","v":164},"C1.164",null,"DN 200 flanged flanged wedge gate valve supplied with handwheel","No",4]
[{"$f":"IF($E521<>\"\",MAX($A$1:INDIRECT(CONCATENATE(\"$A$\",ROW()-1)))+1,\"\")","v":""},""]
[{"$f":"IF($E522<>\"\",MAX($A$1:INDIRECT(CONCATENATE(\"$A$\",ROW()-1)))+1,\"\")","v":""},{"$f":"IF(A522<>\"\",$A$3&A522,\"\")","v":""},null,"PN 40: Dwg 106777-0501-DRG-CC-0124"]
[{"$f":"IF($E523<>\"\",MAX($A$1:INDIRECT(CONCATENATE(\"$A$\",ROW()-1)))+1,\"\")","v":""},""]
[{"$f":"IF($E524<>\"\",MAX($A$1:INDIRECT(CONCATENATE(\"$A$\",ROW()-1)))+1,\"\")","v":165},"C1.165",null,"DN 700 flanged non-return valve","No",1]
[{"$f":"IF($E525<>\"\",MAX($A$1:INDIRECT(CONCATENATE(\"$A$\",ROW()-1)))+1,\"\")","v":""},""]
[{"$f":"IF($E526<>\"\",MAX($A$1:INDIRECT(CONCATENATE(\"$A$\",ROW()-1)))+1,\"\")","v":166},"C1.166",null,"DN 700 flanged butterfly valve","No",1]
[{"$f":"IF($E527<>\"\",MAX($A$1:INDIRECT(CONCATENATE(\"$A$\",ROW()-1)))+1,\"\")","v":""},""]
[{"$f":"IF($E528<>\"\",MAX($A$1:INDIRECT(CONCATENATE(\"$A$\",ROW()-1)))+1,\"\")","v":167},"C1.167",null,"DN 400 flanged butterfly valve","No",1]
[{"$f":"IF($E529<>\"\",MAX($A$1:INDIRECT(CONCATENATE(\"$A$\",ROW()-1)))+1,\"\")","v":""},""]
[{"$f":"IF($E530<>\"\",MAX($A$1:INDIRECT(CONCATENATE(\"$A$\",ROW()-1)))+1,\"\")","v":168},"C1.168",null,"DN 200 flanged wedge gate valve","No",2]
[{"$f":"IF($E531<>\"\",MAX($A$1:INDIRECT(CONCATENATE(\"$A$\",ROW()-1)))+1,\"\")","v":""},""]
[{"$f":"IF($E532<>\"\",MAX($A$1:INDIRECT(CONCATENATE(\"$A$\",ROW()-1)))+1,\"\")","v":""},"",null,"VALVE CHAMBERS"]
[{"$f":"IF($E533<>\"\",MAX($A$1:INDIRECT(CONCATENATE(\"$A$\",ROW()-1)))+1,\"\")","v":""},""]
[{"$f":"IF($E534<>\"\",MAX($A$1:INDIRECT(CONCATENATE(\"$A$\",ROW()-1)))+1,\"\")","v":""},""," ","Air valve chambers (100mm)"]
[{"$f":"IF($E535<>\"\",MAX($A$1:INDIRECT(CONCATENATE(\"$A$\",ROW()-1)))+1,\"\")","v":""},"",null,"106777-0501-DRG-CC-0111"]
[{"$f":"IF($E536<>\"\",MAX($A$1:INDIRECT(CONCATENATE(\"$A$\",ROW()-1)))+1,\"\")","v":""},""]
[{"$f":"IF($E537<>\"\",MAX($A$1:INDIRECT(CONCATENATE(\"$A$\",ROW()-1)))+1,\"\")","v":169},"C1.169","DWS 1110\n20.17","Construct air valve chambers complete, 3460 mm high from bottom of foundation footing to top of roof, with 130 kg/m³ reinforcing where applicable, access manhole, air vents, ladder, etc. The rate shall include all joints, shuttering and wood-float finish","No",22]
[{"$f":"IF($E538<>\"\",MAX($A$1:INDIRECT(CONCATENATE(\"$A$\",ROW()-1)))+1,\"\")","v":""},""]
[{"$f":"IF($E539<>\"\",MAX($A$1:INDIRECT(CONCATENATE(\"$A$\",ROW()-1)))+1,\"\")","v":170},"C1.170",null,"Extra-over for the above per chamber to increase the height by 250mm","Sum","-",null,"Rate only"]
[{"$f":"IF($E540<>\"\",MAX($A$1:INDIRECT(CONCATENATE(\"$A$\",ROW()-1)))+1,\"\")","v":""},""]
[{"$f":"IF($E541<>\"\",MAX($A$1:INDIRECT(CONCATENATE(\"$A$\",ROW()-1)))+1,\"\")","v":171},"C1.171","DWS 0750\n15.8","Extra-over for the above per chamber for casting in of DN 700 pipes","No",44]
[]
[]
[]
[]
[]
[]
[]
[{"$f":"IF($E549<>\"\",MAX($A$1:INDIRECT(CONCATENATE(\"$A$\",ROW()-1)))+1,\"\")","v":""},{"$f":"IF(A549<>\"\",$A$3&A549,\"\")","v":""},null," Carried forward / …"]
[{"$f":"IF($E550<>\"\",MAX($A$1:INDIRECT(CONCATENATE(\"$A$\",ROW()-1)))+1,\"\")","v":""},"",null," Brought forward / …"]
[]
[{"$f":"IF($E552<>\"\",MAX($A$1:INDIRECT(CONCATENATE(\"$A$\",ROW()-1)))+1,\"\")","v":""},""," ","Scour valve chambers"]
[{"$f":"IF($E553<>\"\",MAX($A$1:INDIRECT(CONCATENATE(\"$A$\",ROW()-1)))+1,\"\")","v":""},""]
[{"$f":"IF($E554<>\"\",MAX($A$1:INDIRECT(CONCATENATE(\"$A$\",ROW()-1)))+1,\"\")","v":""},"",null,"Type 1"]
[{"$f":"IF($E555<>\"\",MAX($A$1:INDIRECT(CONCATENATE(\"$A$\",ROW()-1)))+1,\"\")","v":""},"",null,"106777-0501-DRG-CC-0116"]
[{"$f":"IF($E556<>\"\",MAX($A$1:INDIRECT(CONCATENATE(\"$A$\",ROW()-1)))+1,\"\")","v":""},""]
[{"$f":"IF($E557<>\"\",MAX($A$1:INDIRECT(CONCATENATE(\"$A$\",ROW()-1)))+1,\"\")","v":172},"C1.172","DWS 1110\n20.17","Construct scour valve chambers complete, 3700 mm high from bottom of foundation footing to top of roof, with 130 kg/m³ reinforcing where applicable, access manholes, ladders, etc. The rate shall include all shuttering, wood-float finish and screeding of floor. Concrete to be water retaining concrete (35/19 MPa).","No",3]
[{"$f":"IF($E558<>\"\",MAX($A$1:INDIRECT(CONCATENATE(\"$A$\",ROW()-1)))+1,\"\")","v":""},""]
[{"$f":"IF($E559<>\"\",MAX($A$1:INDIRECT(CONCATENATE(\"$A$\",ROW()-1)))+1,\"\")","v":173},"C1.173",null,"Extra-over for the above per chamber to increase the height by 250mm","Sum","-",null,"Rate only"]
[{"$f":"IF($E560<>\"\",MAX($A$1:INDIRECT(CONCATENATE(\"$A$\",ROW()-1)))+1,\"\")","v":""},""]
[{"$f":"IF($E561<>\"\",MAX($A$1:INDIRECT(CONCATENATE(\"$A$\",ROW()-1)))+1,\"\")","v":174},"C1.174","DWS 0750\n15.8","Extra-over for the above chamber for casting in of DN 200 pipes","No",6]
[{"$f":"IF($E562<>\"\",MAX($A$1:INDIRECT(CONCATENATE(\"$A$\",ROW()-1)))+1,\"\")","v":""},""]
[{"$f":"IF($E563<>\"\",MAX($A$1:INDIRECT(CONCATENATE(\"$A$\",ROW()-1)))+1,\"\")","v":175},"C1.175","DWS 1110\n20.17.2","Extra-over for the above per chamber for installing fibre glass grill","No",3]
[]
[{"$f":"IF($E565<>\"\",MAX($A$1:INDIRECT(CONCATENATE(\"$A$\",ROW()-1)))+1,\"\")","v":""},"",null,"Type 2"]
[{"$f":"IF($E566<>\"\",MAX($A$1:INDIRECT(CONCATENATE(\"$A$\",ROW()-1)))+1,\"\")","v":""},"",null,"106777-0501-DRG-CC-0118"]
[{"$f":"IF($E567<>\"\",MAX($A$1:INDIRECT(CONCATENATE(\"$A$\",ROW()-1)))+1,\"\")","v":""},""]
[{"$f":"IF($E568<>\"\",MAX($A$1:INDIRECT(CONCATENATE(\"$A$\",ROW()-1)))+1,\"\")","v":176},"C1.176","DWS 1110\n20.17","Construct scour valve chambers complete, 3700 mm high from bottom of foundation footing to top of roof, with 130 kg/m³ reinforcing where applicable, access manholes, ladders, etc. The rate shall include all shuttering, wood-float finish and screeding of floor. Concrete to be water retaining concrete (35/19 MPa).","No",1]
[]
[{"$f":"IF($E570<>\"\",MAX($A$1:INDIRECT(CONCATENATE(\"$A$\",ROW()-1)))+1,\"\")","v":177},"C1.177",null,"Extra-over for the above per chamber to increase the height by 250mm","Sum","-",null,"Rate only"]
[{"$f":"IF($E571<>\"\",MAX($A$1:INDIRECT(CONCATENATE(\"$A$\",ROW()-1)))+1,\"\")","v":""},""]
[{"$f":"IF($E572<>\"\",MAX($A$1:INDIRECT(CONCATENATE(\"$A$\",ROW()-1)))+1,\"\")","v":178},"C1.178","DWS 0750\n15.8","Extra-over for the above chamber for casting in of DN 200 pipes","No",2]
[{"$f":"IF($E573<>\"\",MAX($A$1:INDIRECT(CONCATENATE(\"$A$\",ROW()-1)))+1,\"\")","v":""},""]
[{"$f":"IF($E574<>\"\",MAX($A$1:INDIRECT(CONCATENATE(\"$A$\",ROW()-1)))+1,\"\")","v":179},"C1.179","DWS 1110\n20.17.2","Extra-over for the above per chamber for installing fibre glass grill","No",1]
[{"$f":"IF($E575<>\"\",MAX($A$1:INDIRECT(CONCATENATE(\"$A$\",ROW()-1)))+1,\"\")","v":""},""]
[{"$f":"IF($E576<>\"\",MAX($A$1:INDIRECT(CONCATENATE(\"$A$\",ROW()-1)))+1,\"\")","v":""},"",null,"Type 3"]
[{"$f":"IF($E577<>\"\",MAX($A$1:INDIRECT(CONCATENATE(\"$A$\",ROW()-1)))+1,\"\")","v":""},"",null,"106777-0501-DRG-CC-0120"]
[{"$f":"IF($E578<>\"\",MAX($A$1:INDIRECT(CONCATENATE(\"$A$\",ROW()-1)))+1,\"\")","v":""},""]
[{"$f":"IF($E579<>\"\",MAX($A$1:INDIRECT(CONCATENATE(\"$A$\",ROW()-1)))+1,\"\")","v":180},"C1.180","DWS 1110\n20.17","Construct scour valve chambers complete, 3700 mm high from bottom of foundation footing to top of roof, with 130 kg/m³ reinforcing where applicable, access manholes, ladders, etc. The rate shall include all shuttering, wood-float finish and screeding of floor. Concrete to be water retaining concrete (35/19 MPa).","No",6]
[]
[{"$f":"IF($E581<>\"\",MAX($A$1:INDIRECT(CONCATENATE(\"$A$\",ROW()-1)))+1,\"\")","v":""},{"$f":"IF(A581<>\"\",$A$3&A581,\"\")","v":""},null," Carried forward / …"]
[{"$f":"IF($E582<>\"\",MAX($A$1:INDIRECT(CONCATENATE(\"$A$\",ROW()-1)))+1,\"\")","v":""},"",null," Brought forward / …"]
[]
[{"$f":"IF($E584<>\"\",MAX($A$1:INDIRECT(CONCATENATE(\"$A$\",ROW()-1)))+1,\"\")","v":181},"C1.181",null,"Extra-over for the above per chamber to increase the height by 250mm","Sum","-",null,"Rate only"]
[{"$f":"IF($E585<>\"\",MAX($A$1:INDIRECT(CONCATENATE(\"$A$\",ROW()-1)))+1,\"\")","v":""},""]
[{"$f":"IF($E586<>\"\",MAX($A$1:INDIRECT(CONCATENATE(\"$A$\",ROW()-1)))+1,\"\")","v":182},"C1.182","DWS 0750\n15.8","Extra-over for the above chamber for casting in of DN 700 pipes","No",12]
[]
[{"$f":"IF($E588<>\"\",MAX($A$1:INDIRECT(CONCATENATE(\"$A$\",ROW()-1)))+1,\"\")","v":""},{"$f":"IF(A588<>\"\",$A$3&A588,\"\")","v":""},null,"Non-return valve chamber"]
[{"$f":"IF($E589<>\"\",MAX($A$1:INDIRECT(CONCATENATE(\"$A$\",ROW()-1)))+1,\"\")","v":""},"",null,"106777-0501-DRG-CC-0124"]
[{"$f":"IF($E590<>\"\",MAX($A$1:INDIRECT(CONCATENATE(\"$A$\",ROW()-1)))+1,\"\")","v":""},""]
[{"$f":"IF($E591<>\"\",MAX($A$1:INDIRECT(CONCATENATE(\"$A$\",ROW()-1)))+1,\"\")","v":183},"C1.183","DWS 1110\n20.17","Construct Non-return valve chambers complete, 3400 mm high from bottom of foundation footing to top of roof, with 130 kg/m³ reinforcing where applicable, access manholes, ladders, etc. The rate shall include all shuttering, wood-float finish and screeding of floor. Concrete to be water retaining concrete (35/19 MPa).","No",1]
[{"$f":"IF($E592<>\"\",MAX($A$1:INDIRECT(CONCATENATE(\"$A$\",ROW()-1)))+1,\"\")","v":""},""]
[{"$f":"IF($E593<>\"\",MAX($A$1:INDIRECT(CONCATENATE(\"$A$\",ROW()-1)))+1,\"\")","v":184},"C1.184",null,"Extra-over for the above per chamber to increase the height by 250mm","Sum","-",null,"Rate only"]
[{"$f":"IF($E594<>\"\",MAX($A$1:INDIRECT(CONCATENATE(\"$A$\",ROW()-1)))+1,\"\")","v":""},""]
[{"$f":"IF($E595<>\"\",MAX($A$1:INDIRECT(CONCATENATE(\"$A$\",ROW()-1)))+1,\"\")","v":185},"C1.185","DWS 0750\n15.8","Extra-over for the above chamber for casting in of DN 700 pipes","No",2]
[{"$f":"IF($E596<>\"\",MAX($A$1:INDIRECT(CONCATENATE(\"$A$\",ROW()-1)))+1,\"\")","v":""},""]
[{"$f":"IF($E597<>\"\",MAX($A$1:INDIRECT(CONCATENATE(\"$A$\",ROW()-1)))+1,\"\")","v":186},"C1.186",null,"Extra-over for the above per chamber for casting in of DN 400 pipes","No",1]
[{"$f":"IF($E598<>\"\",MAX($A$1:INDIRECT(CONCATENATE(\"$A$\",ROW()-1)))+1,\"\")","v":""},""]
[{"$f":"IF($E599<>\"\",MAX($A$1:INDIRECT(CONCATENATE(\"$A$\",ROW()-1)))+1,\"\")","v":""},"",null,"ROAD CROSSINGS"]
[{"$f":"IF($E600<>\"\",MAX($A$1:INDIRECT(CONCATENATE(\"$A$\",ROW()-1)))+1,\"\")","v":""},""]
[null,null,"SANS"]
[{"$f":"IF($E602<>\"\",MAX($A$1:INDIRECT(CONCATENATE(\"$A$\",ROW()-1)))+1,\"\")","v":""},"","1200 LG","Jacking Establishment"]
[{"$f":"IF($E603<>\"\",MAX($A$1:INDIRECT(CONCATENATE(\"$A$\",ROW()-1)))+1,\"\")","v":""},""]
[{"$f":"IF($E604<>\"\",MAX($A$1:INDIRECT(CONCATENATE(\"$A$\",ROW()-1)))+1,\"\")","v":187},"C1.187","8.2.1","Fixed charges","Sum","-"]
[{"$f":"IF($E605<>\"\",MAX($A$1:INDIRECT(CONCATENATE(\"$A$\",ROW()-1)))+1,\"\")","v":""},""]
[{"$f":"IF($E606<>\"\",MAX($A$1:INDIRECT(CONCATENATE(\"$A$\",ROW()-1)))+1,\"\")","v":188},"C1.188",null,"Time related charges","Sum","-"]
[{"$f":"IF($E607<>\"\",MAX($A$1:INDIRECT(CONCATENATE(\"$A$\",ROW()-1)))+1,\"\")","v":""},""]
[{"$f":"IF($E608<>\"\",MAX($A$1:INDIRECT(CONCATENATE(\"$A$\",ROW()-1)))+1,\"\")","v":""},"","8.2.4\nPSD 8.3.3","Excavation for jacking"]
[{"$f":"IF($E609<>\"\",MAX($A$1:INDIRECT(CONCATENATE(\"$A$\",ROW()-1)))+1,\"\")","v":""},""]
[{"$f":"IF($E610<>\"\",MAX($A$1:INDIRECT(CONCATENATE(\"$A$\",ROW()-1)))+1,\"\")","v":189},"C1.189",null,"Excavate for pipe at the drilling face (including removal and disposed of surplus excavated material). Rate shall include any shoring that is required","m³",144]
[{"$f":"IF($E611<>\"\",MAX($A$1:INDIRECT(CONCATENATE(\"$A$\",ROW()-1)))+1,\"\")","v":""},""]
[{"$f":"IF($E612<>\"\",MAX($A$1:INDIRECT(CONCATENATE(\"$A$\",ROW()-1)))+1,\"\")","v":""},"","PSD 8.3.3","Extra over for Excavation for jacking above:"]
[{"$f":"IF($E613<>\"\",MAX($A$1:INDIRECT(CONCATENATE(\"$A$\",ROW()-1)))+1,\"\")","v":""},""]
[{"$f":"IF($E614<>\"\",MAX($A$1:INDIRECT(CONCATENATE(\"$A$\",ROW()-1)))+1,\"\")","v":190},"C1.190",null,"Hard rock excavation","m³",61]
[{"$f":"IF($E615<>\"\",MAX($A$1:INDIRECT(CONCATENATE(\"$A$\",ROW()-1)))+1,\"\")","v":""},""]
[{"$f":"IF($E616<>\"\",MAX($A$1:INDIRECT(CONCATENATE(\"$A$\",ROW()-1)))+1,\"\")","v":191},"C1.191",null,"Excavate by hand in soft material to expose existing services","m³",20]
[]
[]
[]
[{"$f":"IF($E620<>\"\",MAX($A$1:INDIRECT(CONCATENATE(\"$A$\",ROW()-1)))+1,\"\")","v":""},{"$f":"IF(A620<>\"\",$A$3&A620,\"\")","v":""},null," Carried forward / …"]
[{"$f":"IF($E621<>\"\",MAX($A$1:INDIRECT(CONCATENATE(\"$A$\",ROW()-1)))+1,\"\")","v":""},"",null," Brought forward / …"]
[]
[{"$f":"IF($E623<>\"\",MAX($A$1:INDIRECT(CONCATENATE(\"$A$\",ROW()-1)))+1,\"\")","v":""},"","8.2.6\nPSLG 8.2.6","Supply and install pipes by means of jacking for the following pipes:"]
[{"$f":"IF($E624<>\"\",MAX($A$1:INDIRECT(CONCATENATE(\"$A$\",ROW()-1)))+1,\"\")","v":""},""]
[{"$f":"IF($E625<>\"\",MAX($A$1:INDIRECT(CONCATENATE(\"$A$\",ROW()-1)))+1,\"\")","v":192},"C1.192",null,"DN 1350 Class 100 D Type SC reinforced concrete pipes","m",70]
[{"$f":"IF($E626<>\"\",MAX($A$1:INDIRECT(CONCATENATE(\"$A$\",ROW()-1)))+1,\"\")","v":""},""]
[{"$f":"IF($E627<>\"\",MAX($A$1:INDIRECT(CONCATENATE(\"$A$\",ROW()-1)))+1,\"\")","v":""},"",null,"Miscellaneous"]
[{"$f":"IF($E628<>\"\",MAX($A$1:INDIRECT(CONCATENATE(\"$A$\",ROW()-1)))+1,\"\")","v":""},""]
[{"$f":"IF($E629<>\"\",MAX($A$1:INDIRECT(CONCATENATE(\"$A$\",ROW()-1)))+1,\"\")","v":193},"C1.193","DWS 1110\n20.14.4\n1200 A\nPSA 8.10","Lay, joint, fix and test DN 700 steel pipes in the pipe sleeves complete with trolley system as detailed on Dwg No 106777-0501-DRG-CC-0104","m",70]
[{"$f":"IF($E630<>\"\",MAX($A$1:INDIRECT(CONCATENATE(\"$A$\",ROW()-1)))+1,\"\")","v":""},""]
[{"$f":"IF($E631<>\"\",MAX($A$1:INDIRECT(CONCATENATE(\"$A$\",ROW()-1)))+1,\"\")","v":194},"C1.194","PSLG 8.2.10","Standing time for pipe jacking","Day",7]
[{"$f":"IF($E632<>\"\",MAX($A$1:INDIRECT(CONCATENATE(\"$A$\",ROW()-1)))+1,\"\")","v":""},""]
[{"$f":"IF($E633<>\"\",MAX($A$1:INDIRECT(CONCATENATE(\"$A$\",ROW()-1)))+1,\"\")","v":195},"C1.195","PSLG 8.2.11","Recording of movements","Sum","-","-"]
[{"$f":"IF($E634<>\"\",MAX($A$1:INDIRECT(CONCATENATE(\"$A$\",ROW()-1)))+1,\"\")","v":""},""]
[{"$f":"IF($E635<>\"\",MAX($A$1:INDIRECT(CONCATENATE(\"$A$\",ROW()-1)))+1,\"\")","v":196},"C1.196","PSLG 8.2.12","Brick-up ends of pipe sleeve","No",4]
[{"$f":"IF($E636<>\"\",MAX($A$1:INDIRECT(CONCATENATE(\"$A$\",ROW()-1)))+1,\"\")","v":""},""]
[{"$f":"IF($E637<>\"\",MAX($A$1:INDIRECT(CONCATENATE(\"$A$\",ROW()-1)))+1,\"\")","v":197},"C1.197","PSLG 8.2.13","Pipe Markers","No",4]
[{"$f":"IF($E638<>\"\",MAX($A$1:INDIRECT(CONCATENATE(\"$A$\",ROW()-1)))+1,\"\")","v":""},""]
[{"$f":"IF($E639<>\"\",MAX($A$1:INDIRECT(CONCATENATE(\"$A$\",ROW()-1)))+1,\"\")","v":""},"","SANS"]
[{"$f":"IF($E640<>\"\",MAX($A$1:INDIRECT(CONCATENATE(\"$A$\",ROW()-1)))+1,\"\")","v":""},"","1200 DB ","FIBRE OPTIC CONDUITS"]
[{"$f":"IF($E641<>\"\",MAX($A$1:INDIRECT(CONCATENATE(\"$A$\",ROW()-1)))+1,\"\")","v":""},""]
[{"$f":"IF($E642<>\"\",MAX($A$1:INDIRECT(CONCATENATE(\"$A$\",ROW()-1)))+1,\"\")","v":""},"",null,"Trench Excavation"]
[{"$f":"IF($E643<>\"\",MAX($A$1:INDIRECT(CONCATENATE(\"$A$\",ROW()-1)))+1,\"\")","v":""},""]
[{"$f":"IF($E644<>\"\",MAX($A$1:INDIRECT(CONCATENATE(\"$A$\",ROW()-1)))+1,\"\")","v":""},"","8.3.2\nPSDB 8.3.2\nPSDB 8.3.3","Excavate in all materials for trenches, backfill, compact and disposal of surplus  material for:"]
[{"$f":"IF($E645<>\"\",MAX($A$1:INDIRECT(CONCATENATE(\"$A$\",ROW()-1)))+1,\"\")","v":""},""]
[{"$f":"IF($E646<>\"\",MAX($A$1:INDIRECT(CONCATENATE(\"$A$\",ROW()-1)))+1,\"\")","v":""},""," ","Pipes of up to DN 32 mm for depths:"]
[{"$f":"IF($E647<>\"\",MAX($A$1:INDIRECT(CONCATENATE(\"$A$\",ROW()-1)))+1,\"\")","v":""},""]
[{"$f":"IF($E648<>\"\",MAX($A$1:INDIRECT(CONCATENATE(\"$A$\",ROW()-1)))+1,\"\")","v":""},"",null,"Over      and       Up to"]
[{"$f":"IF($E649<>\"\",MAX($A$1:INDIRECT(CONCATENATE(\"$A$\",ROW()-1)))+1,\"\")","v":""},""]
[{"$f":"IF($E650<>\"\",MAX($A$1:INDIRECT(CONCATENATE(\"$A$\",ROW()-1)))+1,\"\")","v":198},"C1.198",null,"0 m                     1,2 m","  m",13831]
[{"$f":"IF($E651<>\"\",MAX($A$1:INDIRECT(CONCATENATE(\"$A$\",ROW()-1)))+1,\"\")","v":""},""]
[{"$f":"IF($E652<>\"\",MAX($A$1:INDIRECT(CONCATENATE(\"$A$\",ROW()-1)))+1,\"\")","v":199},{"$f":"IF(A652<>\"\",$A$3&A652,\"\")","v":"C1.199"},null,"1,2 m                  2,0 m","  m",200]
[{"$f":"IF($E653<>\"\",MAX($A$1:INDIRECT(CONCATENATE(\"$A$\",ROW()-1)))+1,\"\")","v":""},""]
[{"$f":"IF($E654<>\"\",MAX($A$1:INDIRECT(CONCATENATE(\"$A$\",ROW()-1)))+1,\"\")","v":""},"","8.3.2\nPSD 8.3.2","Extra Over Items C1.197-C1.198 Trench Excavations above:"]
[{"$f":"IF($E655<>\"\",MAX($A$1:INDIRECT(CONCATENATE(\"$A$\",ROW()-1)))+1,\"\")","v":""},""]
[{"$f":"IF($E656<>\"\",MAX($A$1:INDIRECT(CONCATENATE(\"$A$\",ROW()-1)))+1,\"\")","v":200},"C1.200"," ","Hard rock excavation","m3",1380]
[{"$f":"IF($E657<>\"\",MAX($A$1:INDIRECT(CONCATENATE(\"$A$\",ROW()-1)))+1,\"\")","v":""},""]
[{"$f":"IF($E658<>\"\",MAX($A$1:INDIRECT(CONCATENATE(\"$A$\",ROW()-1)))+1,\"\")","v":""},"","1200 LC","Supply, lay, bed and test duct"]
[{"$f":"IF($E659<>\"\",MAX($A$1:INDIRECT(CONCATENATE(\"$A$\",ROW()-1)))+1,\"\")","v":""},""]
[{"$f":"IF($E660<>\"\",MAX($A$1:INDIRECT(CONCATENATE(\"$A$\",ROW()-1)))+1,\"\")","v":201},"C1.201","8.2.5","32 mm HDPE Fibre optic conduit","m",13831]
[{"$f":"IF($E661<>\"\",MAX($A$1:INDIRECT(CONCATENATE(\"$A$\",ROW()-1)))+1,\"\")","v":""},""]
[{"$f":"IF($E662<>\"\",MAX($A$1:INDIRECT(CONCATENATE(\"$A$\",ROW()-1)))+1,\"\")","v":202},"C1.202","8.2.7","Fibre optic telebox","No",75]
[{"$f":"IF($E663<>\"\",MAX($A$1:INDIRECT(CONCATENATE(\"$A$\",ROW()-1)))+1,\"\")","v":""},""]
[{"$f":"IF($E664<>\"\",MAX($A$1:INDIRECT(CONCATENATE(\"$A$\",ROW()-1)))+1,\"\")","v":""},"","8.2.2.3\nPSLB 8.2.2.3","From commercial sources:"]
[{"$f":"IF($E665<>\"\",MAX($A$1:INDIRECT(CONCATENATE(\"$A$\",ROW()-1)))+1,\"\")","v":""},""]
[{"$f":"IF($E666<>\"\",MAX($A$1:INDIRECT(CONCATENATE(\"$A$\",ROW()-1)))+1,\"\")","v":203},"C1.203",null,"Selected granular material","m3",2200]
[{"$f":"IF($E667<>\"\",MAX($A$1:INDIRECT(CONCATENATE(\"$A$\",ROW()-1)))+1,\"\")","v":""},""]
[{"$f":"IF($E668<>\"\",MAX($A$1:INDIRECT(CONCATENATE(\"$A$\",ROW()-1)))+1,\"\")","v":""},"",null," TOTAL SECTION C1:\n Carried to Summary",null,null,"R"]

{"sheet":"Section C2","index":5,"n_rows":226,"n_cols":8,"rows_kept":226,"cut":false,"hidden":false,"merged":[]}
["Item No","Item No","Payment Clause","Short Description","Unit","Quantity","Rate","Amount\n R             c"]
[]
["C2.",null,"SANS","SECTION: C2"]
[null,null,"1200 C","DN 400 PVC PIPELINE"]
[]
[{"$f":"IF($E6<>\"\",MAX($A$1:INDIRECT(CONCATENATE(\"$A$\",ROW()-1)))+1,\"\")","v":""},{"$f":"IF(A6<>\"\",$A$3&A6,\"\")","v":""},null,"Excavation for DN 400 uPVC Pipeline"]
[{"$f":"IF($E7<>\"\",MAX($A$1:INDIRECT(CONCATENATE(\"$A$\",ROW()-1)))+1,\"\")","v":""},""]
[{"$f":"IF($E8<>\"\",MAX($A$1:INDIRECT(CONCATENATE(\"$A$\",ROW()-1)))+1,\"\")","v":""},"",null,"Site Clearance"]
[{"$f":"IF($E9<>\"\",MAX($A$1:INDIRECT(CONCATENATE(\"$A$\",ROW()-1)))+1,\"\")","v":""},""]
[{"$f":"IF($E10<>\"\",MAX($A$1:INDIRECT(CONCATENATE(\"$A$\",ROW()-1)))+1,\"\")","v":1},"C2.1","8.2.1\nPSC 8.2.1","Clear and grub vegetation and trees including tree stumps up to 25m wide strip (Max. tree girth 1m)","m2",21125," "," "]
[{"$f":"IF($E11<>\"\",MAX($A$1:INDIRECT(CONCATENATE(\"$A$\",ROW()-1)))+1,\"\")","v":""},""]
[{"$f":"IF($E12<>\"\",MAX($A$1:INDIRECT(CONCATENATE(\"$A$\",ROW()-1)))+1,\"\")","v":""},"","8.2.2","Remove and grub trees and tree stumps of girth"]
[{"$f":"IF($E13<>\"\",MAX($A$1:INDIRECT(CONCATENATE(\"$A$\",ROW()-1)))+1,\"\")","v":""},""]
[{"$f":"IF($E14<>\"\",MAX($A$1:INDIRECT(CONCATENATE(\"$A$\",ROW()-1)))+1,\"\")","v":""},"",null,"Over      and       Up to"]
[{"$f":"IF($E15<>\"\",MAX($A$1:INDIRECT(CONCATENATE(\"$A$\",ROW()-1)))+1,\"\")","v":""},""]
[{"$f":"IF($E16<>\"\",MAX($A$1:INDIRECT(CONCATENATE(\"$A$\",ROW()-1)))+1,\"\")","v":2},"C2.2",null,"1 m                      2 m","No",1]
[{"$f":"IF($E17<>\"\",MAX($A$1:INDIRECT(CONCATENATE(\"$A$\",ROW()-1)))+1,\"\")","v":""},""]
[{"$f":"IF($E18<>\"\",MAX($A$1:INDIRECT(CONCATENATE(\"$A$\",ROW()-1)))+1,\"\")","v":3},"C2.3",null,"2 m                      3 m","No",1]
[{"$f":"IF($E19<>\"\",MAX($A$1:INDIRECT(CONCATENATE(\"$A$\",ROW()-1)))+1,\"\")","v":""},""]
[{"$f":"IF($E20<>\"\",MAX($A$1:INDIRECT(CONCATENATE(\"$A$\",ROW()-1)))+1,\"\")","v":4},"C2.4","PSC 8.2.11","Take down existing fence and reinstate (stock fence up to 1.8 m high)","m",50]
[{"$f":"IF($E21<>\"\",MAX($A$1:INDIRECT(CONCATENATE(\"$A$\",ROW()-1)))+1,\"\")","v":""},""]
[{"$f":"IF($E22<>\"\",MAX($A$1:INDIRECT(CONCATENATE(\"$A$\",ROW()-1)))+1,\"\")","v":5},"C2.5","PSC 8.2.10","Remove 150 mm thick layer of topsoil to stockpile and maintain","m³",3169]
[{"$f":"IF($E23<>\"\",MAX($A$1:INDIRECT(CONCATENATE(\"$A$\",ROW()-1)))+1,\"\")","v":""},"",null,null,null,"."]
[{"$f":"IF($E24<>\"\",MAX($A$1:INDIRECT(CONCATENATE(\"$A$\",ROW()-1)))+1,\"\")","v":6},"C2.6","1200 D\n8.3.10\nPSD 8.3.10","Topsoiling","m²",21125]
[{"$f":"IF($E25<>\"\",MAX($A$1:INDIRECT(CONCATENATE(\"$A$\",ROW()-1)))+1,\"\")","v":""},""]
[{"$f":"IF($E26<>\"\",MAX($A$1:INDIRECT(CONCATENATE(\"$A$\",ROW()-1)))+1,\"\")","v":7},"C2.7","1200 A\nPSA 8.10","Temporary fencing where existing fencing has been taken down","m",200]
[{"$f":"IF($E27<>\"\",MAX($A$1:INDIRECT(CONCATENATE(\"$A$\",ROW()-1)))+1,\"\")","v":""},""," "]
[{"$f":"IF($E28<>\"\",MAX($A$1:INDIRECT(CONCATENATE(\"$A$\",ROW()-1)))+1,\"\")","v":""},"","1200 DB ","EARTHWORKS"]
[{"$f":"IF($E29<>\"\",MAX($A$1:INDIRECT(CONCATENATE(\"$A$\",ROW()-1)))+1,\"\")","v":""},""]
[{"$f":"IF($E30<>\"\",MAX($A$1:INDIRECT(CONCATENATE(\"$A$\",ROW()-1)))+1,\"\")","v":""},"",null,"Trench Excavation"]
[{"$f":"IF($E31<>\"\",MAX($A$1:INDIRECT(CONCATENATE(\"$A$\",ROW()-1)))+1,\"\")","v":""},""]
[{"$f":"IF($E32<>\"\",MAX($A$1:INDIRECT(CONCATENATE(\"$A$\",ROW()-1)))+1,\"\")","v":""},"","8.3.2\nPSDB 8.3.2\nPSDB 8.3.3","Excavate in all materials for trenches, backfill, compact and disposal of surplus  material for:"]
[{"$f":"IF($E33<>\"\",MAX($A$1:INDIRECT(CONCATENATE(\"$A$\",ROW()-1)))+1,\"\")","v":""},""]
[{"$f":"IF($E34<>\"\",MAX($A$1:INDIRECT(CONCATENATE(\"$A$\",ROW()-1)))+1,\"\")","v":""},""," ","Pipes of up to DN 400 mm for depths:"]
[{"$f":"IF($E35<>\"\",MAX($A$1:INDIRECT(CONCATENATE(\"$A$\",ROW()-1)))+1,\"\")","v":""},""]
[{"$f":"IF($E36<>\"\",MAX($A$1:INDIRECT(CONCATENATE(\"$A$\",ROW()-1)))+1,\"\")","v":""},"",null,"Over      and       Up to"]
[{"$f":"IF($E37<>\"\",MAX($A$1:INDIRECT(CONCATENATE(\"$A$\",ROW()-1)))+1,\"\")","v":""},""]
[{"$f":"IF($E38<>\"\",MAX($A$1:INDIRECT(CONCATENATE(\"$A$\",ROW()-1)))+1,\"\")","v":8},"C2.8",null,"0 m                      2,0 m","  m",770]
[{"$f":"IF($E39<>\"\",MAX($A$1:INDIRECT(CONCATENATE(\"$A$\",ROW()-1)))+1,\"\")","v":""},""]
[{"$f":"IF($E40<>\"\",MAX($A$1:INDIRECT(CONCATENATE(\"$A$\",ROW()-1)))+1,\"\")","v":9},"C2.9",null,"2,0 m                   3,0 m","  m",75]
[{"$f":"IF($E41<>\"\",MAX($A$1:INDIRECT(CONCATENATE(\"$A$\",ROW()-1)))+1,\"\")","v":""},""]
[{"$f":"IF($E42<>\"\",MAX($A$1:INDIRECT(CONCATENATE(\"$A$\",ROW()-1)))+1,\"\")","v":10},"C2.10",null,"3,0 m                   4,0 m","  m",0," ","Rate Only"]
[{"$f":"IF($E43<>\"\",MAX($A$1:INDIRECT(CONCATENATE(\"$A$\",ROW()-1)))+1,\"\")","v":""},""]
[{"$f":"IF($E44<>\"\",MAX($A$1:INDIRECT(CONCATENATE(\"$A$\",ROW()-1)))+1,\"\")","v":11},"C2.11",null,"4,0 m                   5,0 m","  m",0,null,"Rate Only"]
[]
[]
[]
[{"$f":"IF($E48<>\"\",MAX($A$1:INDIRECT(CONCATENATE(\"$A$\",ROW()-1)))+1,\"\")","v":""},null,null," Carried forward / …"]
[{"$f":"IF($E49<>\"\",MAX($A$1:INDIRECT(CONCATENATE(\"$A$\",ROW()-1)))+1,\"\")","v":""},null,null," Brought forward / …"]
[]
[{"$f":"IF($E51<>\"\",MAX($A$1:INDIRECT(CONCATENATE(\"$A$\",ROW()-1)))+1,\"\")","v":""},"","8.3.2\nPSD 8.3.2","Extra Over Item C2.8 - C2.11 Trench Excavations above:"]
[{"$f":"IF($E52<>\"\",MAX($A$1:INDIRECT(CONCATENATE(\"$A$\",ROW()-1)))+1,\"\")","v":""},""]
[{"$f":"IF($E53<>\"\",MAX($A$1:INDIRECT(CONCATENATE(\"$A$\",ROW()-1)))+1,\"\")","v":12},"C2.12"," ","Hard rock excavation","m3",145]
[{"$f":"IF($E54<>\"\",MAX($A$1:INDIRECT(CONCATENATE(\"$A$\",ROW()-1)))+1,\"\")","v":""},""]
[{"$f":"IF($E55<>\"\",MAX($A$1:INDIRECT(CONCATENATE(\"$A$\",ROW()-1)))+1,\"\")","v":13},"C2.13",null,"Blasting along pipeline","m3",145]
[{"$f":"IF($E56<>\"\",MAX($A$1:INDIRECT(CONCATENATE(\"$A$\",ROW()-1)))+1,\"\")","v":""},""]
[{"$f":"IF($E57<>\"\",MAX($A$1:INDIRECT(CONCATENATE(\"$A$\",ROW()-1)))+1,\"\")","v":14},"C2.14",null,"Boulder excavation Class A","m3",30]
[{"$f":"IF($E58<>\"\",MAX($A$1:INDIRECT(CONCATENATE(\"$A$\",ROW()-1)))+1,\"\")","v":""},""]
[{"$f":"IF($E59<>\"\",MAX($A$1:INDIRECT(CONCATENATE(\"$A$\",ROW()-1)))+1,\"\")","v":15},"C2.15",null,"Boulder excavation Class B","m3",30]
[{"$f":"IF($E60<>\"\",MAX($A$1:INDIRECT(CONCATENATE(\"$A$\",ROW()-1)))+1,\"\")","v":""},""]
[{"$f":"IF($E61<>\"\",MAX($A$1:INDIRECT(CONCATENATE(\"$A$\",ROW()-1)))+1,\"\")","v":16},"C2.16","8.3.2\nPSDB 8.3.2","Hand excavation and backfill where ordered by the Engineer","m3",21]
[{"$f":"IF($E62<>\"\",MAX($A$1:INDIRECT(CONCATENATE(\"$A$\",ROW()-1)))+1,\"\")","v":""},""]
[{"$f":"IF($E63<>\"\",MAX($A$1:INDIRECT(CONCATENATE(\"$A$\",ROW()-1)))+1,\"\")","v":17},"C2.17",null,"Backfill stabilised by 5% where ordered by the Engineer","m3",10]
[{"$f":"IF($E64<>\"\",MAX($A$1:INDIRECT(CONCATENATE(\"$A$\",ROW()-1)))+1,\"\")","v":""},""]
[{"$f":"IF($E65<>\"\",MAX($A$1:INDIRECT(CONCATENATE(\"$A$\",ROW()-1)))+1,\"\")","v":18},"C2.18",null,"Soilcrete backfill where directed by the Engineer","m3",17]
[{"$f":"IF($E66<>\"\",MAX($A$1:INDIRECT(CONCATENATE(\"$A$\",ROW()-1)))+1,\"\")","v":""},""]
[null,null,"8.3.2\nPSDB 8.3.2","Extra-over to Item C2.8 - C2.11 Trench Excavations for restricted working width:"," "," "]
[{"$f":"IF($E68<>\"\",MAX($A$1:INDIRECT(CONCATENATE(\"$A$\",ROW()-1)))+1,\"\")","v":""},""]
[{"$f":"IF($E69<>\"\",MAX($A$1:INDIRECT(CONCATENATE(\"$A$\",ROW()-1)))+1,\"\")","v":""},"",null,"Working width from 5 m up to 10 m:"]
[{"$f":"IF($E70<>\"\",MAX($A$1:INDIRECT(CONCATENATE(\"$A$\",ROW()-1)))+1,\"\")","v":""},{"$f":"IF(A70<>\"\",$A$3&A70,\"\")","v":""}]
[{"$f":"IF($E71<>\"\",MAX($A$1:INDIRECT(CONCATENATE(\"$A$\",ROW()-1)))+1,\"\")","v":""},"",null,"Over      and       Up to"]
[{"$f":"IF($E72<>\"\",MAX($A$1:INDIRECT(CONCATENATE(\"$A$\",ROW()-1)))+1,\"\")","v":""},""]
[{"$f":"IF($E73<>\"\",MAX($A$1:INDIRECT(CONCATENATE(\"$A$\",ROW()-1)))+1,\"\")","v":19},"C2.19",null,"0 m                      2,0 m","m",10]
[{"$f":"IF($E74<>\"\",MAX($A$1:INDIRECT(CONCATENATE(\"$A$\",ROW()-1)))+1,\"\")","v":""},""]
[{"$f":"IF($E75<>\"\",MAX($A$1:INDIRECT(CONCATENATE(\"$A$\",ROW()-1)))+1,\"\")","v":20},"C2.20",null,"2,0 m                  3,0 m","m",0]
[{"$f":"IF($E76<>\"\",MAX($A$1:INDIRECT(CONCATENATE(\"$A$\",ROW()-1)))+1,\"\")","v":""},""]
[{"$f":"IF($E77<>\"\",MAX($A$1:INDIRECT(CONCATENATE(\"$A$\",ROW()-1)))+1,\"\")","v":21},"C2.21",null,"3,0 m                  4,0 m","m",0]
[{"$f":"IF($E78<>\"\",MAX($A$1:INDIRECT(CONCATENATE(\"$A$\",ROW()-1)))+1,\"\")","v":""},""]
[{"$f":"IF($E79<>\"\",MAX($A$1:INDIRECT(CONCATENATE(\"$A$\",ROW()-1)))+1,\"\")","v":22},"C2.22",null,"4,0 m                  5,0 m","m",0]
[{"$f":"IF($E80<>\"\",MAX($A$1:INDIRECT(CONCATENATE(\"$A$\",ROW()-1)))+1,\"\")","v":""},""]
[{"$f":"IF($E81<>\"\",MAX($A$1:INDIRECT(CONCATENATE(\"$A$\",ROW()-1)))+1,\"\")","v":""},"","8.3.2\nPSDB 8.3.2","Working width from 10 m up to 15 m:"]
[{"$f":"IF($E82<>\"\",MAX($A$1:INDIRECT(CONCATENATE(\"$A$\",ROW()-1)))+1,\"\")","v":""}]
[{"$f":"IF($E83<>\"\",MAX($A$1:INDIRECT(CONCATENATE(\"$A$\",ROW()-1)))+1,\"\")","v":""},"",null,"Over      and       Up to"]
[{"$f":"IF($E84<>\"\",MAX($A$1:INDIRECT(CONCATENATE(\"$A$\",ROW()-1)))+1,\"\")","v":""},""]
[{"$f":"IF($E85<>\"\",MAX($A$1:INDIRECT(CONCATENATE(\"$A$\",ROW()-1)))+1,\"\")","v":23},{"$f":"IF(A85<>\"\",$A$3&A85,\"\")","v":"C2.23"},null,"0 m                      2,0 m","m",10]
[{"$f":"IF($E86<>\"\",MAX($A$1:INDIRECT(CONCATENATE(\"$A$\",ROW()-1)))+1,\"\")","v":""},""]
[{"$f":"IF($E87<>\"\",MAX($A$1:INDIRECT(CONCATENATE(\"$A$\",ROW()-1)))+1,\"\")","v":24},"C2.24",null,"2,0 m                  3,0 m","m",0]
[{"$f":"IF($E88<>\"\",MAX($A$1:INDIRECT(CONCATENATE(\"$A$\",ROW()-1)))+1,\"\")","v":""},""]
[{"$f":"IF($E89<>\"\",MAX($A$1:INDIRECT(CONCATENATE(\"$A$\",ROW()-1)))+1,\"\")","v":25},"C2.25",null,"3,0 m                  4,0 m","m",0]
[{"$f":"IF($E90<>\"\",MAX($A$1:INDIRECT(CONCATENATE(\"$A$\",ROW()-1)))+1,\"\")","v":""},""]
[{"$f":"IF($E91<>\"\",MAX($A$1:INDIRECT(CONCATENATE(\"$A$\",ROW()-1)))+1,\"\")","v":26},"C2.26",null,"4,0 m                  5,0 m","m",0]
[]
[]
[]
[]
[]
[{"$f":"IF($E97<>\"\",MAX($A$1:INDIRECT(CONCATENATE(\"$A$\",ROW()-1)))+1,\"\")","v":""},null,null," Carried forward / …"]
[{"$f":"IF($E98<>\"\",MAX($A$1:INDIRECT(CONCATENATE(\"$A$\",ROW()-1)))+1,\"\")","v":""},null,null," Brought forward / …"]
[]
[{"$f":"IF($E100<>\"\",MAX($A$1:INDIRECT(CONCATENATE(\"$A$\",ROW()-1)))+1,\"\")","v":""},"",null,"Working width from 15 m up to 25 m:"]
[{"$f":"IF($E101<>\"\",MAX($A$1:INDIRECT(CONCATENATE(\"$A$\",ROW()-1)))+1,\"\")","v":""},""]
[{"$f":"IF($E102<>\"\",MAX($A$1:INDIRECT(CONCATENATE(\"$A$\",ROW()-1)))+1,\"\")","v":""},"",null,"Over      and       Up to"]
[{"$f":"IF($E103<>\"\",MAX($A$1:INDIRECT(CONCATENATE(\"$A$\",ROW()-1)))+1,\"\")","v":""},""]
[{"$f":"IF($E104<>\"\",MAX($A$1:INDIRECT(CONCATENATE(\"$A$\",ROW()-1)))+1,\"\")","v":27},"C2.27",null,"0 m                      2,0 m","m",770]
[{"$f":"IF($E105<>\"\",MAX($A$1:INDIRECT(CONCATENATE(\"$A$\",ROW()-1)))+1,\"\")","v":""},""]
[{"$f":"IF($E106<>\"\",MAX($A$1:INDIRECT(CONCATENATE(\"$A$\",ROW()-1)))+1,\"\")","v":28},"C2.28",null,"2,0 m                  3,0 m","m",75]
[{"$f":"IF($E107<>\"\",MAX($A$1:INDIRECT(CONCATENATE(\"$A$\",ROW()-1)))+1,\"\")","v":""},""]
[{"$f":"IF($E108<>\"\",MAX($A$1:INDIRECT(CONCATENATE(\"$A$\",ROW()-1)))+1,\"\")","v":29},"C2.29",null,"3,0 m                  4,0 m","m",0]
[{"$f":"IF($E109<>\"\",MAX($A$1:INDIRECT(CONCATENATE(\"$A$\",ROW()-1)))+1,\"\")","v":""},""]
[{"$f":"IF($E110<>\"\",MAX($A$1:INDIRECT(CONCATENATE(\"$A$\",ROW()-1)))+1,\"\")","v":30},"C2.30",null,"4,0 m                  5,0 m","m",0]
[{"$f":"IF($E111<>\"\",MAX($A$1:INDIRECT(CONCATENATE(\"$A$\",ROW()-1)))+1,\"\")","v":""},""]
[{"$f":"IF($E112<>\"\",MAX($A$1:INDIRECT(CONCATENATE(\"$A$\",ROW()-1)))+1,\"\")","v":""},"","1200 D\n8.3.3\nPSD 8.3.3","Restricted excavation"]
[{"$f":"IF($E113<>\"\",MAX($A$1:INDIRECT(CONCATENATE(\"$A$\",ROW()-1)))+1,\"\")","v":""},""]
[{"$f":"IF($E114<>\"\",MAX($A$1:INDIRECT(CONCATENATE(\"$A$\",ROW()-1)))+1,\"\")","v":31},"C2.31",null,"Chambers","m3",15]
[{"$f":"IF($E115<>\"\",MAX($A$1:INDIRECT(CONCATENATE(\"$A$\",ROW()-1)))+1,\"\")","v":""},""]
[{"$f":"IF($E116<>\"\",MAX($A$1:INDIRECT(CONCATENATE(\"$A$\",ROW()-1)))+1,\"\")","v":""},"","1200 LB","Bedding & Blanket"]
[{"$f":"IF($E117<>\"\",MAX($A$1:INDIRECT(CONCATENATE(\"$A$\",ROW()-1)))+1,\"\")","v":""},""," "]
[{"$f":"IF($E118<>\"\",MAX($A$1:INDIRECT(CONCATENATE(\"$A$\",ROW()-1)))+1,\"\")","v":""},"","8.2.2.3\nPSLB 8.2.2.3","From commercial sources:"]
[{"$f":"IF($E119<>\"\",MAX($A$1:INDIRECT(CONCATENATE(\"$A$\",ROW()-1)))+1,\"\")","v":""},""]
[{"$f":"IF($E120<>\"\",MAX($A$1:INDIRECT(CONCATENATE(\"$A$\",ROW()-1)))+1,\"\")","v":32},"C2.32",null,"Selected granular material","m3",408]
[{"$f":"IF($E121<>\"\",MAX($A$1:INDIRECT(CONCATENATE(\"$A$\",ROW()-1)))+1,\"\")","v":""},""]
[{"$f":"IF($E122<>\"\",MAX($A$1:INDIRECT(CONCATENATE(\"$A$\",ROW()-1)))+1,\"\")","v":33},"C2.33",null,"Selected fill material","m3",172]
[{"$f":"IF($E123<>\"\",MAX($A$1:INDIRECT(CONCATENATE(\"$A$\",ROW()-1)))+1,\"\")","v":""},""]
[{"$f":"IF($E124<>\"\",MAX($A$1:INDIRECT(CONCATENATE(\"$A$\",ROW()-1)))+1,\"\")","v":""},"",null,"Extra-over to Item C2.33 & C2.34 Bedding and Blanket above:"]
[{"$f":"IF($E125<>\"\",MAX($A$1:INDIRECT(CONCATENATE(\"$A$\",ROW()-1)))+1,\"\")","v":""},""]
[{"$f":"IF($E126<>\"\",MAX($A$1:INDIRECT(CONCATENATE(\"$A$\",ROW()-1)))+1,\"\")","v":34},"C2.34","PSLB 8.2.6","Cement stabilisation at 5% by volume to fill material","m3",10]
[]
[{"$f":"IF($E128<>\"\",MAX($A$1:INDIRECT(CONCATENATE(\"$A$\",ROW()-1)))+1,\"\")","v":""},"","1200 A","Miscellaneous"]
[{"$f":"IF($E129<>\"\",MAX($A$1:INDIRECT(CONCATENATE(\"$A$\",ROW()-1)))+1,\"\")","v":""},""]
[{"$f":"IF($E130<>\"\",MAX($A$1:INDIRECT(CONCATENATE(\"$A$\",ROW()-1)))+1,\"\")","v":35},"C2.35","PSA 8.10","Cross embankments","m3",285]
[{"$f":"IF($E131<>\"\",MAX($A$1:INDIRECT(CONCATENATE(\"$A$\",ROW()-1)))+1,\"\")","v":""},""]
[{"$f":"IF($E132<>\"\",MAX($A$1:INDIRECT(CONCATENATE(\"$A$\",ROW()-1)))+1,\"\")","v":36},"C2.36","PSA 8.10","Cross walls","m3",15]
[{"$f":"IF($E133<>\"\",MAX($A$1:INDIRECT(CONCATENATE(\"$A$\",ROW()-1)))+1,\"\")","v":""},""]
[{"$f":"IF($E134<>\"\",MAX($A$1:INDIRECT(CONCATENATE(\"$A$\",ROW()-1)))+1,\"\")","v":37},"C2.37","PSA 8.10","Concrete anchor blocks","m3",25]
[{"$f":"IF($E135<>\"\",MAX($A$1:INDIRECT(CONCATENATE(\"$A$\",ROW()-1)))+1,\"\")","v":""},""]
[{"$f":"IF($E136<>\"\",MAX($A$1:INDIRECT(CONCATENATE(\"$A$\",ROW()-1)))+1,\"\")","v":38},"C2.38","PSA 8.10","Grassing by means of hydroseeding","m²",200]
[]
[{"$f":"IF($E138<>\"\",MAX($A$1:INDIRECT(CONCATENATE(\"$A$\",ROW()-1)))+1,\"\")","v":""},{"$f":"IF(A138<>\"\",$A$3&A138,\"\")","v":""},null,"PIPELINES:"]
[]
[{"$f":"IF($E140<>\"\",MAX($A$1:INDIRECT(CONCATENATE(\"$A$\",ROW()-1)))+1,\"\")","v":""},"","SANS"]
[{"$f":"IF($E141<>\"\",MAX($A$1:INDIRECT(CONCATENATE(\"$A$\",ROW()-1)))+1,\"\")","v":""},"","1200 L \n8.2.1","Supply, lay, and bed on flexible beddingwith couplings:"]
[{"$f":"IF($E142<>\"\",MAX($A$1:INDIRECT(CONCATENATE(\"$A$\",ROW()-1)))+1,\"\")","v":""},""]
[{"$f":"IF($E143<>\"\",MAX($A$1:INDIRECT(CONCATENATE(\"$A$\",ROW()-1)))+1,\"\")","v":39},"C2.39",null,"DN 400, uPVC Class 12 pipe","m",860]
[]
[]
[{"$f":"IF($E146<>\"\",MAX($A$1:INDIRECT(CONCATENATE(\"$A$\",ROW()-1)))+1,\"\")","v":""},null,null," Carried forward / …"]
[{"$f":"IF($E147<>\"\",MAX($A$1:INDIRECT(CONCATENATE(\"$A$\",ROW()-1)))+1,\"\")","v":""},null,null," Brought forward / …"]
[]
[{"$f":"IF($E149<>\"\",MAX($A$1:INDIRECT(CONCATENATE(\"$A$\",ROW()-1)))+1,\"\")","v":""},"","8.2.2","Extra-over for the above to supply lay and bed uPVC pipe, for suppling, laying, and bedding of DN 400 mm Class 12 uPVC specials complete with couplings"]
[{"$f":"IF($E150<>\"\",MAX($A$1:INDIRECT(CONCATENATE(\"$A$\",ROW()-1)))+1,\"\")","v":""},""]
[{"$f":"IF($E151<>\"\",MAX($A$1:INDIRECT(CONCATENATE(\"$A$\",ROW()-1)))+1,\"\")","v":40},"C2.40",null,"11.25° Bends","No",1]
[{"$f":"IF($E152<>\"\",MAX($A$1:INDIRECT(CONCATENATE(\"$A$\",ROW()-1)))+1,\"\")","v":""},""]
[{"$f":"IF($E153<>\"\",MAX($A$1:INDIRECT(CONCATENATE(\"$A$\",ROW()-1)))+1,\"\")","v":41},"C2.41",null,"22.5° Bends","No",1]
[{"$f":"IF($E154<>\"\",MAX($A$1:INDIRECT(CONCATENATE(\"$A$\",ROW()-1)))+1,\"\")","v":""},""]
[{"$f":"IF($E155<>\"\",MAX($A$1:INDIRECT(CONCATENATE(\"$A$\",ROW()-1)))+1,\"\")","v":42},"C2.42",null,"45° Bends","No",2]
[{"$f":"IF($E156<>\"\",MAX($A$1:INDIRECT(CONCATENATE(\"$A$\",ROW()-1)))+1,\"\")","v":""},""]
[{"$f":"IF($E157<>\"\",MAX($A$1:INDIRECT(CONCATENATE(\"$A$\",ROW()-1)))+1,\"\")","v":""},"","PSL 8.2.11","Anchor/thrust blocks and pedestals:"]
[{"$f":"IF($E158<>\"\",MAX($A$1:INDIRECT(CONCATENATE(\"$A$\",ROW()-1)))+1,\"\")","v":""},""]
[{"$f":"IF($E159<>\"\",MAX($A$1:INDIRECT(CONCATENATE(\"$A$\",ROW()-1)))+1,\"\")","v":43},"C2.43",null,"Formwork: Rough","m2",20]
[{"$f":"IF($E160<>\"\",MAX($A$1:INDIRECT(CONCATENATE(\"$A$\",ROW()-1)))+1,\"\")","v":""},""]
[{"$f":"IF($E161<>\"\",MAX($A$1:INDIRECT(CONCATENATE(\"$A$\",ROW()-1)))+1,\"\")","v":44},"C2.44",null,"15 MPa/19 mm Concrete","m³",5]
[{"$f":"IF($E162<>\"\",MAX($A$1:INDIRECT(CONCATENATE(\"$A$\",ROW()-1)))+1,\"\")","v":""},""]
[{"$f":"IF($E163<>\"\",MAX($A$1:INDIRECT(CONCATENATE(\"$A$\",ROW()-1)))+1,\"\")","v":""},"","1200 A","Marker Posts and benchmarks"]
[{"$f":"IF($E164<>\"\",MAX($A$1:INDIRECT(CONCATENATE(\"$A$\",ROW()-1)))+1,\"\")","v":""},""]
[{"$f":"IF($E165<>\"\",MAX($A$1:INDIRECT(CONCATENATE(\"$A$\",ROW()-1)))+1,\"\")","v":""},""," ","Supply and install:"]
[{"$f":"IF($E166<>\"\",MAX($A$1:INDIRECT(CONCATENATE(\"$A$\",ROW()-1)))+1,\"\")","v":""},""]
[{"$f":"IF($E167<>\"\",MAX($A$1:INDIRECT(CONCATENATE(\"$A$\",ROW()-1)))+1,\"\")","v":45},"C2.45","PSA 8.10","Route marker posts as per Dwg No 106777-0501-DRG-CC-0103","No",6]
[{"$f":"IF($E168<>\"\",MAX($A$1:INDIRECT(CONCATENATE(\"$A$\",ROW()-1)))+1,\"\")","v":""},""]
[{"$f":"IF($E169<>\"\",MAX($A$1:INDIRECT(CONCATENATE(\"$A$\",ROW()-1)))+1,\"\")","v":46},"C2.46","PSA 8.8.8","Marking of all pipeline structures","No",2]
[]
[null,null,null,"Miscellaneous"]
[{"$f":"IF($E172<>\"\",MAX($A$1:INDIRECT(CONCATENATE(\"$A$\",ROW()-1)))+1,\"\")","v":""},{"$f":"IF(A172<>\"\",$A$3&A172,\"\")","v":""}]
[{"$f":"IF($E173<>\"\",MAX($A$1:INDIRECT(CONCATENATE(\"$A$\",ROW()-1)))+1,\"\")","v":47},"C2.47","DWA 1110\n20.19","Hydrostatic testing of complete pipeline","m",860]
[]
[null,null,null,"PIPELINES: PIPEWORK SPECIALS AND VALVE CHAMBERS"]
[{"$f":"IF($E176<>\"\",MAX($A$1:INDIRECT(CONCATENATE(\"$A$\",ROW()-1)))+1,\"\")","v":""},""]
[{"$f":"IF($E177<>\"\",MAX($A$1:INDIRECT(CONCATENATE(\"$A$\",ROW()-1)))+1,\"\")","v":""},"",null,"Discharge outlet structure"]
[null,null,null,"Dwg 106777-0501-DRG-CC-0128"]
[]
[null,null,"DWS 1130\n10\nDWS 1110\n20.14.1\n20.14.2","Supply, deliver, laying, bedding and jointing of fittings and pipe specials on main pipeline and within valve chambers complete with couplings and pipe suppprts as scheduled. All steel pipework manufactured Grade X52 or S 355 JR  steel unless otherwise stated and lined and coated as specified in DWS 9900 C7"]
[]
[{"$f":"IF($E182<>\"\",MAX($A$1:INDIRECT(CONCATENATE(\"$A$\",ROW()-1)))+1,\"\")","v":48},"C2.48",null,"DN 400 steel pipe, 4 mm wall thickness, plain ended, 850 mm long with puddle flange","No",1]
[{"$f":"IF($E183<>\"\",MAX($A$1:INDIRECT(CONCATENATE(\"$A$\",ROW()-1)))+1,\"\")","v":""},""]
[{"$f":"IF($E184<>\"\",MAX($A$1:INDIRECT(CONCATENATE(\"$A$\",ROW()-1)))+1,\"\")","v":49},"C2.49",null,"DN 400 Restrained flanged adaptor","No",1]
[]
[]
[{"$f":"IF($E187<>\"\",MAX($A$1:INDIRECT(CONCATENATE(\"$A$\",ROW()-1)))+1,\"\")","v":""},null,null," Carried forward / …"]
[{"$f":"IF($E188<>\"\",MAX($A$1:INDIRECT(CONCATENATE(\"$A$\",ROW()-1)))+1,\"\")","v":""},null,null," Brought forward / …"]
[]
[{"$f":"IF($E190<>\"\",MAX($A$1:INDIRECT(CONCATENATE(\"$A$\",ROW()-1)))+1,\"\")","v":""},"",null,"VALVE CHAMBERS"]
[{"$f":"IF($E191<>\"\",MAX($A$1:INDIRECT(CONCATENATE(\"$A$\",ROW()-1)))+1,\"\")","v":""},""]
[{"$f":"IF($E192<>\"\",MAX($A$1:INDIRECT(CONCATENATE(\"$A$\",ROW()-1)))+1,\"\")","v":""},""," ","DN 400 Transition chamber"]
[{"$f":"IF($E193<>\"\",MAX($A$1:INDIRECT(CONCATENATE(\"$A$\",ROW()-1)))+1,\"\")","v":""},"",null,"106777-0501-DRG-CC-0127",null,null,null,"Rate only"]
[{"$f":"IF($E194<>\"\",MAX($A$1:INDIRECT(CONCATENATE(\"$A$\",ROW()-1)))+1,\"\")","v":""},""]
[{"$f":"IF($E195<>\"\",MAX($A$1:INDIRECT(CONCATENATE(\"$A$\",ROW()-1)))+1,\"\")","v":50},"C2.50","DWS 1110\n20.17","Construct transition chamber complete, 2500 mm mm high from bottom of foundation footing to top of roof, access manhole, air vents, step irons, etc. The rate shall include all materials, joints, shuttering, concrete, benching and wood-float finish to complete construction as per drawing","No",1]
[{"$f":"IF($E196<>\"\",MAX($A$1:INDIRECT(CONCATENATE(\"$A$\",ROW()-1)))+1,\"\")","v":""},""]
[{"$f":"IF($E197<>\"\",MAX($A$1:INDIRECT(CONCATENATE(\"$A$\",ROW()-1)))+1,\"\")","v":51},"C2.51",null,"Extra-over for the above chamber to increase the height by 250mm","Sum","-"]
[{"$f":"IF($E198<>\"\",MAX($A$1:INDIRECT(CONCATENATE(\"$A$\",ROW()-1)))+1,\"\")","v":""},""]
[{"$f":"IF($E199<>\"\",MAX($A$1:INDIRECT(CONCATENATE(\"$A$\",ROW()-1)))+1,\"\")","v":52},"C2.52","DWS 0750\n15.8","Extra-over for the above chamber for casting in of DN 400 pipes","No",2]
[]
[{"$f":"IF($E201<>\"\",MAX($A$1:INDIRECT(CONCATENATE(\"$A$\",ROW()-1)))+1,\"\")","v":""},"",null,"DN 400 Discharge Chamber"]
[{"$f":"IF($E202<>\"\",MAX($A$1:INDIRECT(CONCATENATE(\"$A$\",ROW()-1)))+1,\"\")","v":""},"",null,"106777-0501-DRG-CC-0128"]
[{"$f":"IF($E203<>\"\",MAX($A$1:INDIRECT(CONCATENATE(\"$A$\",ROW()-1)))+1,\"\")","v":""},""]
[{"$f":"IF($E204<>\"\",MAX($A$1:INDIRECT(CONCATENATE(\"$A$\",ROW()-1)))+1,\"\")","v":53},"C2.53","DWS 1110\n20.17","Construct discharge chamber complete, 3400 mm high from bottom of foundation footing to top of roof, access manhole, air vents, stepping ladder etc. The rate shall include all materials, joints, shuttering, concrete and wood-float finish.","No",1]
[{"$f":"IF($E205<>\"\",MAX($A$1:INDIRECT(CONCATENATE(\"$A$\",ROW()-1)))+1,\"\")","v":""},""]
[{"$f":"IF($E206<>\"\",MAX($A$1:INDIRECT(CONCATENATE(\"$A$\",ROW()-1)))+1,\"\")","v":54},"C2.54",null,"Extra-over for the above chamber to increase the height by 250mm","Sum","-"]
[{"$f":"IF($E207<>\"\",MAX($A$1:INDIRECT(CONCATENATE(\"$A$\",ROW()-1)))+1,\"\")","v":""},""]
[{"$f":"IF($E208<>\"\",MAX($A$1:INDIRECT(CONCATENATE(\"$A$\",ROW()-1)))+1,\"\")","v":55},"C2.55","DWS 0750\n15.8","Extra-over for the above chamber for casting in of DN 400 pipes","No",1]
[]
[{"$f":"IF($E210<>\"\",MAX($A$1:INDIRECT(CONCATENATE(\"$A$\",ROW()-1)))+1,\"\")","v":56},{"$f":"IF(A210<>\"\",$A$3&A210,\"\")","v":"C2.56"},"DWS 1110\n20.17.2","Extra-over for the above per chamber for installing fibre glass grill","No",1]
[]
[]
[]
[]
[]
[]
[]
[]
[]
[]
[]
[]
[]
[]
[{"$f":"IF($E225<>\"\",MAX($A$1:INDIRECT(CONCATENATE(\"$A$\",ROW()-1)))+1,\"\")","v":""},""]
[{"$f":"IF($E226<>\"\",MAX($A$1:INDIRECT(CONCATENATE(\"$A$\",ROW()-1)))+1,\"\")","v":""},"",null," TOTAL SECTION C2:\n Carried to Summary",null,null,"R"]

{"sheet":"Section C3","index":6,"n_rows":525,"n_cols":8,"rows_kept":525,"cut":false,"hidden":false,"merged":[]}
["Item No","Item No","Payment Clause","Short Description","Unit","Quantity","Rate","Amount\n R             c"]
[]
["C3.",null,"SANS","SECTION: C3"]
[null,null,"1200 C","PUMP STATION AND RESERVOIR:"]
[null,null,null,"SITE LAYOUT AND CIVIL WORKS"]
[]
[null,null,null,"Site Clearing"]
[]
[{"$f":"IF($E9<>\"\",MAX($A$1:INDIRECT(CONCATENATE(\"$A$\",ROW()-1)))+1,\"\")","v":1},{"$f":"IF(A9<>\"\",$A$3&A9,\"\")","v":"C3.1"},"8.2.1\nPSC 8.2.1","Clear and grub areas of pump station and reservoir site, including internal access roads:","m²",15900]
[{"$f":"IF($E10<>\"\",MAX($A$1:INDIRECT(CONCATENATE(\"$A$\",ROW()-1)))+1,\"\")","v":""},""]
[{"$f":"IF($E11<>\"\",MAX($A$1:INDIRECT(CONCATENATE(\"$A$\",ROW()-1)))+1,\"\")","v":""},"","8.2.2","Remove and grub large trees and tree  stumps of girth:"]
[{"$f":"IF($E12<>\"\",MAX($A$1:INDIRECT(CONCATENATE(\"$A$\",ROW()-1)))+1,\"\")","v":""},""]
[{"$f":"IF($E13<>\"\",MAX($A$1:INDIRECT(CONCATENATE(\"$A$\",ROW()-1)))+1,\"\")","v":2},"C3.2",null,"Over 1,0 m and up to and including 2,0 m","No",10]
[{"$f":"IF($E14<>\"\",MAX($A$1:INDIRECT(CONCATENATE(\"$A$\",ROW()-1)))+1,\"\")","v":""},""]
[{"$f":"IF($E15<>\"\",MAX($A$1:INDIRECT(CONCATENATE(\"$A$\",ROW()-1)))+1,\"\")","v":3},"C3.3",null,"Over 2,0 m and up to and including 3,0 m","No",2]
[{"$f":"IF($E16<>\"\",MAX($A$1:INDIRECT(CONCATENATE(\"$A$\",ROW()-1)))+1,\"\")","v":""},""]
[{"$f":"IF($E17<>\"\",MAX($A$1:INDIRECT(CONCATENATE(\"$A$\",ROW()-1)))+1,\"\")","v":4},"C3.4","PSC 8.2.11","Take down and re-erect existing fence","m",200]
[{"$f":"IF($E18<>\"\",MAX($A$1:INDIRECT(CONCATENATE(\"$A$\",ROW()-1)))+1,\"\")","v":""},""]
[{"$f":"IF($E19<>\"\",MAX($A$1:INDIRECT(CONCATENATE(\"$A$\",ROW()-1)))+1,\"\")","v":5},"C3.5","8.2.10\nPSC 8.2.10","Remove topsoil to nominal depth of 150mm and stockpile","m³",2900]
[{"$f":"IF($E20<>\"\",MAX($A$1:INDIRECT(CONCATENATE(\"$A$\",ROW()-1)))+1,\"\")","v":""},""]
[{"$f":"IF($E21<>\"\",MAX($A$1:INDIRECT(CONCATENATE(\"$A$\",ROW()-1)))+1,\"\")","v":""},"",null,"EARTHWORKS"]
[{"$f":"IF($E22<>\"\",MAX($A$1:INDIRECT(CONCATENATE(\"$A$\",ROW()-1)))+1,\"\")","v":""},""]
[{"$f":"IF($E23<>\"\",MAX($A$1:INDIRECT(CONCATENATE(\"$A$\",ROW()-1)))+1,\"\")","v":""},"","1200 D","Bulk excavation:"]
[{"$f":"IF($E24<>\"\",MAX($A$1:INDIRECT(CONCATENATE(\"$A$\",ROW()-1)))+1,\"\")","v":""},""]
[{"$f":"IF($E25<>\"\",MAX($A$1:INDIRECT(CONCATENATE(\"$A$\",ROW()-1)))+1,\"\")","v":6},"C3.6","8.3.2\nPSD 8.3.2","Excavate in all materials for reservoir platform and use or dispose of ","m³",3565]
[{"$f":"IF($E26<>\"\",MAX($A$1:INDIRECT(CONCATENATE(\"$A$\",ROW()-1)))+1,\"\")","v":""},""]
[{"$f":"IF($E27<>\"\",MAX($A$1:INDIRECT(CONCATENATE(\"$A$\",ROW()-1)))+1,\"\")","v":7},"C3.7",null,"Excavate in all materials for pump station platform and use or dispose of ","m³",6610]
[{"$f":"IF($E28<>\"\",MAX($A$1:INDIRECT(CONCATENATE(\"$A$\",ROW()-1)))+1,\"\")","v":""},""]
[{"$f":"IF($E29<>\"\",MAX($A$1:INDIRECT(CONCATENATE(\"$A$\",ROW()-1)))+1,\"\")","v":8},"C3.8","1200 D\nPSD 8.3.14","Temporary stockpile of material","m³",8216]
[{"$f":"IF($E30<>\"\",MAX($A$1:INDIRECT(CONCATENATE(\"$A$\",ROW()-1)))+1,\"\")","v":""},""]
[{"$f":"IF($E31<>\"\",MAX($A$1:INDIRECT(CONCATENATE(\"$A$\",ROW()-1)))+1,\"\")","v":""},"","8.3.9","Extra over Items C3.6 & 3.7: Bulk excavation. Backfill to structures, using approved cohessionless material from stockpile"]
[{"$f":"IF($E32<>\"\",MAX($A$1:INDIRECT(CONCATENATE(\"$A$\",ROW()-1)))+1,\"\")","v":""},""]
[{"$f":"IF($E33<>\"\",MAX($A$1:INDIRECT(CONCATENATE(\"$A$\",ROW()-1)))+1,\"\")","v":9},"C3.9",null,"To reservoir","m³",2963]
[{"$f":"IF($E34<>\"\",MAX($A$1:INDIRECT(CONCATENATE(\"$A$\",ROW()-1)))+1,\"\")","v":""},""]
[{"$f":"IF($E35<>\"\",MAX($A$1:INDIRECT(CONCATENATE(\"$A$\",ROW()-1)))+1,\"\")","v":10},"C3.10",null,"To pump station","m³",3884]
[]
[{"$f":"IF($E37<>\"\",MAX($A$1:INDIRECT(CONCATENATE(\"$A$\",ROW()-1)))+1,\"\")","v":11},{"$f":"IF(A37<>\"\",$A$3&A37,\"\")","v":"C3.11"},null,"To substation platform","m³",3500]
[{"$f":"IF($E38<>\"\",MAX($A$1:INDIRECT(CONCATENATE(\"$A$\",ROW()-1)))+1,\"\")","v":""},""]
[{"$f":"IF($E39<>\"\",MAX($A$1:INDIRECT(CONCATENATE(\"$A$\",ROW()-1)))+1,\"\")","v":12},"C3.12","8.3.4","Import G7 material from pipeline \nstockpile, place and compact in not more than 150 mm layers","m³",8020]
[]
[{"$f":"IF($E41<>\"\",MAX($A$1:INDIRECT(CONCATENATE(\"$A$\",ROW()-1)))+1,\"\")","v":13},{"$f":"IF(A41<>\"\",$A$3&A41,\"\")","v":"C3.13"},null,"Import G7 material from commercial sources, place and compact in not more than 150 mm layers","m³",8020]
[]
[]
[{"$f":"IF($E44<>\"\",MAX($A$1:INDIRECT(CONCATENATE(\"$A$\",ROW()-1)))+1,\"\")","v":""},{"$f":"IF(A44<>\"\",$A$3&A44,\"\")","v":""},null," Carried forward / …"]
[{"$f":"IF($E45<>\"\",MAX($A$1:INDIRECT(CONCATENATE(\"$A$\",ROW()-1)))+1,\"\")","v":""},"",null," Brought forward / …"]
[]
[{"$f":"IF($E47<>\"\",MAX($A$1:INDIRECT(CONCATENATE(\"$A$\",ROW()-1)))+1,\"\")","v":""},"",null,"Extra-over Items  C3.6 & 3.7: Bulk excavation"]
[{"$f":"IF($E48<>\"\",MAX($A$1:INDIRECT(CONCATENATE(\"$A$\",ROW()-1)))+1,\"\")","v":""},""]
[{"$f":"IF($E49<>\"\",MAX($A$1:INDIRECT(CONCATENATE(\"$A$\",ROW()-1)))+1,\"\")","v":14},"C3.14","8.3.2\nPSD 8.3.2","Hard rock excavation by means of explosives","m³",6700]
[{"$f":"IF($E50<>\"\",MAX($A$1:INDIRECT(CONCATENATE(\"$A$\",ROW()-1)))+1,\"\")","v":""},""]
[{"$f":"IF($E51<>\"\",MAX($A$1:INDIRECT(CONCATENATE(\"$A$\",ROW()-1)))+1,\"\")","v":15},"C3.15",null,"Hard rock excavation without explosives (other methods)","m³",6700]
[{"$f":"IF($E52<>\"\",MAX($A$1:INDIRECT(CONCATENATE(\"$A$\",ROW()-1)))+1,\"\")","v":""},""]
[{"$f":"IF($E53<>\"\",MAX($A$1:INDIRECT(CONCATENATE(\"$A$\",ROW()-1)))+1,\"\")","v":""},"","1200 D","Restricted excavation:"]
[{"$f":"IF($E54<>\"\",MAX($A$1:INDIRECT(CONCATENATE(\"$A$\",ROW()-1)))+1,\"\")","v":""},""]
[{"$f":"IF($E55<>\"\",MAX($A$1:INDIRECT(CONCATENATE(\"$A$\",ROW()-1)))+1,\"\")","v":""},"","8.3.3\nPSD 8.3.3","Excavate the for following in all materials and use or dispose:"]
[{"$f":"IF($E56<>\"\",MAX($A$1:INDIRECT(CONCATENATE(\"$A$\",ROW()-1)))+1,\"\")","v":""},""]
[{"$f":"IF($E57<>\"\",MAX($A$1:INDIRECT(CONCATENATE(\"$A$\",ROW()-1)))+1,\"\")","v":16},"C3.16",null,"Pump station footings","m³",40]
[{"$f":"IF($E58<>\"\",MAX($A$1:INDIRECT(CONCATENATE(\"$A$\",ROW()-1)))+1,\"\")","v":""},""]
[{"$f":"IF($E59<>\"\",MAX($A$1:INDIRECT(CONCATENATE(\"$A$\",ROW()-1)))+1,\"\")","v":17},"C3.17",null,"Valve chambers and the like","m³",250]
[{"$f":"IF($E60<>\"\",MAX($A$1:INDIRECT(CONCATENATE(\"$A$\",ROW()-1)))+1,\"\")","v":""},""]
[{"$f":"IF($E61<>\"\",MAX($A$1:INDIRECT(CONCATENATE(\"$A$\",ROW()-1)))+1,\"\")","v":18},"C3.18",null,"Stormwater culvert and headwalls","m³","15"]
[{"$f":"IF($E62<>\"\",MAX($A$1:INDIRECT(CONCATENATE(\"$A$\",ROW()-1)))+1,\"\")","v":""},""]
[{"$f":"IF($E63<>\"\",MAX($A$1:INDIRECT(CONCATENATE(\"$A$\",ROW()-1)))+1,\"\")","v":19},"C3.19",null,"Subsoil pipework","m³","75"]
[{"$f":"IF($E64<>\"\",MAX($A$1:INDIRECT(CONCATENATE(\"$A$\",ROW()-1)))+1,\"\")","v":""},""]
[{"$f":"IF($E65<>\"\",MAX($A$1:INDIRECT(CONCATENATE(\"$A$\",ROW()-1)))+1,\"\")","v":20},"C3.20",null,"Pipework between inspection chambers","m³","10"]
[{"$f":"IF($E66<>\"\",MAX($A$1:INDIRECT(CONCATENATE(\"$A$\",ROW()-1)))+1,\"\")","v":""},""]
[{"$f":"IF($E67<>\"\",MAX($A$1:INDIRECT(CONCATENATE(\"$A$\",ROW()-1)))+1,\"\")","v":21},"C3.21",null,"Inspection chambers","m³",5]
[{"$f":"IF($E68<>\"\",MAX($A$1:INDIRECT(CONCATENATE(\"$A$\",ROW()-1)))+1,\"\")","v":""},""]
[{"$f":"IF($E69<>\"\",MAX($A$1:INDIRECT(CONCATENATE(\"$A$\",ROW()-1)))+1,\"\")","v":22},"C3.22",null,"Stormwater drainage pipework","m³",60]
[{"$f":"IF($E70<>\"\",MAX($A$1:INDIRECT(CONCATENATE(\"$A$\",ROW()-1)))+1,\"\")","v":""},""]
[{"$f":"IF($E71<>\"\",MAX($A$1:INDIRECT(CONCATENATE(\"$A$\",ROW()-1)))+1,\"\")","v":23},"C3.23",null,"Reno mattress","m³","60"]
[{"$f":"IF($E72<>\"\",MAX($A$1:INDIRECT(CONCATENATE(\"$A$\",ROW()-1)))+1,\"\")","v":""},""]
[{"$f":"IF($E73<>\"\",MAX($A$1:INDIRECT(CONCATENATE(\"$A$\",ROW()-1)))+1,\"\")","v":24},"C3.24",null,"Stilling Basin complete with headwall","m³","15"]
[{"$f":"IF($E74<>\"\",MAX($A$1:INDIRECT(CONCATENATE(\"$A$\",ROW()-1)))+1,\"\")","v":""},""]
[{"$f":"IF($E75<>\"\",MAX($A$1:INDIRECT(CONCATENATE(\"$A$\",ROW()-1)))+1,\"\")","v":25},"C3.25",null,"Sewer outlet pipe, infiltration gallery and septic tank","m³","75"]
[{"$f":"IF($E76<>\"\",MAX($A$1:INDIRECT(CONCATENATE(\"$A$\",ROW()-1)))+1,\"\")","v":""},""]
[{"$f":"IF($E77<>\"\",MAX($A$1:INDIRECT(CONCATENATE(\"$A$\",ROW()-1)))+1,\"\")","v":26},"C3.26",null,"Cable conduits","m³",200]
[]
[{"$f":"IF($E79<>\"\",MAX($A$1:INDIRECT(CONCATENATE(\"$A$\",ROW()-1)))+1,\"\")","v":27},{"$f":"IF(A79<>\"\",$A$3&A79,\"\")","v":"C3.27"},null,"Potable water pipeline","m³",180]
[]
[{"$f":"IF($E81<>\"\",MAX($A$1:INDIRECT(CONCATENATE(\"$A$\",ROW()-1)))+1,\"\")","v":""},{"$f":"IF(A81<>\"\",$A$3&A81,\"\")","v":""},"8.3.3\nPSD 8.3.3","Extra-over for restricted excavation"]
[{"$f":"IF($E82<>\"\",MAX($A$1:INDIRECT(CONCATENATE(\"$A$\",ROW()-1)))+1,\"\")","v":""},""]
[{"$f":"IF($E83<>\"\",MAX($A$1:INDIRECT(CONCATENATE(\"$A$\",ROW()-1)))+1,\"\")","v":28},"C3.28",null,"Hand excavation in soft material","m³",50]
[{"$f":"IF($E84<>\"\",MAX($A$1:INDIRECT(CONCATENATE(\"$A$\",ROW()-1)))+1,\"\")","v":""},""]
[{"$f":"IF($E85<>\"\",MAX($A$1:INDIRECT(CONCATENATE(\"$A$\",ROW()-1)))+1,\"\")","v":29},"C3.29",null,"Hand excavation in hard rock","m³",50]
[{"$f":"IF($E86<>\"\",MAX($A$1:INDIRECT(CONCATENATE(\"$A$\",ROW()-1)))+1,\"\")","v":""},""]
[{"$f":"IF($E87<>\"\",MAX($A$1:INDIRECT(CONCATENATE(\"$A$\",ROW()-1)))+1,\"\")","v":30},"C3.30",null,"Hard rock excavation","m³",150]
[]
[]
[]
[]
[]
[]
[{"$f":"IF($E94<>\"\",MAX($A$1:INDIRECT(CONCATENATE(\"$A$\",ROW()-1)))+1,\"\")","v":""},{"$f":"IF(A94<>\"\",$A$3&A94,\"\")","v":""},null," Carried forward / …"]
[{"$f":"IF($E95<>\"\",MAX($A$1:INDIRECT(CONCATENATE(\"$A$\",ROW()-1)))+1,\"\")","v":""},"",null," Brought forward / …"]
[]
[{"$f":"IF($E97<>\"\",MAX($A$1:INDIRECT(CONCATENATE(\"$A$\",ROW()-1)))+1,\"\")","v":""},"",null,"Topsoiling (to 150mm deep) from stockpile for:             "]
[{"$f":"IF($E98<>\"\",MAX($A$1:INDIRECT(CONCATENATE(\"$A$\",ROW()-1)))+1,\"\")","v":""},""]
[{"$f":"IF($E99<>\"\",MAX($A$1:INDIRECT(CONCATENATE(\"$A$\",ROW()-1)))+1,\"\")","v":31},"C3.31","8.3.10\nPSD 8.3.10","Embankments and cut slopes","m³",50]
[]
[{"$f":"IF($E101<>\"\",MAX($A$1:INDIRECT(CONCATENATE(\"$A$\",ROW()-1)))+1,\"\")","v":32},"C3.32","8.3.11\n","Grassing of embankments by means of hydroseeding","m²","330"]
[{"$f":"IF($E102<>\"\",MAX($A$1:INDIRECT(CONCATENATE(\"$A$\",ROW()-1)))+1,\"\")","v":""},""]
[{"$f":"IF($E103<>\"\",MAX($A$1:INDIRECT(CONCATENATE(\"$A$\",ROW()-1)))+1,\"\")","v":""},"","1200 D\nPSD 8.3.14\nPSD 8.3.15","Survey and protection of structures / buildings"]
[{"$f":"IF($E104<>\"\",MAX($A$1:INDIRECT(CONCATENATE(\"$A$\",ROW()-1)))+1,\"\")","v":""},""]
[{"$f":"IF($E105<>\"\",MAX($A$1:INDIRECT(CONCATENATE(\"$A$\",ROW()-1)))+1,\"\")","v":33},"C3.33",null,"Survey of surrounding structures before blasting","Sum","-","-"]
[{"$f":"IF($E106<>\"\",MAX($A$1:INDIRECT(CONCATENATE(\"$A$\",ROW()-1)))+1,\"\")","v":""},""]
[{"$f":"IF($E107<>\"\",MAX($A$1:INDIRECT(CONCATENATE(\"$A$\",ROW()-1)))+1,\"\")","v":34},"C3.34",null,"Protection of structures / buildings / services","Sum","-","-"]
[{"$f":"IF($E108<>\"\",MAX($A$1:INDIRECT(CONCATENATE(\"$A$\",ROW()-1)))+1,\"\")","v":""},""]
[{"$f":"IF($E109<>\"\",MAX($A$1:INDIRECT(CONCATENATE(\"$A$\",ROW()-1)))+1,\"\")","v":35},"C3.35","1200 G\nPSG 8.4.3","Class 15 MPa/19 mm mass concrete ","m3",300]
[{"$f":"IF($E110<>\"\",MAX($A$1:INDIRECT(CONCATENATE(\"$A$\",ROW()-1)))+1,\"\")","v":""},""]
[{"$f":"IF($E111<>\"\",MAX($A$1:INDIRECT(CONCATENATE(\"$A$\",ROW()-1)))+1,\"\")","v":36},"C3.36","1201 G\nPSG 8.4.3","Class 25 MPa/19 mm mass concrete ","m3",300]
[{"$f":"IF($E112<>\"\",MAX($A$1:INDIRECT(CONCATENATE(\"$A$\",ROW()-1)))+1,\"\")","v":""},""]
[{"$f":"IF($E113<>\"\",MAX($A$1:INDIRECT(CONCATENATE(\"$A$\",ROW()-1)))+1,\"\")","v":37},"C3.37","1202 G\nPSG 8.4.3","Class 25 MPa/19 mm reinforced concrete anchor blocks with 100 kg / m³ steel","m3",150]
[{"$f":"IF($E114<>\"\",MAX($A$1:INDIRECT(CONCATENATE(\"$A$\",ROW()-1)))+1,\"\")","v":""},""]
[{"$f":"IF($E115<>\"\",MAX($A$1:INDIRECT(CONCATENATE(\"$A$\",ROW()-1)))+1,\"\")","v":""},"",null,"LAYERWORKS "]
[{"$f":"IF($E116<>\"\",MAX($A$1:INDIRECT(CONCATENATE(\"$A$\",ROW()-1)))+1,\"\")","v":""},"",null,"Reservoir and Pump Station"]
[{"$f":"IF($E117<>\"\",MAX($A$1:INDIRECT(CONCATENATE(\"$A$\",ROW()-1)))+1,\"\")","v":""},""]
[{"$f":"IF($E118<>\"\",MAX($A$1:INDIRECT(CONCATENATE(\"$A$\",ROW()-1)))+1,\"\")","v":""},"","1200 DM","Treatment of roadbed"]
[{"$f":"IF($E119<>\"\",MAX($A$1:INDIRECT(CONCATENATE(\"$A$\",ROW()-1)))+1,\"\")","v":""},""]
[{"$f":"IF($E120<>\"\",MAX($A$1:INDIRECT(CONCATENATE(\"$A$\",ROW()-1)))+1,\"\")","v":38},"C3.38","8.3.3\nPSDM 8.3.3","Platform preparation and compaction of material to a minimum of 93% MOD AASHTO (or 100% for sand)","m³",300]
[]
[{"$f":"IF($E122<>\"\",MAX($A$1:INDIRECT(CONCATENATE(\"$A$\",ROW()-1)))+1,\"\")","v":""},"","1200 ME","Subbase:"]
[{"$f":"IF($E123<>\"\",MAX($A$1:INDIRECT(CONCATENATE(\"$A$\",ROW()-1)))+1,\"\")","v":""},""]
[{"$f":"IF($E124<>\"\",MAX($A$1:INDIRECT(CONCATENATE(\"$A$\",ROW()-1)))+1,\"\")","v":""},"","8.3.3\nPSME 8.3.3","Construct the subbase course using material from commercial sources."]
[{"$f":"IF($E125<>\"\",MAX($A$1:INDIRECT(CONCATENATE(\"$A$\",ROW()-1)))+1,\"\")","v":""},""]
[{"$f":"IF($E126<>\"\",MAX($A$1:INDIRECT(CONCATENATE(\"$A$\",ROW()-1)))+1,\"\")","v":39},"C3.39",null,"300 mm G3 selected material below reservoir footing","m³",400]
[]
[{"$f":"IF($E128<>\"\",MAX($A$1:INDIRECT(CONCATENATE(\"$A$\",ROW()-1)))+1,\"\")","v":40},"C3.40",null,"150 mm G5 selected material for pump station platform layerworks","m³",300]
[]
[]
[]
[]
[]
[]
[{"$f":"IF($E135<>\"\",MAX($A$1:INDIRECT(CONCATENATE(\"$A$\",ROW()-1)))+1,\"\")","v":""},{"$f":"IF(A135<>\"\",$A$3&A135,\"\")","v":""},null," Carried forward / …"]
[{"$f":"IF($E136<>\"\",MAX($A$1:INDIRECT(CONCATENATE(\"$A$\",ROW()-1)))+1,\"\")","v":""},"",null," Brought forward / …"]
[]
[{"$f":"IF($E138<>\"\",MAX($A$1:INDIRECT(CONCATENATE(\"$A$\",ROW()-1)))+1,\"\")","v":""},"","SANS"]
[{"$f":"IF($E139<>\"\",MAX($A$1:INDIRECT(CONCATENATE(\"$A$\",ROW()-1)))+1,\"\")","v":""},"","1200 MF","Base"]
[{"$f":"IF($E140<>\"\",MAX($A$1:INDIRECT(CONCATENATE(\"$A$\",ROW()-1)))+1,\"\")","v":""},""]
[{"$f":"IF($E141<>\"\",MAX($A$1:INDIRECT(CONCATENATE(\"$A$\",ROW()-1)))+1,\"\")","v":""},"","8.3.3\n","Construct the base course using material from commercial sources (G5 stabilized to C4) to a thickness of:"]
[{"$f":"IF($E142<>\"\",MAX($A$1:INDIRECT(CONCATENATE(\"$A$\",ROW()-1)))+1,\"\")","v":""},""]
[{"$f":"IF($E143<>\"\",MAX($A$1:INDIRECT(CONCATENATE(\"$A$\",ROW()-1)))+1,\"\")","v":41},"C3.41",null,"150 mm G5 selected material to pump station platform compacted","m³",300]
[{"$f":"IF($E144<>\"\",MAX($A$1:INDIRECT(CONCATENATE(\"$A$\",ROW()-1)))+1,\"\")","v":""},""]
[{"$f":"IF($E145<>\"\",MAX($A$1:INDIRECT(CONCATENATE(\"$A$\",ROW()-1)))+1,\"\")","v":""},{"$f":"IF(A145<>\"\",$A$3&A145,\"\")","v":""},"8.3.5","Process base material by:"]
[{"$f":"IF($E146<>\"\",MAX($A$1:INDIRECT(CONCATENATE(\"$A$\",ROW()-1)))+1,\"\")","v":""},""]
[{"$f":"IF($E147<>\"\",MAX($A$1:INDIRECT(CONCATENATE(\"$A$\",ROW()-1)))+1,\"\")","v":42},"C3.42",null,"(d) Stabilization","m³",300]
[{"$f":"IF($E148<>\"\",MAX($A$1:INDIRECT(CONCATENATE(\"$A$\",ROW()-1)))+1,\"\")","v":""},""]
[{"$f":"IF($E149<>\"\",MAX($A$1:INDIRECT(CONCATENATE(\"$A$\",ROW()-1)))+1,\"\")","v":43},"C3.43","8.3.8","Stabilizing using portland cement","t",30]
[]
[{"$f":"IF($E151<>\"\",MAX($A$1:INDIRECT(CONCATENATE(\"$A$\",ROW()-1)))+1,\"\")","v":""},""]
[{"$f":"IF($E152<>\"\",MAX($A$1:INDIRECT(CONCATENATE(\"$A$\",ROW()-1)))+1,\"\")","v":""},"","1200 MK","KERBING"]
[{"$f":"IF($E153<>\"\",MAX($A$1:INDIRECT(CONCATENATE(\"$A$\",ROW()-1)))+1,\"\")","v":""},"",null,"Reservoir and Pump Station"]
[{"$f":"IF($E154<>\"\",MAX($A$1:INDIRECT(CONCATENATE(\"$A$\",ROW()-1)))+1,\"\")","v":""},""]
[{"$f":"IF($E155<>\"\",MAX($A$1:INDIRECT(CONCATENATE(\"$A$\",ROW()-1)))+1,\"\")","v":""},"","8.2.1\nPSMK 8.2.1","Kerb Type: E1 (incl concrete bedding)"]
[{"$f":"IF($E156<>\"\",MAX($A$1:INDIRECT(CONCATENATE(\"$A$\",ROW()-1)))+1,\"\")","v":""},""]
[{"$f":"IF($E157<>\"\",MAX($A$1:INDIRECT(CONCATENATE(\"$A$\",ROW()-1)))+1,\"\")","v":44},"C3.44",null,"Radius up to 4 m       ","m"]
[{"$f":"IF($E158<>\"\",MAX($A$1:INDIRECT(CONCATENATE(\"$A$\",ROW()-1)))+1,\"\")","v":""},""]
[{"$f":"IF($E159<>\"\",MAX($A$1:INDIRECT(CONCATENATE(\"$A$\",ROW()-1)))+1,\"\")","v":45},"C3.45",null,"Radius over 4 m up to 20 m  ","m",16]
[{"$f":"IF($E160<>\"\",MAX($A$1:INDIRECT(CONCATENATE(\"$A$\",ROW()-1)))+1,\"\")","v":""},""]
[{"$f":"IF($E161<>\"\",MAX($A$1:INDIRECT(CONCATENATE(\"$A$\",ROW()-1)))+1,\"\")","v":46},"C3.46",null,"Radius over 20 m and straight sections","m",70]
[{"$f":"IF($E162<>\"\",MAX($A$1:INDIRECT(CONCATENATE(\"$A$\",ROW()-1)))+1,\"\")","v":""},""]
[{"$f":"IF($E163<>\"\",MAX($A$1:INDIRECT(CONCATENATE(\"$A$\",ROW()-1)))+1,\"\")","v":""},"","8.2.1\nPSMK 8.2.1","Kerb Type: CK5 (incl concrete bedding)"]
[{"$f":"IF($E164<>\"\",MAX($A$1:INDIRECT(CONCATENATE(\"$A$\",ROW()-1)))+1,\"\")","v":""},""]
[{"$f":"IF($E165<>\"\",MAX($A$1:INDIRECT(CONCATENATE(\"$A$\",ROW()-1)))+1,\"\")","v":47},"C3.47",null,"Radius up to 4 m       ","m",10]
[{"$f":"IF($E166<>\"\",MAX($A$1:INDIRECT(CONCATENATE(\"$A$\",ROW()-1)))+1,\"\")","v":""},""]
[{"$f":"IF($E167<>\"\",MAX($A$1:INDIRECT(CONCATENATE(\"$A$\",ROW()-1)))+1,\"\")","v":48},"C3.48",null,"Radius over 4 m up to 20 m  ","m",16]
[{"$f":"IF($E168<>\"\",MAX($A$1:INDIRECT(CONCATENATE(\"$A$\",ROW()-1)))+1,\"\")","v":""},""]
[{"$f":"IF($E169<>\"\",MAX($A$1:INDIRECT(CONCATENATE(\"$A$\",ROW()-1)))+1,\"\")","v":49},"C3.49",null,"Radius over 20 m and straight sections","m",130]
[]
[{"$f":"IF($E171<>\"\",MAX($A$1:INDIRECT(CONCATENATE(\"$A$\",ROW()-1)))+1,\"\")","v":""},""]
[{"$f":"IF($E172<>\"\",MAX($A$1:INDIRECT(CONCATENATE(\"$A$\",ROW()-1)))+1,\"\")","v":""},"","1200 MJ","SEGMENTED PAVING"]
[{"$f":"IF($E173<>\"\",MAX($A$1:INDIRECT(CONCATENATE(\"$A$\",ROW()-1)))+1,\"\")","v":""},"",null,"Reservoir and Pump Station"]
[{"$f":"IF($E174<>\"\",MAX($A$1:INDIRECT(CONCATENATE(\"$A$\",ROW()-1)))+1,\"\")","v":""},""]
[{"$f":"IF($E175<>\"\",MAX($A$1:INDIRECT(CONCATENATE(\"$A$\",ROW()-1)))+1,\"\")","v":""},"","8.2.2\nPSMK 8.2.2","Construction of paving complete on 20mm sand:"]
[{"$f":"IF($E176<>\"\",MAX($A$1:INDIRECT(CONCATENATE(\"$A$\",ROW()-1)))+1,\"\")","v":""},""]
[{"$f":"IF($E177<>\"\",MAX($A$1:INDIRECT(CONCATENATE(\"$A$\",ROW()-1)))+1,\"\")","v":50},"C3.50",null,"80 mm thick Type S-A blocks (45MPa) in herringbone pattern","m²",1800]
[{"$f":"IF($E178<>\"\",MAX($A$1:INDIRECT(CONCATENATE(\"$A$\",ROW()-1)))+1,\"\")","v":""},""]
[{"$f":"IF($E179<>\"\",MAX($A$1:INDIRECT(CONCATENATE(\"$A$\",ROW()-1)))+1,\"\")","v":51},"C3.51","8.2.3","Cutting units to fit edge restraints","m",300]
[{"$f":"IF($E180<>\"\",MAX($A$1:INDIRECT(CONCATENATE(\"$A$\",ROW()-1)))+1,\"\")","v":""},""]
[{"$f":"IF($E181<>\"\",MAX($A$1:INDIRECT(CONCATENATE(\"$A$\",ROW()-1)))+1,\"\")","v":52},"C3.52","8.2.4","Rolling to locked up condition as specified in Clause 5.6.2 and apply eco-binder","m²",1800]
[]
[{"$f":"IF($E183<>\"\",MAX($A$1:INDIRECT(CONCATENATE(\"$A$\",ROW()-1)))+1,\"\")","v":""},{"$f":"IF(A183<>\"\",$A$3&A183,\"\")","v":""},null," Carried forward / …"]
[{"$f":"IF($E184<>\"\",MAX($A$1:INDIRECT(CONCATENATE(\"$A$\",ROW()-1)))+1,\"\")","v":""},"",null," Brought forward / …"]
[]
[{"$f":"IF($E186<>\"\",MAX($A$1:INDIRECT(CONCATENATE(\"$A$\",ROW()-1)))+1,\"\")","v":""},{"$f":"IF(A186<>\"\",$A$3&A186,\"\")","v":""},null,"PIPELINES"]
[{"$f":"IF($E187<>\"\",MAX($A$1:INDIRECT(CONCATENATE(\"$A$\",ROW()-1)))+1,\"\")","v":""},""]
[{"$f":"IF($E188<>\"\",MAX($A$1:INDIRECT(CONCATENATE(\"$A$\",ROW()-1)))+1,\"\")","v":""},"",null,"Trench Excavation"]
[{"$f":"IF($E189<>\"\",MAX($A$1:INDIRECT(CONCATENATE(\"$A$\",ROW()-1)))+1,\"\")","v":""},""]
[{"$f":"IF($E190<>\"\",MAX($A$1:INDIRECT(CONCATENATE(\"$A$\",ROW()-1)))+1,\"\")","v":""},"","8.3.2\nPSDB 8.3.2\nPSDB 8.3.3","Excavate in all materials for trenches, backfill, compact and disposal of surplus  material for:"]
[{"$f":"IF($E191<>\"\",MAX($A$1:INDIRECT(CONCATENATE(\"$A$\",ROW()-1)))+1,\"\")","v":""},""]
[{"$f":"IF($E192<>\"\",MAX($A$1:INDIRECT(CONCATENATE(\"$A$\",ROW()-1)))+1,\"\")","v":""},""," ","Pipes of up to DN 700 mm for depths:"]
[{"$f":"IF($E193<>\"\",MAX($A$1:INDIRECT(CONCATENATE(\"$A$\",ROW()-1)))+1,\"\")","v":""},""]
[{"$f":"IF($E194<>\"\",MAX($A$1:INDIRECT(CONCATENATE(\"$A$\",ROW()-1)))+1,\"\")","v":""},"",null,"Over      and       Up to"]
[{"$f":"IF($E195<>\"\",MAX($A$1:INDIRECT(CONCATENATE(\"$A$\",ROW()-1)))+1,\"\")","v":""},""]
[{"$f":"IF($E196<>\"\",MAX($A$1:INDIRECT(CONCATENATE(\"$A$\",ROW()-1)))+1,\"\")","v":53},"C3.53",null,"0 m                     2,0 m","  m",150]
[{"$f":"IF($E197<>\"\",MAX($A$1:INDIRECT(CONCATENATE(\"$A$\",ROW()-1)))+1,\"\")","v":""},""]
[{"$f":"IF($E198<>\"\",MAX($A$1:INDIRECT(CONCATENATE(\"$A$\",ROW()-1)))+1,\"\")","v":54},"C3.54",null,"2,0 m                  3,0 m","  m",100]
[{"$f":"IF($E199<>\"\",MAX($A$1:INDIRECT(CONCATENATE(\"$A$\",ROW()-1)))+1,\"\")","v":""},""]
[{"$f":"IF($E200<>\"\",MAX($A$1:INDIRECT(CONCATENATE(\"$A$\",ROW()-1)))+1,\"\")","v":55},"C3.55",null,"3,0 m                  4,0 m","  m",10]
[]
[{"$f":"IF($E202<>\"\",MAX($A$1:INDIRECT(CONCATENATE(\"$A$\",ROW()-1)))+1,\"\")","v":""},{"$f":"IF(A202<>\"\",$A$3&A202,\"\")","v":""},"8.3.2\nPSD 8.3.2","Extra Over Trench Excavations above:"]
[{"$f":"IF($E203<>\"\",MAX($A$1:INDIRECT(CONCATENATE(\"$A$\",ROW()-1)))+1,\"\")","v":""},""]
[{"$f":"IF($E204<>\"\",MAX($A$1:INDIRECT(CONCATENATE(\"$A$\",ROW()-1)))+1,\"\")","v":56},"C3.56"," ","Hard rock excavation","m3",450]
[{"$f":"IF($E205<>\"\",MAX($A$1:INDIRECT(CONCATENATE(\"$A$\",ROW()-1)))+1,\"\")","v":""},""]
[{"$f":"IF($E206<>\"\",MAX($A$1:INDIRECT(CONCATENATE(\"$A$\",ROW()-1)))+1,\"\")","v":57},"C3.57",null,"Boulder excavation Class A","m3",{"$f":"0.1*F204","v":45}]
[{"$f":"IF($E207<>\"\",MAX($A$1:INDIRECT(CONCATENATE(\"$A$\",ROW()-1)))+1,\"\")","v":""},""]
[{"$f":"IF($E208<>\"\",MAX($A$1:INDIRECT(CONCATENATE(\"$A$\",ROW()-1)))+1,\"\")","v":58},"C3.58",null,"Boulder excavation Class B","m3",{"$f":"0.1*F204","v":45}]
[{"$f":"IF($E209<>\"\",MAX($A$1:INDIRECT(CONCATENATE(\"$A$\",ROW()-1)))+1,\"\")","v":""},""]
[{"$f":"IF($E210<>\"\",MAX($A$1:INDIRECT(CONCATENATE(\"$A$\",ROW()-1)))+1,\"\")","v":59},"C3.59","8.3.2\nPSDB 8.3.2","Hand excavation and backfill where ordered by the Engineer","m3",100]
[{"$f":"IF($E211<>\"\",MAX($A$1:INDIRECT(CONCATENATE(\"$A$\",ROW()-1)))+1,\"\")","v":""},""]
[{"$f":"IF($E212<>\"\",MAX($A$1:INDIRECT(CONCATENATE(\"$A$\",ROW()-1)))+1,\"\")","v":60},"C3.60",null,"Backfill stabilised by 5% where ordered by the Engineer","m3",25]
[{"$f":"IF($E213<>\"\",MAX($A$1:INDIRECT(CONCATENATE(\"$A$\",ROW()-1)))+1,\"\")","v":""},""]
[{"$f":"IF($E214<>\"\",MAX($A$1:INDIRECT(CONCATENATE(\"$A$\",ROW()-1)))+1,\"\")","v":""},"",null,"Interconnecting Pipework"]
[{"$f":"IF($E215<>\"\",MAX($A$1:INDIRECT(CONCATENATE(\"$A$\",ROW()-1)))+1,\"\")","v":""},""]
[{"$f":"IF($E216<>\"\",MAX($A$1:INDIRECT(CONCATENATE(\"$A$\",ROW()-1)))+1,\"\")","v":""},"",null,"PVC pipes"]
[{"$f":"IF($E217<>\"\",MAX($A$1:INDIRECT(CONCATENATE(\"$A$\",ROW()-1)))+1,\"\")","v":""},""]
[{"$f":"IF($E218<>\"\",MAX($A$1:INDIRECT(CONCATENATE(\"$A$\",ROW()-1)))+1,\"\")","v":""},"","8.2.1\nPSL 8.2.1","Supply, lay and bed on bedding for flexible uPVC pipes, complete with couplings \n(Class 34) :"]
[{"$f":"IF($E219<>\"\",MAX($A$1:INDIRECT(CONCATENATE(\"$A$\",ROW()-1)))+1,\"\")","v":""},""]
[{"$f":"IF($E220<>\"\",MAX($A$1:INDIRECT(CONCATENATE(\"$A$\",ROW()-1)))+1,\"\")","v":61},"C3.61",null,"110 mm dia ","m",300]
[{"$f":"IF($E221<>\"\",MAX($A$1:INDIRECT(CONCATENATE(\"$A$\",ROW()-1)))+1,\"\")","v":""},""]
[{"$f":"IF($E222<>\"\",MAX($A$1:INDIRECT(CONCATENATE(\"$A$\",ROW()-1)))+1,\"\")","v":62},"C3.62",null,"200 mm dia ","m",50]
[{"$f":"IF($E223<>\"\",MAX($A$1:INDIRECT(CONCATENATE(\"$A$\",ROW()-1)))+1,\"\")","v":""},""]
[{"$f":"IF($E224<>\"\",MAX($A$1:INDIRECT(CONCATENATE(\"$A$\",ROW()-1)))+1,\"\")","v":""},"","8.2.2\nPSL 8.2.2","Extra over for PVC pipes for supplying, laying and bedding of uPVC specials with couplings"]
[{"$f":"IF($E225<>\"\",MAX($A$1:INDIRECT(CONCATENATE(\"$A$\",ROW()-1)))+1,\"\")","v":""},""]
[{"$f":"IF($E226<>\"\",MAX($A$1:INDIRECT(CONCATENATE(\"$A$\",ROW()-1)))+1,\"\")","v":63},"C3.63",null,"90°, 110 mm dia bends (Class 34):","No",2]
[]
[]
[]
[]
[{"$f":"IF($E231<>\"\",MAX($A$1:INDIRECT(CONCATENATE(\"$A$\",ROW()-1)))+1,\"\")","v":""},{"$f":"IF(A231<>\"\",$A$3&A231,\"\")","v":""},null," Carried forward / …"]
[{"$f":"IF($E232<>\"\",MAX($A$1:INDIRECT(CONCATENATE(\"$A$\",ROW()-1)))+1,\"\")","v":""},"",null," Brought forward / …"]
[]
[{"$f":"IF($E234<>\"\",MAX($A$1:INDIRECT(CONCATENATE(\"$A$\",ROW()-1)))+1,\"\")","v":64},"C3.64",null,"Additional fittings that may be required","Prov\nSum","-","-",50000]
[]
[{"$f":"IF($E236<>\"\",MAX($A$1:INDIRECT(CONCATENATE(\"$A$\",ROW()-1)))+1,\"\")","v":65},{"$f":"IF(A236<>\"\",$A$3&A236,\"\")","v":"C3.65"},null,"Percentage adjustment on the item above for Contractor's overheads and profit (state % and extend as an amount)","%",50000]
[{"$f":"IF($E237<>\"\",MAX($A$1:INDIRECT(CONCATENATE(\"$A$\",ROW()-1)))+1,\"\")","v":""},""]
[{"$f":"IF($E238<>\"\",MAX($A$1:INDIRECT(CONCATENATE(\"$A$\",ROW()-1)))+1,\"\")","v":""},"",null,"HDPE pipes"]
[{"$f":"IF($E239<>\"\",MAX($A$1:INDIRECT(CONCATENATE(\"$A$\",ROW()-1)))+1,\"\")","v":""},""]
[{"$f":"IF($E240<>\"\",MAX($A$1:INDIRECT(CONCATENATE(\"$A$\",ROW()-1)))+1,\"\")","v":""},"","8.2.1\nPSL 8.2.1","Supply, lay and bed on bedding for HDPE PE 100 pipe"]
[{"$f":"IF($E241<>\"\",MAX($A$1:INDIRECT(CONCATENATE(\"$A$\",ROW()-1)))+1,\"\")","v":""},""]
[{"$f":"IF($E242<>\"\",MAX($A$1:INDIRECT(CONCATENATE(\"$A$\",ROW()-1)))+1,\"\")","v":66},"C3.66",null,"DN 710 pipe, PN 6 (butt-welded)","m",150]
[{"$f":"IF($E243<>\"\",MAX($A$1:INDIRECT(CONCATENATE(\"$A$\",ROW()-1)))+1,\"\")","v":""},""]
[{"$f":"IF($E244<>\"\",MAX($A$1:INDIRECT(CONCATENATE(\"$A$\",ROW()-1)))+1,\"\")","v":67},"C3.67",null,"DN 630 pipe, PN 6 (butt-welded)","m",60]
[{"$f":"IF($E245<>\"\",MAX($A$1:INDIRECT(CONCATENATE(\"$A$\",ROW()-1)))+1,\"\")","v":""}]
[{"$f":"IF($E246<>\"\",MAX($A$1:INDIRECT(CONCATENATE(\"$A$\",ROW()-1)))+1,\"\")","v":68},{"$f":"IF(A246<>\"\",$A$3&A246,\"\")","v":"C3.68"},null,"DN 75 pipe, PN 16 (butt-welded)","m",250]
[]
[{"$f":"IF($E248<>\"\",MAX($A$1:INDIRECT(CONCATENATE(\"$A$\",ROW()-1)))+1,\"\")","v":""},{"$f":"IF(A248<>\"\",$A$3&A248,\"\")","v":""},"8.2.2\nPSL 8.2.2","Extra over for HDPE pipes for supplying, laying and bedding of HDPE specials with couplings"]
[]
[{"$f":"IF($E250<>\"\",MAX($A$1:INDIRECT(CONCATENATE(\"$A$\",ROW()-1)))+1,\"\")","v":69},{"$f":"IF(A250<>\"\",$A$3&A250,\"\")","v":"C3.69"},null,"DN 710 HDPE stub with SS 304 backing ring (PN 6)","No",1]
[]
[{"$f":"IF($E252<>\"\",MAX($A$1:INDIRECT(CONCATENATE(\"$A$\",ROW()-1)))+1,\"\")","v":70},{"$f":"IF(A252<>\"\",$A$3&A252,\"\")","v":"C3.70"},null,"DN 710 HDPE stub with SS 304 backing ring (PN 10)","No",1]
[{"$f":"IF($E253<>\"\",MAX($A$1:INDIRECT(CONCATENATE(\"$A$\",ROW()-1)))+1,\"\")","v":""},""]
[{"$f":"IF($E254<>\"\",MAX($A$1:INDIRECT(CONCATENATE(\"$A$\",ROW()-1)))+1,\"\")","v":71},"C3.71",null,"DN 630 HDPE stub with SS 304 backing ring (PN 6)","No",2]
[{"$f":"IF($E255<>\"\",MAX($A$1:INDIRECT(CONCATENATE(\"$A$\",ROW()-1)))+1,\"\")","v":""},""]
[{"$f":"IF($E256<>\"\",MAX($A$1:INDIRECT(CONCATENATE(\"$A$\",ROW()-1)))+1,\"\")","v":72},"C3.72",null,"45° DN 710 bends (PN 6)","No",2]
[]
[{"$f":"IF($E258<>\"\",MAX($A$1:INDIRECT(CONCATENATE(\"$A$\",ROW()-1)))+1,\"\")","v":73},{"$f":"IF(A258<>\"\",$A$3&A258,\"\")","v":"C3.73"},null,"90° DN 75 bends (PN 16)","No",2]
[]
[{"$f":"IF($E260<>\"\",MAX($A$1:INDIRECT(CONCATENATE(\"$A$\",ROW()-1)))+1,\"\")","v":""},{"$f":"IF(A260<>\"\",$A$3&A260,\"\")","v":""},"SANS \n1200 LE ","Supply and install subsurface drains complete:"]
[{"$f":"IF($E261<>\"\",MAX($A$1:INDIRECT(CONCATENATE(\"$A$\",ROW()-1)))+1,\"\")","v":""},""]
[{"$f":"IF($E262<>\"\",MAX($A$1:INDIRECT(CONCATENATE(\"$A$\",ROW()-1)))+1,\"\")","v":74},"C3.74","PSLE 8.2.14","110mm dia uPVC subsoil drain complete around the pump station structure as per Dwg No. 106777-CC-0209 including 4 x 90 deg bends","m",110]
[]
[{"$f":"IF($E264<>\"\",MAX($A$1:INDIRECT(CONCATENATE(\"$A$\",ROW()-1)))+1,\"\")","v":75},{"$f":"IF(A264<>\"\",$A$3&A264,\"\")","v":"C3.75"},"PSLE 8.2.15","110mm dia uPVC rodding eye with cap for subsoil pipes, complete with mass concrete for the above subsoils","No",4]
[]
[]
[]
[]
[]
[]
[]
[]
[{"$f":"IF($E273<>\"\",MAX($A$1:INDIRECT(CONCATENATE(\"$A$\",ROW()-1)))+1,\"\")","v":""},{"$f":"IF(A273<>\"\",$A$3&A273,\"\")","v":""},null," Carried forward / …"]
[{"$f":"IF($E274<>\"\",MAX($A$1:INDIRECT(CONCATENATE(\"$A$\",ROW()-1)))+1,\"\")","v":""},"",null," Brought forward / …"]
[]
[{"$f":"IF($E276<>\"\",MAX($A$1:INDIRECT(CONCATENATE(\"$A$\",ROW()-1)))+1,\"\")","v":""},"",null,"Steel pipes"]
[{"$f":"IF($E277<>\"\",MAX($A$1:INDIRECT(CONCATENATE(\"$A$\",ROW()-1)))+1,\"\")","v":""},""]
[{"$f":"IF($E278<>\"\",MAX($A$1:INDIRECT(CONCATENATE(\"$A$\",ROW()-1)))+1,\"\")","v":""},"","DWS 1130\n10\nDWS 1110\n20.14.1\n20.14.2","Supply, lay and bed steel pipes and specials complete with couplings for the following items manufactured from Grade X52 steel, including lining and coating in accordance with DWS 9900 C7:"]
[{"$f":"IF($E279<>\"\",MAX($A$1:INDIRECT(CONCATENATE(\"$A$\",ROW()-1)))+1,\"\")","v":""},""]
[{"$f":"IF($E280<>\"\",MAX($A$1:INDIRECT(CONCATENATE(\"$A$\",ROW()-1)))+1,\"\")","v":76},"C3.76",null,"DN 600, 6.0 mm wall thickness, connected with Style W77 Vitaulic couplings and one pipe end flanged, PN 10","m",36]
[{"$f":"IF($E281<>\"\",MAX($A$1:INDIRECT(CONCATENATE(\"$A$\",ROW()-1)))+1,\"\")","v":""},""]
[{"$f":"IF($E282<>\"\",MAX($A$1:INDIRECT(CONCATENATE(\"$A$\",ROW()-1)))+1,\"\")","v":77},"C3.77",null,"DN 600, 45 degree long radius bends connected with Style W77 Vitaulic couplings, PN 10 ","No",2]
[{"$f":"IF($E283<>\"\",MAX($A$1:INDIRECT(CONCATENATE(\"$A$\",ROW()-1)))+1,\"\")","v":""},""]
[{"$f":"IF($E284<>\"\",MAX($A$1:INDIRECT(CONCATENATE(\"$A$\",ROW()-1)))+1,\"\")","v":""},"",null,"Cable Conduits"]
[{"$f":"IF($E285<>\"\",MAX($A$1:INDIRECT(CONCATENATE(\"$A$\",ROW()-1)))+1,\"\")","v":""},""]
[{"$f":"IF($E286<>\"\",MAX($A$1:INDIRECT(CONCATENATE(\"$A$\",ROW()-1)))+1,\"\")","v":""},"","1200 LC","Supply, lay, bed and test duct (including draw wire)"]
[{"$f":"IF($E287<>\"\",MAX($A$1:INDIRECT(CONCATENATE(\"$A$\",ROW()-1)))+1,\"\")","v":""},""]
[{"$f":"IF($E288<>\"\",MAX($A$1:INDIRECT(CONCATENATE(\"$A$\",ROW()-1)))+1,\"\")","v":78},"C3.78","8.2.5","32 mm HDPE Fibre optic conduit","m",180]
[{"$f":"IF($E289<>\"\",MAX($A$1:INDIRECT(CONCATENATE(\"$A$\",ROW()-1)))+1,\"\")","v":""},""]
[{"$f":"IF($E290<>\"\",MAX($A$1:INDIRECT(CONCATENATE(\"$A$\",ROW()-1)))+1,\"\")","v":79},"C3.79",null,"160 mm uPVC conduit","m",250]
[{"$f":"IF($E291<>\"\",MAX($A$1:INDIRECT(CONCATENATE(\"$A$\",ROW()-1)))+1,\"\")","v":""},""]
[{"$f":"IF($E292<>\"\",MAX($A$1:INDIRECT(CONCATENATE(\"$A$\",ROW()-1)))+1,\"\")","v":80},"C3.80","8.2.7","Fibre optic telebox","No",7]
[{"$f":"IF($E293<>\"\",MAX($A$1:INDIRECT(CONCATENATE(\"$A$\",ROW()-1)))+1,\"\")","v":""},""]
[{"$f":"IF($E294<>\"\",MAX($A$1:INDIRECT(CONCATENATE(\"$A$\",ROW()-1)))+1,\"\")","v":""},"","1200 LB","Bedding & Blanket"]
[{"$f":"IF($E295<>\"\",MAX($A$1:INDIRECT(CONCATENATE(\"$A$\",ROW()-1)))+1,\"\")","v":""},""," "]
[{"$f":"IF($E296<>\"\",MAX($A$1:INDIRECT(CONCATENATE(\"$A$\",ROW()-1)))+1,\"\")","v":""},"","8.2.2.3\nPSLB 8.2.2.3","From commercial sources:"]
[{"$f":"IF($E297<>\"\",MAX($A$1:INDIRECT(CONCATENATE(\"$A$\",ROW()-1)))+1,\"\")","v":""},""]
[{"$f":"IF($E298<>\"\",MAX($A$1:INDIRECT(CONCATENATE(\"$A$\",ROW()-1)))+1,\"\")","v":""},"",null,"Selected granular material"]
[{"$f":"IF($E299<>\"\",MAX($A$1:INDIRECT(CONCATENATE(\"$A$\",ROW()-1)))+1,\"\")","v":""},""]
[{"$f":"IF($E300<>\"\",MAX($A$1:INDIRECT(CONCATENATE(\"$A$\",ROW()-1)))+1,\"\")","v":81},"C3.81",null,"110 mm dia uPVC","m3",56]
[{"$f":"IF($E301<>\"\",MAX($A$1:INDIRECT(CONCATENATE(\"$A$\",ROW()-1)))+1,\"\")","v":""},""]
[{"$f":"IF($E302<>\"\",MAX($A$1:INDIRECT(CONCATENATE(\"$A$\",ROW()-1)))+1,\"\")","v":82},"C3.82",null,"200 mm dia uPVC","m3",15]
[{"$f":"IF($E303<>\"\",MAX($A$1:INDIRECT(CONCATENATE(\"$A$\",ROW()-1)))+1,\"\")","v":""},""]
[{"$f":"IF($E304<>\"\",MAX($A$1:INDIRECT(CONCATENATE(\"$A$\",ROW()-1)))+1,\"\")","v":83},"C3.83",null,"DN 710 HDPE","m3",37]
[{"$f":"IF($E305<>\"\",MAX($A$1:INDIRECT(CONCATENATE(\"$A$\",ROW()-1)))+1,\"\")","v":""},""]
[{"$f":"IF($E306<>\"\",MAX($A$1:INDIRECT(CONCATENATE(\"$A$\",ROW()-1)))+1,\"\")","v":84},"C3.84",null,"DN 630 HDPE","m3",42]
[{"$f":"IF($E307<>\"\",MAX($A$1:INDIRECT(CONCATENATE(\"$A$\",ROW()-1)))+1,\"\")","v":""},""]
[{"$f":"IF($E308<>\"\",MAX($A$1:INDIRECT(CONCATENATE(\"$A$\",ROW()-1)))+1,\"\")","v":85},"C3.85",null,"DN 600 steel","m3",25]
[{"$f":"IF($E309<>\"\",MAX($A$1:INDIRECT(CONCATENATE(\"$A$\",ROW()-1)))+1,\"\")","v":""},""]
[{"$f":"IF($E310<>\"\",MAX($A$1:INDIRECT(CONCATENATE(\"$A$\",ROW()-1)))+1,\"\")","v":86},"C3.86",null,"DN 700 steel","m3",206]
[{"$f":"IF($E311<>\"\",MAX($A$1:INDIRECT(CONCATENATE(\"$A$\",ROW()-1)))+1,\"\")","v":""},""]
[{"$f":"IF($E312<>\"\",MAX($A$1:INDIRECT(CONCATENATE(\"$A$\",ROW()-1)))+1,\"\")","v":""},{"$f":"IF(A312<>\"\",$A$3&A312,\"\")","v":""},null,"Selected fill material"]
[{"$f":"IF($E313<>\"\",MAX($A$1:INDIRECT(CONCATENATE(\"$A$\",ROW()-1)))+1,\"\")","v":""},""]
[{"$f":"IF($E314<>\"\",MAX($A$1:INDIRECT(CONCATENATE(\"$A$\",ROW()-1)))+1,\"\")","v":87},"C3.87",null,"110 mm dia uPVC","m3",38]
[{"$f":"IF($E315<>\"\",MAX($A$1:INDIRECT(CONCATENATE(\"$A$\",ROW()-1)))+1,\"\")","v":""},""]
[{"$f":"IF($E316<>\"\",MAX($A$1:INDIRECT(CONCATENATE(\"$A$\",ROW()-1)))+1,\"\")","v":88},"C3.88",null,"200 mm dia uPVC","m3",8]
[]
[{"$f":"IF($E318<>\"\",MAX($A$1:INDIRECT(CONCATENATE(\"$A$\",ROW()-1)))+1,\"\")","v":""},{"$f":"IF(A318<>\"\",$A$3&A318,\"\")","v":""},null," Carried forward / …"]
[{"$f":"IF($E319<>\"\",MAX($A$1:INDIRECT(CONCATENATE(\"$A$\",ROW()-1)))+1,\"\")","v":""},"",null," Brought forward / …"]
[]
[{"$f":"IF($E321<>\"\",MAX($A$1:INDIRECT(CONCATENATE(\"$A$\",ROW()-1)))+1,\"\")","v":89},"C3.89",null,"DN 710 HDPE","m3",13]
[{"$f":"IF($E322<>\"\",MAX($A$1:INDIRECT(CONCATENATE(\"$A$\",ROW()-1)))+1,\"\")","v":""},""]
[{"$f":"IF($E323<>\"\",MAX($A$1:INDIRECT(CONCATENATE(\"$A$\",ROW()-1)))+1,\"\")","v":90},"C3.90",null,"DN 630 HDPE","m3",15]
[{"$f":"IF($E324<>\"\",MAX($A$1:INDIRECT(CONCATENATE(\"$A$\",ROW()-1)))+1,\"\")","v":""},""]
[{"$f":"IF($E325<>\"\",MAX($A$1:INDIRECT(CONCATENATE(\"$A$\",ROW()-1)))+1,\"\")","v":91},"C3.91",null,"DN 600 steel","m3",9]
[{"$f":"IF($E326<>\"\",MAX($A$1:INDIRECT(CONCATENATE(\"$A$\",ROW()-1)))+1,\"\")","v":""},""]
[{"$f":"IF($E327<>\"\",MAX($A$1:INDIRECT(CONCATENATE(\"$A$\",ROW()-1)))+1,\"\")","v":92},"C3.92",null,"DN 700 steel","m3",69]
[{"$f":"IF($E328<>\"\",MAX($A$1:INDIRECT(CONCATENATE(\"$A$\",ROW()-1)))+1,\"\")","v":""},""]
[{"$f":"IF($E329<>\"\",MAX($A$1:INDIRECT(CONCATENATE(\"$A$\",ROW()-1)))+1,\"\")","v":""},"",null,"Extra-over to Bedding and Blanket above:"]
[{"$f":"IF($E330<>\"\",MAX($A$1:INDIRECT(CONCATENATE(\"$A$\",ROW()-1)))+1,\"\")","v":""},""]
[{"$f":"IF($E331<>\"\",MAX($A$1:INDIRECT(CONCATENATE(\"$A$\",ROW()-1)))+1,\"\")","v":93},"C3.93","PSLB 8.2.6","Cement stabilisation at 5% by volume to fill material","m3",200]
[{"$f":"IF($E332<>\"\",MAX($A$1:INDIRECT(CONCATENATE(\"$A$\",ROW()-1)))+1,\"\")","v":""},""]
[{"$f":"IF($E333<>\"\",MAX($A$1:INDIRECT(CONCATENATE(\"$A$\",ROW()-1)))+1,\"\")","v":""},"","PSLB 8.2.7","Provision of stone/geofabric to deal with water:"]
[{"$f":"IF($E334<>\"\",MAX($A$1:INDIRECT(CONCATENATE(\"$A$\",ROW()-1)))+1,\"\")","v":""},""]
[{"$f":"IF($E335<>\"\",MAX($A$1:INDIRECT(CONCATENATE(\"$A$\",ROW()-1)))+1,\"\")","v":94},"C3.94",null,"Geotextile (A2 Bidim)","m²",100]
[{"$f":"IF($E336<>\"\",MAX($A$1:INDIRECT(CONCATENATE(\"$A$\",ROW()-1)))+1,\"\")","v":""},""]
[{"$f":"IF($E337<>\"\",MAX($A$1:INDIRECT(CONCATENATE(\"$A$\",ROW()-1)))+1,\"\")","v":95},"C3.95",null,"Crushed stone","m³",20]
[{"$f":"IF($E338<>\"\",MAX($A$1:INDIRECT(CONCATENATE(\"$A$\",ROW()-1)))+1,\"\")","v":""},""]
[{"$f":"IF($E339<>\"\",MAX($A$1:INDIRECT(CONCATENATE(\"$A$\",ROW()-1)))+1,\"\")","v":96},"C3.96","8.2.5\nPSLB 8.2.5","Encasing of pipe in Grade 20/19 concrete","m³",70]
[{"$f":"IF($E340<>\"\",MAX($A$1:INDIRECT(CONCATENATE(\"$A$\",ROW()-1)))+1,\"\")","v":""},""]
[{"$f":"IF($E341<>\"\",MAX($A$1:INDIRECT(CONCATENATE(\"$A$\",ROW()-1)))+1,\"\")","v":""},"",null,"STORMWATER STRUCTURES"]
[{"$f":"IF($E342<>\"\",MAX($A$1:INDIRECT(CONCATENATE(\"$A$\",ROW()-1)))+1,\"\")","v":""},""]
[{"$f":"IF($E343<>\"\",MAX($A$1:INDIRECT(CONCATENATE(\"$A$\",ROW()-1)))+1,\"\")","v":""},"","1200 DK","Gabions and Reno Mattresses"]
[{"$f":"IF($E344<>\"\",MAX($A$1:INDIRECT(CONCATENATE(\"$A$\",ROW()-1)))+1,\"\")","v":""},""]
[{"$f":"IF($E345<>\"\",MAX($A$1:INDIRECT(CONCATENATE(\"$A$\",ROW()-1)))+1,\"\")","v":""},"","8.2.2        PSDK 8.2.2","Gabions of galvanised wire,                              80 mm x 100 mm mesh, 2.7 mm dia wire:"]
[{"$f":"IF($E346<>\"\",MAX($A$1:INDIRECT(CONCATENATE(\"$A$\",ROW()-1)))+1,\"\")","v":""},""]
[{"$f":"IF($E347<>\"\",MAX($A$1:INDIRECT(CONCATENATE(\"$A$\",ROW()-1)))+1,\"\")","v":97},"C3.97",null,"3.0 m x 1.0 m, 0.5 m","m³",20]
[{"$f":"IF($E348<>\"\",MAX($A$1:INDIRECT(CONCATENATE(\"$A$\",ROW()-1)))+1,\"\")","v":""},""]
[{"$f":"IF($E349<>\"\",MAX($A$1:INDIRECT(CONCATENATE(\"$A$\",ROW()-1)))+1,\"\")","v":98},"C3.98",null,"3.0 m x 1.0 m x 1.0 m","m³",20]
[{"$f":"IF($E350<>\"\",MAX($A$1:INDIRECT(CONCATENATE(\"$A$\",ROW()-1)))+1,\"\")","v":""},""]
[{"$f":"IF($E351<>\"\",MAX($A$1:INDIRECT(CONCATENATE(\"$A$\",ROW()-1)))+1,\"\")","v":99},"C3.99",null,"2.0 m x 1.0 m x 1.0 m","m³",20]
[{"$f":"IF($E352<>\"\",MAX($A$1:INDIRECT(CONCATENATE(\"$A$\",ROW()-1)))+1,\"\")","v":""},""]
[{"$f":"IF($E353<>\"\",MAX($A$1:INDIRECT(CONCATENATE(\"$A$\",ROW()-1)))+1,\"\")","v":""},"","8.2.2        PSDK 8.2.2","Reno mattresses"]
[{"$f":"IF($E354<>\"\",MAX($A$1:INDIRECT(CONCATENATE(\"$A$\",ROW()-1)))+1,\"\")","v":""},""]
[{"$f":"IF($E355<>\"\",MAX($A$1:INDIRECT(CONCATENATE(\"$A$\",ROW()-1)))+1,\"\")","v":100},"C3.100"," ","2.0 m x 1.0 m 0.3 m","m³",100]
[{"$f":"IF($E356<>\"\",MAX($A$1:INDIRECT(CONCATENATE(\"$A$\",ROW()-1)))+1,\"\")","v":""},""]
[{"$f":"IF($E357<>\"\",MAX($A$1:INDIRECT(CONCATENATE(\"$A$\",ROW()-1)))+1,\"\")","v":""},"","8.2.4","Geotextile"]
[{"$f":"IF($E358<>\"\",MAX($A$1:INDIRECT(CONCATENATE(\"$A$\",ROW()-1)))+1,\"\")","v":""},""]
[{"$f":"IF($E359<>\"\",MAX($A$1:INDIRECT(CONCATENATE(\"$A$\",ROW()-1)))+1,\"\")","v":101},"C3.101",null,"Geotextile (A2 Bidim)","m²",400]
[{"$f":"IF($E360<>\"\",MAX($A$1:INDIRECT(CONCATENATE(\"$A$\",ROW()-1)))+1,\"\")","v":""},""]
[{"$f":"IF($E361<>\"\",MAX($A$1:INDIRECT(CONCATENATE(\"$A$\",ROW()-1)))+1,\"\")","v":""},"","1200 A","Extra over for Gabions and Reno Mattresses"]
[{"$f":"IF($E362<>\"\",MAX($A$1:INDIRECT(CONCATENATE(\"$A$\",ROW()-1)))+1,\"\")","v":""},""]
[{"$f":"IF($E363<>\"\",MAX($A$1:INDIRECT(CONCATENATE(\"$A$\",ROW()-1)))+1,\"\")","v":102},"C3.102","PSA 8.10","Tie reno matress into concrete with Y16 eye bolts","No",20]
[]
[{"$f":"IF($E365<>\"\",MAX($A$1:INDIRECT(CONCATENATE(\"$A$\",ROW()-1)))+1,\"\")","v":""},{"$f":"IF(A365<>\"\",$A$3&A365,\"\")","v":""},null," Carried forward / …"]
[{"$f":"IF($E366<>\"\",MAX($A$1:INDIRECT(CONCATENATE(\"$A$\",ROW()-1)))+1,\"\")","v":""},"",null," Brought forward / …"]
[]
[{"$f":"IF($E368<>\"\",MAX($A$1:INDIRECT(CONCATENATE(\"$A$\",ROW()-1)))+1,\"\")","v":""},"","SANS"]
[{"$f":"IF($E369<>\"\",MAX($A$1:INDIRECT(CONCATENATE(\"$A$\",ROW()-1)))+1,\"\")","v":""},"","1200 LE","Stormwater concrete structures"]
[{"$f":"IF($E370<>\"\",MAX($A$1:INDIRECT(CONCATENATE(\"$A$\",ROW()-1)))+1,\"\")","v":""},""]
[{"$f":"IF($E371<>\"\",MAX($A$1:INDIRECT(CONCATENATE(\"$A$\",ROW()-1)))+1,\"\")","v":103},"C3.103","8.2.5","Inspection concrete chamber","No",4]
[{"$f":"IF($E372<>\"\",MAX($A$1:INDIRECT(CONCATENATE(\"$A$\",ROW()-1)))+1,\"\")","v":""},""]
[{"$f":"IF($E373<>\"\",MAX($A$1:INDIRECT(CONCATENATE(\"$A$\",ROW()-1)))+1,\"\")","v":104},"C3.104","8.2.5","Stormwater concrete headwall complete for up to 375 mm dia pipe, 20/19 MPa","No",2]
[{"$f":"IF($E374<>\"\",MAX($A$1:INDIRECT(CONCATENATE(\"$A$\",ROW()-1)))+1,\"\")","v":""},""]
[{"$f":"IF($E375<>\"\",MAX($A$1:INDIRECT(CONCATENATE(\"$A$\",ROW()-1)))+1,\"\")","v":105},"C3.105","1200 A\nPSA 8.10\n","Stilling basin complete as per Dwg No. 106777-CC-212","No",1]
[{"$f":"IF($E376<>\"\",MAX($A$1:INDIRECT(CONCATENATE(\"$A$\",ROW()-1)))+1,\"\")","v":""},{"$f":"IF(A376<>\"\",$A$3&A376,\"\")","v":""}]
[{"$f":"IF($E377<>\"\",MAX($A$1:INDIRECT(CONCATENATE(\"$A$\",ROW()-1)))+1,\"\")","v":106},"C3.106",null,"Culvert complete as per Dwg No. 106777-CC-213","No",1]
[]
[null,null,"1200 A\nPSA 8.10\nPSA 8.5.1\n","Potable water network"]
[]
[{"$f":"IF($E381<>\"\",MAX($A$1:INDIRECT(CONCATENATE(\"$A$\",ROW()-1)))+1,\"\")","v":107},{"$f":"IF(A381<>\"\",$A$3&A381,\"\")","v":"C3.107"},null,"HDPE pipework plumbing outside of pump station","Prov\nSum","-","-",50000]
[]
[{"$f":"IF($E383<>\"\",MAX($A$1:INDIRECT(CONCATENATE(\"$A$\",ROW()-1)))+1,\"\")","v":108},{"$f":"IF(A383<>\"\",$A$3&A383,\"\")","v":"C3.108"},null,"Percentage adjustment on the item above for Contractor's overheads and profit (state % and extend as an amount)","%",50000]
[]
[{"$f":"IF($E385<>\"\",MAX($A$1:INDIRECT(CONCATENATE(\"$A$\",ROW()-1)))+1,\"\")","v":109},{"$f":"IF(A385<>\"\",$A$3&A385,\"\")","v":"C3.109"},null,"Potable water DN 75 Class 16 valve chamber","Prov\nSum","-","-",50000]
[]
[{"$f":"IF($E387<>\"\",MAX($A$1:INDIRECT(CONCATENATE(\"$A$\",ROW()-1)))+1,\"\")","v":110},{"$f":"IF(A387<>\"\",$A$3&A387,\"\")","v":"C3.110"},null,"Percentage adjustment on the item above for Contractor's overheads and profit (state % and extend as an amount)","%",50000]
[]
[{"$f":"IF($E389<>\"\",MAX($A$1:INDIRECT(CONCATENATE(\"$A$\",ROW()-1)))+1,\"\")","v":111},{"$f":"IF(A389<>\"\",$A$3&A389,\"\")","v":"C3.111"},null,"Fire Hydrant below ground","Prov\nSum","-","-",20000]
[]
[{"$f":"IF($E391<>\"\",MAX($A$1:INDIRECT(CONCATENATE(\"$A$\",ROW()-1)))+1,\"\")","v":112},{"$f":"IF(A391<>\"\",$A$3&A391,\"\")","v":"C3.112"},null,"Percentage adjustment on the item above for Contractor's overheads and profit (state % and extend as an amount)","%",20000]
[]
[{"$f":"IF($E393<>\"\",MAX($A$1:INDIRECT(CONCATENATE(\"$A$\",ROW()-1)))+1,\"\")","v":""},{"$f":"IF(A393<>\"\",$A$3&A393,\"\")","v":""},null,"FENCING"]
[{"$f":"IF($E394<>\"\",MAX($A$1:INDIRECT(CONCATENATE(\"$A$\",ROW()-1)))+1,\"\")","v":""},""]
[{"$f":"IF($E395<>\"\",MAX($A$1:INDIRECT(CONCATENATE(\"$A$\",ROW()-1)))+1,\"\")","v":113},"C3.113","PF 10.1","Anti-intruder fence, 2.4m high, as detailed on Dwg 106777-CC-230","m",500]
[{"$f":"IF($E396<>\"\",MAX($A$1:INDIRECT(CONCATENATE(\"$A$\",ROW()-1)))+1,\"\")","v":""},""]
[{"$f":"IF($E397<>\"\",MAX($A$1:INDIRECT(CONCATENATE(\"$A$\",ROW()-1)))+1,\"\")","v":114},"C3.114",null,"Double leaf maually operated vehicle entrance gate as per Dwg 110585-CC-231","No",1]
[{"$f":"IF($E398<>\"\",MAX($A$1:INDIRECT(CONCATENATE(\"$A$\",ROW()-1)))+1,\"\")","v":""},""]
[{"$f":"IF($E399<>\"\",MAX($A$1:INDIRECT(CONCATENATE(\"$A$\",ROW()-1)))+1,\"\")","v":""},"","1200 A","MISCELLANEOUS"]
[{"$f":"IF($E400<>\"\",MAX($A$1:INDIRECT(CONCATENATE(\"$A$\",ROW()-1)))+1,\"\")","v":""},""]
[{"$f":"IF($E401<>\"\",MAX($A$1:INDIRECT(CONCATENATE(\"$A$\",ROW()-1)))+1,\"\")","v":115},"C3.115","PSA 8.10","Additional excavation to facilitate drainage where ordered by the engineer","m³",100]
[]
[]
[{"$f":"IF($E404<>\"\",MAX($A$1:INDIRECT(CONCATENATE(\"$A$\",ROW()-1)))+1,\"\")","v":""},{"$f":"IF(A404<>\"\",$A$3&A404,\"\")","v":""},null," Carried forward / …"]
[{"$f":"IF($E405<>\"\",MAX($A$1:INDIRECT(CONCATENATE(\"$A$\",ROW()-1)))+1,\"\")","v":""},"",null," Brought forward / …"]
[]
[{"$f":"IF($E407<>\"\",MAX($A$1:INDIRECT(CONCATENATE(\"$A$\",ROW()-1)))+1,\"\")","v":116},"C3.116",null,"Connect to existing pipework (DN 710 HDPE PE100)","No",1]
[]
[{"$f":"IF($E409<>\"\",MAX($A$1:INDIRECT(CONCATENATE(\"$A$\",ROW()-1)))+1,\"\")","v":117},{"$f":"IF(A409<>\"\",$A$3&A409,\"\")","v":"C3.117"},null,"Connect to existing potable water pipework (DN 75 Class 16) including adaptor to connect PVC to HDPE","No",1]
[{"$f":"IF($E410<>\"\",MAX($A$1:INDIRECT(CONCATENATE(\"$A$\",ROW()-1)))+1,\"\")","v":""},""]
[{"$f":"IF($E411<>\"\",MAX($A$1:INDIRECT(CONCATENATE(\"$A$\",ROW()-1)))+1,\"\")","v":118},"C3.118",null,"Septic tank to infiltration gallery including connection pipework and fittings","Sum","-","-",10000]
[{"$f":"IF($E412<>\"\",MAX($A$1:INDIRECT(CONCATENATE(\"$A$\",ROW()-1)))+1,\"\")","v":""},""]
[{"$f":"IF($E413<>\"\",MAX($A$1:INDIRECT(CONCATENATE(\"$A$\",ROW()-1)))+1,\"\")","v":""},"",null,"PIPEWORK SPECIALS AND VALVE CHAMBERS"]
[{"$f":"IF($E414<>\"\",MAX($A$1:INDIRECT(CONCATENATE(\"$A$\",ROW()-1)))+1,\"\")","v":""},""]
[{"$f":"IF($E415<>\"\",MAX($A$1:INDIRECT(CONCATENATE(\"$A$\",ROW()-1)))+1,\"\")","v":""},"","DWS 1130\n10\nDWS 1110\n20.14.1\n20.14.2","Supply, deliver, laying, bedding and jointing of fittings and pipe specials on main pipeline and within valve chambers complete with couplings and pipe suppprts as scheduled. All steel pipework manufactured Grade X52 or S 355 JR  steel unless otherwise stated and lined and coated as specified in DWS 9900 C7"]
[{"$f":"IF($E416<>\"\",MAX($A$1:INDIRECT(CONCATENATE(\"$A$\",ROW()-1)))+1,\"\")","v":""},""]
[{"$f":"IF($E417<>\"\",MAX($A$1:INDIRECT(CONCATENATE(\"$A$\",ROW()-1)))+1,\"\")","v":""},"",null,"Reservoir: Scour and Overflow"]
[{"$f":"IF($E418<>\"\",MAX($A$1:INDIRECT(CONCATENATE(\"$A$\",ROW()-1)))+1,\"\")","v":""},"",null,"PN 10: Dwg 106777-CC-0221"]
[{"$f":"IF($E419<>\"\",MAX($A$1:INDIRECT(CONCATENATE(\"$A$\",ROW()-1)))+1,\"\")","v":""},""]
[{"$f":"IF($E420<>\"\",MAX($A$1:INDIRECT(CONCATENATE(\"$A$\",ROW()-1)))+1,\"\")","v":119},"C3.119",null,"DN 250 SS 316 puddle pipe, flanged, 900 mm F/F","No",1]
[{"$f":"IF($E421<>\"\",MAX($A$1:INDIRECT(CONCATENATE(\"$A$\",ROW()-1)))+1,\"\")","v":""},""]
[{"$f":"IF($E422<>\"\",MAX($A$1:INDIRECT(CONCATENATE(\"$A$\",ROW()-1)))+1,\"\")","v":120},"C3.120",null,"DN 600 SS 316 puddle pipe, flanged one end, 900 mm F/F","No",1]
[{"$f":"IF($E423<>\"\",MAX($A$1:INDIRECT(CONCATENATE(\"$A$\",ROW()-1)))+1,\"\")","v":""},""]
[{"$f":"IF($E424<>\"\",MAX($A$1:INDIRECT(CONCATENATE(\"$A$\",ROW()-1)))+1,\"\")","v":121},"C3.121",null,"DN 250 SS316 pipe with 90 degree bend one end; flanged; 532mm C/F & 1212mm C/F","No",1]
[{"$f":"IF($E425<>\"\",MAX($A$1:INDIRECT(CONCATENATE(\"$A$\",ROW()-1)))+1,\"\")","v":""},""]
[{"$f":"IF($E426<>\"\",MAX($A$1:INDIRECT(CONCATENATE(\"$A$\",ROW()-1)))+1,\"\")","v":122},"C3.122",null,"DN 600 SS 316 straight pipe, flanged, 700 mm F/F","No",1]
[{"$f":"IF($E427<>\"\",MAX($A$1:INDIRECT(CONCATENATE(\"$A$\",ROW()-1)))+1,\"\")","v":""},""]
[{"$f":"IF($E428<>\"\",MAX($A$1:INDIRECT(CONCATENATE(\"$A$\",ROW()-1)))+1,\"\")","v":123},"C3.123",null,"DN 250 SS 316 straight pipe, flanged, 700 mm F/F","No",1]
[{"$f":"IF($E429<>\"\",MAX($A$1:INDIRECT(CONCATENATE(\"$A$\",ROW()-1)))+1,\"\")","v":""},""]
[{"$f":"IF($E430<>\"\",MAX($A$1:INDIRECT(CONCATENATE(\"$A$\",ROW()-1)))+1,\"\")","v":124},"C3.124",null,"DN 250 SS 316 elbow, flanged one end","No",1]
[{"$f":"IF($E431<>\"\",MAX($A$1:INDIRECT(CONCATENATE(\"$A$\",ROW()-1)))+1,\"\")","v":""},""]
[{"$f":"IF($E432<>\"\",MAX($A$1:INDIRECT(CONCATENATE(\"$A$\",ROW()-1)))+1,\"\")","v":125},"C3.125",null,"DN 600 restrained flange adaptor","No",1]
[{"$f":"IF($E433<>\"\",MAX($A$1:INDIRECT(CONCATENATE(\"$A$\",ROW()-1)))+1,\"\")","v":""},""]
[{"$f":"IF($E434<>\"\",MAX($A$1:INDIRECT(CONCATENATE(\"$A$\",ROW()-1)))+1,\"\")","v":""},"",null,"Reservoir: Inlet / Outlet"]
[{"$f":"IF($E435<>\"\",MAX($A$1:INDIRECT(CONCATENATE(\"$A$\",ROW()-1)))+1,\"\")","v":""},"",null,"PN 10: Dwg 106777-CC-0220"]
[{"$f":"IF($E436<>\"\",MAX($A$1:INDIRECT(CONCATENATE(\"$A$\",ROW()-1)))+1,\"\")","v":""},""]
[{"$f":"IF($E437<>\"\",MAX($A$1:INDIRECT(CONCATENATE(\"$A$\",ROW()-1)))+1,\"\")","v":126},"C3.126",null,"DN 600 SS 316 puddle pipe, flanged, 1000 mm F/F","No",2]
[]
[]
[]
[{"$f":"IF($E441<>\"\",MAX($A$1:INDIRECT(CONCATENATE(\"$A$\",ROW()-1)))+1,\"\")","v":""},{"$f":"IF(A441<>\"\",$A$3&A441,\"\")","v":""},null," Carried forward / …"]
[{"$f":"IF($E442<>\"\",MAX($A$1:INDIRECT(CONCATENATE(\"$A$\",ROW()-1)))+1,\"\")","v":""},"",null," Brought forward / …"]
[]
[{"$f":"IF($E444<>\"\",MAX($A$1:INDIRECT(CONCATENATE(\"$A$\",ROW()-1)))+1,\"\")","v":127},"C3.127",null,"DN 600 SS 316 pipe, flanged one end, 500 mm F/F","No",2]
[{"$f":"IF($E445<>\"\",MAX($A$1:INDIRECT(CONCATENATE(\"$A$\",ROW()-1)))+1,\"\")","v":""},""]
[{"$f":"IF($E446<>\"\",MAX($A$1:INDIRECT(CONCATENATE(\"$A$\",ROW()-1)))+1,\"\")","v":128},"C3.128",null,"DN 600 SS 316 puddle pipe, flanged one end, 900 mm F/F","No",2]
[{"$f":"IF($E447<>\"\",MAX($A$1:INDIRECT(CONCATENATE(\"$A$\",ROW()-1)))+1,\"\")","v":""},""]
[{"$f":"IF($E448<>\"\",MAX($A$1:INDIRECT(CONCATENATE(\"$A$\",ROW()-1)))+1,\"\")","v":129},"C3.129",null,"DN 600 restrained flange adaptor","No",2]
[{"$f":"IF($E449<>\"\",MAX($A$1:INDIRECT(CONCATENATE(\"$A$\",ROW()-1)))+1,\"\")","v":""},""]
[null,"",null,"VALVES"]
[null,""]
[null,"","DWS 2510\n6\nDWS 1110\n20.15-A","Supply, deliver, lay, install and test valves complete as scheduled and shown on drawings.  All valves shall be coated in accordance with DWS 9900 C7"]
[null,""]
[{"$f":"IF($E454<>\"\",MAX($A$1:INDIRECT(CONCATENATE(\"$A$\",ROW()-1)))+1,\"\")","v":""},"",null,"Reservoir: Inlet / Outlet"]
[{"$f":"IF($E455<>\"\",MAX($A$1:INDIRECT(CONCATENATE(\"$A$\",ROW()-1)))+1,\"\")","v":""},"",null,"PN 10: Dwg 106777-CC-0220"]
[{"$f":"IF($E456<>\"\",MAX($A$1:INDIRECT(CONCATENATE(\"$A$\",ROW()-1)))+1,\"\")","v":""},""]
[{"$f":"IF($E457<>\"\",MAX($A$1:INDIRECT(CONCATENATE(\"$A$\",ROW()-1)))+1,\"\")","v":130},{"$f":"IF(A457<>\"\",$A$3&A457,\"\")","v":"C3.130"},null,"DN 600 flanged butterfly valve","No",2]
[{"$f":"IF($E458<>\"\",MAX($A$1:INDIRECT(CONCATENATE(\"$A$\",ROW()-1)))+1,\"\")","v":""},""]
[{"$f":"IF($E459<>\"\",MAX($A$1:INDIRECT(CONCATENATE(\"$A$\",ROW()-1)))+1,\"\")","v":""},"",null,"Reservoir: Scour and Overflow"]
[{"$f":"IF($E460<>\"\",MAX($A$1:INDIRECT(CONCATENATE(\"$A$\",ROW()-1)))+1,\"\")","v":""},"",null,"PN 10: Dwg 106777-CC-0221"]
[{"$f":"IF($E461<>\"\",MAX($A$1:INDIRECT(CONCATENATE(\"$A$\",ROW()-1)))+1,\"\")","v":""},""]
[{"$f":"IF($E462<>\"\",MAX($A$1:INDIRECT(CONCATENATE(\"$A$\",ROW()-1)))+1,\"\")","v":131},"C3.131",null,"DN 250 flanged flanged wedge gate valve supplied with handwheel","No",1]
[{"$f":"IF($E463<>\"\",MAX($A$1:INDIRECT(CONCATENATE(\"$A$\",ROW()-1)))+1,\"\")","v":""},""]
[{"$f":"IF($E464<>\"\",MAX($A$1:INDIRECT(CONCATENATE(\"$A$\",ROW()-1)))+1,\"\")","v":""},"",null,"VALVE CHAMBERS"]
[{"$f":"IF($E465<>\"\",MAX($A$1:INDIRECT(CONCATENATE(\"$A$\",ROW()-1)))+1,\"\")","v":""},""]
[{"$f":"IF($E466<>\"\",MAX($A$1:INDIRECT(CONCATENATE(\"$A$\",ROW()-1)))+1,\"\")","v":""},"",null,"Reservoir: Inlet / Outlet"]
[{"$f":"IF($E467<>\"\",MAX($A$1:INDIRECT(CONCATENATE(\"$A$\",ROW()-1)))+1,\"\")","v":""},"",null,"Dwg 106777-CC-0220"]
[{"$f":"IF($E468<>\"\",MAX($A$1:INDIRECT(CONCATENATE(\"$A$\",ROW()-1)))+1,\"\")","v":""},""]
[{"$f":"IF($E469<>\"\",MAX($A$1:INDIRECT(CONCATENATE(\"$A$\",ROW()-1)))+1,\"\")","v":132},"C3.132","DWS 1110\n20.17","Construct chambers complete, 3250 mm high from bottom of foundation footing to top of roof, with 130 kg/m³ reinforcing where applicable, access manhole, air vents, ladder, etc. The rate shall include all joints, shuttering and wood-float finish","No",2]
[{"$f":"IF($E470<>\"\",MAX($A$1:INDIRECT(CONCATENATE(\"$A$\",ROW()-1)))+1,\"\")","v":""},""]
[{"$f":"IF($E471<>\"\",MAX($A$1:INDIRECT(CONCATENATE(\"$A$\",ROW()-1)))+1,\"\")","v":133},"C3.133",null,"Extra-over for the above per chamber to increase the height by 250mm","Sum","-",null,"Rate only"]
[{"$f":"IF($E472<>\"\",MAX($A$1:INDIRECT(CONCATENATE(\"$A$\",ROW()-1)))+1,\"\")","v":""},""]
[{"$f":"IF($E473<>\"\",MAX($A$1:INDIRECT(CONCATENATE(\"$A$\",ROW()-1)))+1,\"\")","v":134},"C3.134","DWS 0750\n15.8","Extra-over for the above per chamber for casting in of DN 600 pipes","No",4]
[{"$f":"IF($E474<>\"\",MAX($A$1:INDIRECT(CONCATENATE(\"$A$\",ROW()-1)))+1,\"\")","v":""},""]
[{"$f":"IF($E475<>\"\",MAX($A$1:INDIRECT(CONCATENATE(\"$A$\",ROW()-1)))+1,\"\")","v":""},"",null,"Reservoir: Scour and Overflow"]
[{"$f":"IF($E476<>\"\",MAX($A$1:INDIRECT(CONCATENATE(\"$A$\",ROW()-1)))+1,\"\")","v":""},"",null,"Dwg 106777-CC-0221"]
[{"$f":"IF($E477<>\"\",MAX($A$1:INDIRECT(CONCATENATE(\"$A$\",ROW()-1)))+1,\"\")","v":""},""]
[{"$f":"IF($E478<>\"\",MAX($A$1:INDIRECT(CONCATENATE(\"$A$\",ROW()-1)))+1,\"\")","v":135},"C3.135","DWS 1110\n20.17","Construct chamber complete, 3750 mm high from bottom of foundation footing to top of roof, with 130 kg/m³ reinforcing where applicable, access manhole, air vents, ladder, etc. The rate shall include all joints, shuttering and wood-float finish","No",1]
[{"$f":"IF($E479<>\"\",MAX($A$1:INDIRECT(CONCATENATE(\"$A$\",ROW()-1)))+1,\"\")","v":""},""]
[{"$f":"IF($E480<>\"\",MAX($A$1:INDIRECT(CONCATENATE(\"$A$\",ROW()-1)))+1,\"\")","v":""},"",null," Carried forward / …"]
[{"$f":"IF($E481<>\"\",MAX($A$1:INDIRECT(CONCATENATE(\"$A$\",ROW()-1)))+1,\"\")","v":""},"",null," Brought forward / …"]
[{"$f":"IF($E482<>\"\",MAX($A$1:INDIRECT(CONCATENATE(\"$A$\",ROW()-1)))+1,\"\")","v":""},""]
[{"$f":"IF($E483<>\"\",MAX($A$1:INDIRECT(CONCATENATE(\"$A$\",ROW()-1)))+1,\"\")","v":136},"C3.136",null,"Extra-over for the above per chamber to increase the height by 250mm","Sum","-",null,"Rate only"]
[{"$f":"IF($E484<>\"\",MAX($A$1:INDIRECT(CONCATENATE(\"$A$\",ROW()-1)))+1,\"\")","v":""},""]
[{"$f":"IF($E485<>\"\",MAX($A$1:INDIRECT(CONCATENATE(\"$A$\",ROW()-1)))+1,\"\")","v":137},"C3.137","DWS 0750\n15.8","Extra-over for the above per chamber for casting in of DN 600 pipes","No",2]
[{"$f":"IF($E486<>\"\",MAX($A$1:INDIRECT(CONCATENATE(\"$A$\",ROW()-1)))+1,\"\")","v":""},""]
[{"$f":"IF($E487<>\"\",MAX($A$1:INDIRECT(CONCATENATE(\"$A$\",ROW()-1)))+1,\"\")","v":138},"C3.138","DWS 0750\n15.8","Extra-over for the above per chamber for casting in of DN 250 pipes","No",2]
[{"$f":"IF($E488<>\"\",MAX($A$1:INDIRECT(CONCATENATE(\"$A$\",ROW()-1)))+1,\"\")","v":""},""]
[{"$f":"IF($E489<>\"\",MAX($A$1:INDIRECT(CONCATENATE(\"$A$\",ROW()-1)))+1,\"\")","v":""},"",null,"Reservoir: Draw Access Pit"]
[{"$f":"IF($E490<>\"\",MAX($A$1:INDIRECT(CONCATENATE(\"$A$\",ROW()-1)))+1,\"\")","v":""},"",null,"Dwg 106777-CC-0240"]
[{"$f":"IF($E491<>\"\",MAX($A$1:INDIRECT(CONCATENATE(\"$A$\",ROW()-1)))+1,\"\")","v":""},""]
[{"$f":"IF($E492<>\"\",MAX($A$1:INDIRECT(CONCATENATE(\"$A$\",ROW()-1)))+1,\"\")","v":139},"C3.139","DWS 1110\n20.17","Construct chambers complete, 3000 mm high from bottom of foundation footing to top of roof, with 130 kg/m³ reinforcing where applicable, access manhole, air vents, ladder, etc. The rate shall include all joints, shuttering and wood-float finish","No",3]
[{"$f":"IF($E493<>\"\",MAX($A$1:INDIRECT(CONCATENATE(\"$A$\",ROW()-1)))+1,\"\")","v":""},""]
[{"$f":"IF($E494<>\"\",MAX($A$1:INDIRECT(CONCATENATE(\"$A$\",ROW()-1)))+1,\"\")","v":140},"C3.140",null,"Extra-over for the above per chamber to increase the height by 250mm","Sum","-",null,"Rate only"]
[{"$f":"IF($E495<>\"\",MAX($A$1:INDIRECT(CONCATENATE(\"$A$\",ROW()-1)))+1,\"\")","v":""},""]
[{"$f":"IF($E496<>\"\",MAX($A$1:INDIRECT(CONCATENATE(\"$A$\",ROW()-1)))+1,\"\")","v":141},"C3.141","DWS 0750\n15.8","Extra-over for the above per chamber for casting in of DN 160 pipes","No",15]
[{"$f":"IF($E497<>\"\",MAX($A$1:INDIRECT(CONCATENATE(\"$A$\",ROW()-1)))+1,\"\")","v":""},""]
[]
[]
[]
[]
[]
[]
[]
[]
[]
[]
[]
[]
[]
[]
[]
[]
[]
[]
[]
[]
[]
[]
[]
[{"$f":"IF($E521<>\"\",MAX($A$1:INDIRECT(CONCATENATE(\"$A$\",ROW()-1)))+1,\"\")","v":""},{"$f":"IF(A521<>\"\",$A$3&A521,\"\")","v":""}]
[{"$f":"IF($E522<>\"\",MAX($A$1:INDIRECT(CONCATENATE(\"$A$\",ROW()-1)))+1,\"\")","v":""},""]
[{"$f":"IF($E523<>\"\",MAX($A$1:INDIRECT(CONCATENATE(\"$A$\",ROW()-1)))+1,\"\")","v":""},""]
[{"$f":"IF($E524<>\"\",MAX($A$1:INDIRECT(CONCATENATE(\"$A$\",ROW()-1)))+1,\"\")","v":""},""]
[{"$f":"IF($E525<>\"\",MAX($A$1:INDIRECT(CONCATENATE(\"$A$\",ROW()-1)))+1,\"\")","v":""},{"$f":"IF(A458<>\"\",$A$3&A458,\"\")","v":""},null," TOTAL SECTION C3:\n Carried to Summary",null,null,"R"]

{"sheet":"Section C4","index":7,"n_rows":653,"n_cols":9,"rows_kept":653,"cut":false,"hidden":false,"merged":[]}
["Item No","Item No","Payment Clause","Short Description","Unit","Quantity","Rate","Amount\n R             c"]
[]
["C4.",null,null,"SECTION: C4 "]
[null,null,null,"PUMP STATION"]
[]
[null,null,"SANS"]
[null,null,"1200 D","EARTHWORKS"]
[{"$f":"IF($E8<>\"\",MAX($A$1:INDIRECT(CONCATENATE(\"$A$\",ROW()-1)))+1,\"\")","v":""}]
[{"$f":"IF($E9<>\"\",MAX($A$1:INDIRECT(CONCATENATE(\"$A$\",ROW()-1)))+1,\"\")","v":""},null,"8.3.3","Restricted excavation:"]
[{"$f":"IF($E10<>\"\",MAX($A$1:INDIRECT(CONCATENATE(\"$A$\",ROW()-1)))+1,\"\")","v":""},null,"PSD 8.3.3"]
[{"$f":"IF($E11<>\"\",MAX($A$1:INDIRECT(CONCATENATE(\"$A$\",ROW()-1)))+1,\"\")","v":""},null,null,"Excavate in all materials and use for embankment or backfill or dispose, up to\n1 m deep, as ordered:"]
[{"$f":"IF($E12<>\"\",MAX($A$1:INDIRECT(CONCATENATE(\"$A$\",ROW()-1)))+1,\"\")","v":""}]
[{"$f":"IF($E13<>\"\",MAX($A$1:INDIRECT(CONCATENATE(\"$A$\",ROW()-1)))+1,\"\")","v":1},{"$f":"IF(A13<>\"\",$A$3&A13,\"\")","v":"C4.1"},null,"For structure, from platform level established by bulk excavation, if applicable","m³",36]
[{"$f":"IF($E14<>\"\",MAX($A$1:INDIRECT(CONCATENATE(\"$A$\",ROW()-1)))+1,\"\")","v":""},""]
[{"$f":"IF($E15<>\"\",MAX($A$1:INDIRECT(CONCATENATE(\"$A$\",ROW()-1)))+1,\"\")","v":2},"C4.2",null,"Extra over restricted excavations item C4.1 for hard rock excavation (without explosives)","m³",18]
[{"$f":"IF($E16<>\"\",MAX($A$1:INDIRECT(CONCATENATE(\"$A$\",ROW()-1)))+1,\"\")","v":""},""]
[{"$f":"IF($E17<>\"\",MAX($A$1:INDIRECT(CONCATENATE(\"$A$\",ROW()-1)))+1,\"\")","v":3},"C4.3",null,"Extra over restricted excavations item  C4.1 for hand excavations","m³",36,null,{"$f":"F17*G17","v":0}]
[{"$f":"IF($E18<>\"\",MAX($A$1:INDIRECT(CONCATENATE(\"$A$\",ROW()-1)))+1,\"\")","v":""}]
[{"$f":"IF($E19<>\"\",MAX($A$1:INDIRECT(CONCATENATE(\"$A$\",ROW()-1)))+1,\"\")","v":""},""]
[{"$f":"IF($E20<>\"\",MAX($A$1:INDIRECT(CONCATENATE(\"$A$\",ROW()-1)))+1,\"\")","v":""},"","8.3.4","Importing of material:",null,null,{"$f":"IF(E20=\"\",\"\",(H20/F20))","v":""}]
[{"$f":"IF($E21<>\"\",MAX($A$1:INDIRECT(CONCATENATE(\"$A$\",ROW()-1)))+1,\"\")","v":""},"","PSD 8.3.4",null,null,null,""]
[{"$f":"IF($E22<>\"\",MAX($A$1:INDIRECT(CONCATENATE(\"$A$\",ROW()-1)))+1,\"\")","v":""},"",null,"Sand filling compacted to 100% of modified AASHTO density:"]
[{"$f":"IF($E23<>\"\",MAX($A$1:INDIRECT(CONCATENATE(\"$A$\",ROW()-1)))+1,\"\")","v":""},""]
[{"$f":"IF($E24<>\"\",MAX($A$1:INDIRECT(CONCATENATE(\"$A$\",ROW()-1)))+1,\"\")","v":4},"C4.4",null,"Under false floor surface beds (between channel brick walls, plinths, etc. in confined spaces)","m³",203,null,{"$f":"F24*G24","v":0}]
[{"$f":"IF($E25<>\"\",MAX($A$1:INDIRECT(CONCATENATE(\"$A$\",ROW()-1)))+1,\"\")","v":""},""]
[{"$f":"IF($E26<>\"\",MAX($A$1:INDIRECT(CONCATENATE(\"$A$\",ROW()-1)))+1,\"\")","v":5},"C4.5",null,"In cable trenches (after installation of cables)","m³",11,null,{"$f":"F26*G26","v":0}," "]
[{"$f":"IF($E27<>\"\",MAX($A$1:INDIRECT(CONCATENATE(\"$A$\",ROW()-1)))+1,\"\")","v":""},"",null,null,null,null,null,null," "]
[{"$f":"IF($E28<>\"\",MAX($A$1:INDIRECT(CONCATENATE(\"$A$\",ROW()-1)))+1,\"\")","v":""},"","1200 A","Testing:"]
[{"$f":"IF($E29<>\"\",MAX($A$1:INDIRECT(CONCATENATE(\"$A$\",ROW()-1)))+1,\"\")","v":""},""]
[{"$f":"IF($E30<>\"\",MAX($A$1:INDIRECT(CONCATENATE(\"$A$\",ROW()-1)))+1,\"\")","v":6},"C4.6","PSA 8.5","Provision for additional tests as ordered by the engineer","Sum",1,10000,{"$f":"F30*G30","v":10000}]
[{"$f":"IF($E31<>\"\",MAX($A$1:INDIRECT(CONCATENATE(\"$A$\",ROW()-1)))+1,\"\")","v":""},""]
[{"$f":"IF($E32<>\"\",MAX($A$1:INDIRECT(CONCATENATE(\"$A$\",ROW()-1)))+1,\"\")","v":""},"","DWS 0750","WATER RETAINING CONCRETE"]
[{"$f":"IF($E33<>\"\",MAX($A$1:INDIRECT(CONCATENATE(\"$A$\",ROW()-1)))+1,\"\")","v":""},""]
[{"$f":"IF($E34<>\"\",MAX($A$1:INDIRECT(CONCATENATE(\"$A$\",ROW()-1)))+1,\"\")","v":""},"",15.3,"Scheduled formwork items:"]
[{"$f":"IF($E35<>\"\",MAX($A$1:INDIRECT(CONCATENATE(\"$A$\",ROW()-1)))+1,\"\")","v":""},""]
[{"$f":"IF($E36<>\"\",MAX($A$1:INDIRECT(CONCATENATE(\"$A$\",ROW()-1)))+1,\"\")","v":""},""]
[{"$f":"IF($E37<>\"\",MAX($A$1:INDIRECT(CONCATENATE(\"$A$\",ROW()-1)))+1,\"\")","v":""},"",15.3,"Rough:"]
[{"$f":"IF($E38<>\"\",MAX($A$1:INDIRECT(CONCATENATE(\"$A$\",ROW()-1)))+1,\"\")","v":""},""]
[{"$f":"IF($E39<>\"\",MAX($A$1:INDIRECT(CONCATENATE(\"$A$\",ROW()-1)))+1,\"\")","v":""},"",null,"Plane vertical to:"]
[{"$f":"IF($E40<>\"\",MAX($A$1:INDIRECT(CONCATENATE(\"$A$\",ROW()-1)))+1,\"\")","v":""},""]
[{"$f":"IF($E41<>\"\",MAX($A$1:INDIRECT(CONCATENATE(\"$A$\",ROW()-1)))+1,\"\")","v":7},"C4.7",null,"Sides of bases and floor slabs","m²",95,null,{"$f":"F41*G41","v":0}]
[{"$f":"IF($E42<>\"\",MAX($A$1:INDIRECT(CONCATENATE(\"$A$\",ROW()-1)))+1,\"\")","v":""},""]
[{"$f":"IF($E43<>\"\",MAX($A$1:INDIRECT(CONCATENATE(\"$A$\",ROW()-1)))+1,\"\")","v":8},"C4.8",null,"Sides of drain trench walls","m²",6,null,{"$f":"F43*G43","v":0}]
[{"$f":"IF($E44<>\"\",MAX($A$1:INDIRECT(CONCATENATE(\"$A$\",ROW()-1)))+1,\"\")","v":""},""]
[{"$f":"IF($E45<>\"\",MAX($A$1:INDIRECT(CONCATENATE(\"$A$\",ROW()-1)))+1,\"\")","v":9},"C4.9",null,"Sides of beams","m²",33]
[{"$f":"IF($E46<>\"\",MAX($A$1:INDIRECT(CONCATENATE(\"$A$\",ROW()-1)))+1,\"\")","v":""},""]
[{"$f":"IF($E47<>\"\",MAX($A$1:INDIRECT(CONCATENATE(\"$A$\",ROW()-1)))+1,\"\")","v":""},""]
[{"$f":"IF($E48<>\"\",MAX($A$1:INDIRECT(CONCATENATE(\"$A$\",ROW()-1)))+1,\"\")","v":""},null,null," Carried forward / …"]
[{"$f":"IF($E49<>\"\",MAX($A$1:INDIRECT(CONCATENATE(\"$A$\",ROW()-1)))+1,\"\")","v":""},null,null," Brought forward / …"]
[{"$f":"IF($E50<>\"\",MAX($A$1:INDIRECT(CONCATENATE(\"$A$\",ROW()-1)))+1,\"\")","v":""},""]
[{"$f":"IF($E51<>\"\",MAX($A$1:INDIRECT(CONCATENATE(\"$A$\",ROW()-1)))+1,\"\")","v":""},"",15.3,"Smooth (off-form):"]
[{"$f":"IF($E52<>\"\",MAX($A$1:INDIRECT(CONCATENATE(\"$A$\",ROW()-1)))+1,\"\")","v":""},"",null,null,null,null,""]
[{"$f":"IF($E53<>\"\",MAX($A$1:INDIRECT(CONCATENATE(\"$A$\",ROW()-1)))+1,\"\")","v":""},"",null,"Plane vertical to:"]
[{"$f":"IF($E54<>\"\",MAX($A$1:INDIRECT(CONCATENATE(\"$A$\",ROW()-1)))+1,\"\")","v":""},""]
[{"$f":"IF($E55<>\"\",MAX($A$1:INDIRECT(CONCATENATE(\"$A$\",ROW()-1)))+1,\"\")","v":10},"C4.10",null,"Walls, including integrated columns","m²",726,null,{"$f":"F55*G55","v":0}]
[{"$f":"IF($E56<>\"\",MAX($A$1:INDIRECT(CONCATENATE(\"$A$\",ROW()-1)))+1,\"\")","v":""},""]
[{"$f":"IF($E57<>\"\",MAX($A$1:INDIRECT(CONCATENATE(\"$A$\",ROW()-1)))+1,\"\")","v":11},"C4.11",null,"Sides of drain trench walls","m²",50,null,{"$f":"F57*G57","v":0}]
[{"$f":"IF($E58<>\"\",MAX($A$1:INDIRECT(CONCATENATE(\"$A$\",ROW()-1)))+1,\"\")","v":""},""]
[{"$f":"IF($E59<>\"\",MAX($A$1:INDIRECT(CONCATENATE(\"$A$\",ROW()-1)))+1,\"\")","v":12},"C4.12",null,"Sides of columns","m²",460,null,{"$f":"F59*G59","v":0}]
[{"$f":"IF($E60<>\"\",MAX($A$1:INDIRECT(CONCATENATE(\"$A$\",ROW()-1)))+1,\"\")","v":""},""]
[{"$f":"IF($E61<>\"\",MAX($A$1:INDIRECT(CONCATENATE(\"$A$\",ROW()-1)))+1,\"\")","v":13},"C4.13",null,"Two sides of attached columns","m²",7]
[{"$f":"IF($E62<>\"\",MAX($A$1:INDIRECT(CONCATENATE(\"$A$\",ROW()-1)))+1,\"\")","v":""},""]
[{"$f":"IF($E63<>\"\",MAX($A$1:INDIRECT(CONCATENATE(\"$A$\",ROW()-1)))+1,\"\")","v":14},"C4.14",null,"Three sides of attached columns","m²",51,null,{"$f":"F63*G63","v":0}]
[{"$f":"IF($E64<>\"\",MAX($A$1:INDIRECT(CONCATENATE(\"$A$\",ROW()-1)))+1,\"\")","v":""},""]
[{"$f":"IF($E65<>\"\",MAX($A$1:INDIRECT(CONCATENATE(\"$A$\",ROW()-1)))+1,\"\")","v":15},"C4.15",null,"Sides of plinths","m²",80,null,{"$f":"F65*G65","v":0}]
[{"$f":"IF($E66<>\"\",MAX($A$1:INDIRECT(CONCATENATE(\"$A$\",ROW()-1)))+1,\"\")","v":""},""]
[{"$f":"IF($E67<>\"\",MAX($A$1:INDIRECT(CONCATENATE(\"$A$\",ROW()-1)))+1,\"\")","v":16},"C4.16",null,"Sides of beams, crane beams and ring beams","m²",360,null,{"$f":"F67*G67","v":0}]
[{"$f":"IF($E68<>\"\",MAX($A$1:INDIRECT(CONCATENATE(\"$A$\",ROW()-1)))+1,\"\")","v":""},""]
[{"$f":"IF($E69<>\"\",MAX($A$1:INDIRECT(CONCATENATE(\"$A$\",ROW()-1)))+1,\"\")","v":17},"C4.17",null,"Sides of 300 mm dia columns (1,2 m high)","m²",5,null,{"$f":"F69*G69","v":0}]
[{"$f":"IF($E70<>\"\",MAX($A$1:INDIRECT(CONCATENATE(\"$A$\",ROW()-1)))+1,\"\")","v":""},""]
[{"$f":"IF($E71<>\"\",MAX($A$1:INDIRECT(CONCATENATE(\"$A$\",ROW()-1)))+1,\"\")","v":18},"C4.18",null,"Sides of upstand beams (100 mm - 300 mm high)","m²",4,null,{"$f":"F71*G71","v":0}]
[{"$f":"IF($E72<>\"\",MAX($A$1:INDIRECT(CONCATENATE(\"$A$\",ROW()-1)))+1,\"\")","v":""},""]
[{"$f":"IF($E73<>\"\",MAX($A$1:INDIRECT(CONCATENATE(\"$A$\",ROW()-1)))+1,\"\")","v":19},"C4.19",null,"Slab edges 300 mm high","m²",17,null,{"$f":"F73*G73","v":0}]
[{"$f":"IF($E74<>\"\",MAX($A$1:INDIRECT(CONCATENATE(\"$A$\",ROW()-1)))+1,\"\")","v":""},""]
[{"$f":"IF($E75<>\"\",MAX($A$1:INDIRECT(CONCATENATE(\"$A$\",ROW()-1)))+1,\"\")","v":20},"C4.20",null,"Slab edges 250 mm to 350 mm high","m²",18,null,{"$f":"F75*G75","v":0}]
[{"$f":"IF($E76<>\"\",MAX($A$1:INDIRECT(CONCATENATE(\"$A$\",ROW()-1)))+1,\"\")","v":""},""]
[{"$f":"IF($E77<>\"\",MAX($A$1:INDIRECT(CONCATENATE(\"$A$\",ROW()-1)))+1,\"\")","v":""},{"$f":"IF(A77<>\"\",$A$3&A77,\"\")","v":""},null,"Plane horizontal to:"]
[{"$f":"IF($E78<>\"\",MAX($A$1:INDIRECT(CONCATENATE(\"$A$\",ROW()-1)))+1,\"\")","v":""},"",null,null,null,null,""]
[{"$f":"IF($E79<>\"\",MAX($A$1:INDIRECT(CONCATENATE(\"$A$\",ROW()-1)))+1,\"\")","v":""},"",null,"Soffits of slabs for prop heights of:"]
[{"$f":"IF($E80<>\"\",MAX($A$1:INDIRECT(CONCATENATE(\"$A$\",ROW()-1)))+1,\"\")","v":""},""]
[{"$f":"IF($E81<>\"\",MAX($A$1:INDIRECT(CONCATENATE(\"$A$\",ROW()-1)))+1,\"\")","v":21},"C4.21",null,"Below 3m and up to and including 3m high","m²",478]
[{"$f":"IF($E82<>\"\",MAX($A$1:INDIRECT(CONCATENATE(\"$A$\",ROW()-1)))+1,\"\")","v":""},""]
[{"$f":"IF($E83<>\"\",MAX($A$1:INDIRECT(CONCATENATE(\"$A$\",ROW()-1)))+1,\"\")","v":22},"C4.22",null,"Over 3 m and up to and including 5 m high","m²",644,null,{"$f":"F83*G83","v":0}]
[{"$f":"IF($E84<>\"\",MAX($A$1:INDIRECT(CONCATENATE(\"$A$\",ROW()-1)))+1,\"\")","v":""},""]
[{"$f":"IF($E85<>\"\",MAX($A$1:INDIRECT(CONCATENATE(\"$A$\",ROW()-1)))+1,\"\")","v":""},"",null,"Soffits of beams for prop heights of:"]
[{"$f":"IF($E86<>\"\",MAX($A$1:INDIRECT(CONCATENATE(\"$A$\",ROW()-1)))+1,\"\")","v":""},""]
[{"$f":"IF($E87<>\"\",MAX($A$1:INDIRECT(CONCATENATE(\"$A$\",ROW()-1)))+1,\"\")","v":23},"C4.23",null,"Up to 5,0 m","m²",117,null,{"$f":"F87*G87","v":0}]
[{"$f":"IF($E88<>\"\",MAX($A$1:INDIRECT(CONCATENATE(\"$A$\",ROW()-1)))+1,\"\")","v":""},""]
[{"$f":"IF($E89<>\"\",MAX($A$1:INDIRECT(CONCATENATE(\"$A$\",ROW()-1)))+1,\"\")","v":24},"C4.24",null,"Over 5 m and up to and including 9 m high","m²",64,null,{"$f":"F89*G89","v":0}]
[{"$f":"IF($E90<>\"\",MAX($A$1:INDIRECT(CONCATENATE(\"$A$\",ROW()-1)))+1,\"\")","v":""},""]
[{"$f":"IF($E91<>\"\",MAX($A$1:INDIRECT(CONCATENATE(\"$A$\",ROW()-1)))+1,\"\")","v":""},"",15.3,"Narrow widths (up to 300 mm wide):"]
[{"$f":"IF($E92<>\"\",MAX($A$1:INDIRECT(CONCATENATE(\"$A$\",ROW()-1)))+1,\"\")","v":""},""]
[{"$f":"IF($E93<>\"\",MAX($A$1:INDIRECT(CONCATENATE(\"$A$\",ROW()-1)))+1,\"\")","v":25},"C4.25",null,"Up to 100 mm  ","m",26]
[{"$f":"IF($E94<>\"\",MAX($A$1:INDIRECT(CONCATENATE(\"$A$\",ROW()-1)))+1,\"\")","v":""},""]
[{"$f":"IF($E95<>\"\",MAX($A$1:INDIRECT(CONCATENATE(\"$A$\",ROW()-1)))+1,\"\")","v":26},"C4.26",null,"Over 100 mm and up to 200 mm","m",340,null,{"$f":"F95*G95","v":0}]
[{"$f":"IF($E96<>\"\",MAX($A$1:INDIRECT(CONCATENATE(\"$A$\",ROW()-1)))+1,\"\")","v":""},""]
[{"$f":"IF($E97<>\"\",MAX($A$1:INDIRECT(CONCATENATE(\"$A$\",ROW()-1)))+1,\"\")","v":27},"C4.27",null,"Over 200 mm and up to 300 mm","m",206,null,{"$f":"F97*G97","v":0}]
[{"$f":"IF($E98<>\"\",MAX($A$1:INDIRECT(CONCATENATE(\"$A$\",ROW()-1)))+1,\"\")","v":""},""]
[{"$f":"IF($E99<>\"\",MAX($A$1:INDIRECT(CONCATENATE(\"$A$\",ROW()-1)))+1,\"\")","v":28},"C4.28",null,"15 x 15 mm drip groove in soffit of slabs","m",36,null,{"$f":"F99*G99","v":0}]
[{"$f":"IF($E100<>\"\",MAX($A$1:INDIRECT(CONCATENATE(\"$A$\",ROW()-1)))+1,\"\")","v":""},""]
[{"$f":"IF($E101<>\"\",MAX($A$1:INDIRECT(CONCATENATE(\"$A$\",ROW()-1)))+1,\"\")","v":""},null,null," Carried forward / …"]
[{"$f":"IF($E102<>\"\",MAX($A$1:INDIRECT(CONCATENATE(\"$A$\",ROW()-1)))+1,\"\")","v":""},null,null," Brought forward / …"]
[{"$f":"IF($E103<>\"\",MAX($A$1:INDIRECT(CONCATENATE(\"$A$\",ROW()-1)))+1,\"\")","v":""},{"$f":"IF(A103<>\"\",$A$3&A103,\"\")","v":""}]
[{"$f":"IF($E104<>\"\",MAX($A$1:INDIRECT(CONCATENATE(\"$A$\",ROW()-1)))+1,\"\")","v":""},"",15.4,"Box out holes/form voids:"]
[{"$f":"IF($E105<>\"\",MAX($A$1:INDIRECT(CONCATENATE(\"$A$\",ROW()-1)))+1,\"\")","v":""},""]
[{"$f":"IF($E106<>\"\",MAX($A$1:INDIRECT(CONCATENATE(\"$A$\",ROW()-1)))+1,\"\")","v":29},"C4.29",null,"Square - 300 mm x 300 mm in 300 mm thick concrete","No",2,null,{"$f":"F106*G106","v":0}]
[{"$f":"IF($E107<>\"\",MAX($A$1:INDIRECT(CONCATENATE(\"$A$\",ROW()-1)))+1,\"\")","v":""},""]
[{"$f":"IF($E108<>\"\",MAX($A$1:INDIRECT(CONCATENATE(\"$A$\",ROW()-1)))+1,\"\")","v":30},"C4.30",null,"Circular - 500mm diamneter in 300mm thick concrete","No",2]
[{"$f":"IF($E109<>\"\",MAX($A$1:INDIRECT(CONCATENATE(\"$A$\",ROW()-1)))+1,\"\")","v":""},""]
[{"$f":"IF($E110<>\"\",MAX($A$1:INDIRECT(CONCATENATE(\"$A$\",ROW()-1)))+1,\"\")","v":31},"C4.31",null,"Square - 900mm x 900mm in 300 mm thick concrete","No",1,null,{"$f":"F110*G110","v":0}]
[{"$f":"IF($E111<>\"\",MAX($A$1:INDIRECT(CONCATENATE(\"$A$\",ROW()-1)))+1,\"\")","v":""},""]
[{"$f":"IF($E112<>\"\",MAX($A$1:INDIRECT(CONCATENATE(\"$A$\",ROW()-1)))+1,\"\")","v":32},"C4.32",null,"Square - 1,4 m x 2,7 m in 300 mm thick concrete","No",1,null,{"$f":"F112*G112","v":0}]
[]
[{"$f":"IF($E114<>\"\",MAX($A$1:INDIRECT(CONCATENATE(\"$A$\",ROW()-1)))+1,\"\")","v":33},{"$f":"IF(A114<>\"\",$A$3&A114,\"\")","v":"C4.33"},null,"Circular - 0mm - 200mm sleeves in 300mm thick concrete","No",30]
[{"$f":"IF($E115<>\"\",MAX($A$1:INDIRECT(CONCATENATE(\"$A$\",ROW()-1)))+1,\"\")","v":""},""]
[{"$f":"IF($E116<>\"\",MAX($A$1:INDIRECT(CONCATENATE(\"$A$\",ROW()-1)))+1,\"\")","v":""},"",15.2,"Scheduled reinforcement items: "]
[{"$f":"IF($E117<>\"\",MAX($A$1:INDIRECT(CONCATENATE(\"$A$\",ROW()-1)))+1,\"\")","v":""},"",null,null,null,null,""]
[{"$f":"IF($E118<>\"\",MAX($A$1:INDIRECT(CONCATENATE(\"$A$\",ROW()-1)))+1,\"\")","v":""},"",null,"Mild steel bars:"]
[{"$f":"IF($E119<>\"\",MAX($A$1:INDIRECT(CONCATENATE(\"$A$\",ROW()-1)))+1,\"\")","v":""},""]
[{"$f":"IF($E120<>\"\",MAX($A$1:INDIRECT(CONCATENATE(\"$A$\",ROW()-1)))+1,\"\")","v":34},"C4.34",null,"8 mm dia","t",4,null,{"$f":"F120*G120","v":0}]
[{"$f":"IF($E121<>\"\",MAX($A$1:INDIRECT(CONCATENATE(\"$A$\",ROW()-1)))+1,\"\")","v":""},""]
[{"$f":"IF($E122<>\"\",MAX($A$1:INDIRECT(CONCATENATE(\"$A$\",ROW()-1)))+1,\"\")","v":35},"C4.35",null,"10 mm dia","t","4",null,{"$f":"F122*G122","v":0}]
[{"$f":"IF($E123<>\"\",MAX($A$1:INDIRECT(CONCATENATE(\"$A$\",ROW()-1)))+1,\"\")","v":""},"",null,null,null,null,""]
[{"$f":"IF($E124<>\"\",MAX($A$1:INDIRECT(CONCATENATE(\"$A$\",ROW()-1)))+1,\"\")","v":""},"",null,"High-tensile steel bars:",null,null,""]
[{"$f":"IF($E125<>\"\",MAX($A$1:INDIRECT(CONCATENATE(\"$A$\",ROW()-1)))+1,\"\")","v":""},""]
[{"$f":"IF($E126<>\"\",MAX($A$1:INDIRECT(CONCATENATE(\"$A$\",ROW()-1)))+1,\"\")","v":36},"C4.36",null,"10 mm dia","t","13",null,{"$f":"F126*G126","v":0}]
[{"$f":"IF($E127<>\"\",MAX($A$1:INDIRECT(CONCATENATE(\"$A$\",ROW()-1)))+1,\"\")","v":""},""]
[{"$f":"IF($E128<>\"\",MAX($A$1:INDIRECT(CONCATENATE(\"$A$\",ROW()-1)))+1,\"\")","v":37},"C4.37",null,"12 mm dia","t",20,null,{"$f":"F128*G128","v":0}]
[{"$f":"IF($E129<>\"\",MAX($A$1:INDIRECT(CONCATENATE(\"$A$\",ROW()-1)))+1,\"\")","v":""},""]
[{"$f":"IF($E130<>\"\",MAX($A$1:INDIRECT(CONCATENATE(\"$A$\",ROW()-1)))+1,\"\")","v":38},"C4.38",null,"16 mm dia","t",23,null,{"$f":"F130*G130","v":0}]
[{"$f":"IF($E131<>\"\",MAX($A$1:INDIRECT(CONCATENATE(\"$A$\",ROW()-1)))+1,\"\")","v":""},""]
[{"$f":"IF($E132<>\"\",MAX($A$1:INDIRECT(CONCATENATE(\"$A$\",ROW()-1)))+1,\"\")","v":39},"C4.39",null,"20 mm dia","t",33,null,{"$f":"F132*G132","v":0}]
[{"$f":"IF($E133<>\"\",MAX($A$1:INDIRECT(CONCATENATE(\"$A$\",ROW()-1)))+1,\"\")","v":""},""]
[{"$f":"IF($E134<>\"\",MAX($A$1:INDIRECT(CONCATENATE(\"$A$\",ROW()-1)))+1,\"\")","v":40},"C4.40",null,"25 mm dia","t",32,null,{"$f":"F134*G134","v":0}]
[{"$f":"IF($E135<>\"\",MAX($A$1:INDIRECT(CONCATENATE(\"$A$\",ROW()-1)))+1,\"\")","v":""},""]
[{"$f":"IF($E136<>\"\",MAX($A$1:INDIRECT(CONCATENATE(\"$A$\",ROW()-1)))+1,\"\")","v":41},"C4.41",null,"32 mm dia","t","6",null,{"$f":"F136*G136","v":0}]
[{"$f":"IF($E137<>\"\",MAX($A$1:INDIRECT(CONCATENATE(\"$A$\",ROW()-1)))+1,\"\")","v":""},""]
[{"$f":"IF($E138<>\"\",MAX($A$1:INDIRECT(CONCATENATE(\"$A$\",ROW()-1)))+1,\"\")","v":""},"",null,"High tensile mesh in the following:"]
[{"$f":"IF($E139<>\"\",MAX($A$1:INDIRECT(CONCATENATE(\"$A$\",ROW()-1)))+1,\"\")","v":""},""]
[{"$f":"IF($E140<>\"\",MAX($A$1:INDIRECT(CONCATENATE(\"$A$\",ROW()-1)))+1,\"\")","v":42},"C4.42",null,"Ref No 395 in surface beds and slabs","kg",3367,null,{"$f":"F140*G140","v":0}]
[{"$f":"IF($E141<>\"\",MAX($A$1:INDIRECT(CONCATENATE(\"$A$\",ROW()-1)))+1,\"\")","v":""},""]
[{"$f":"IF($E142<>\"\",MAX($A$1:INDIRECT(CONCATENATE(\"$A$\",ROW()-1)))+1,\"\")","v":""},"",null,"Scheduled concrete items:"]
[{"$f":"IF($E143<>\"\",MAX($A$1:INDIRECT(CONCATENATE(\"$A$\",ROW()-1)))+1,\"\")","v":""},""]
[{"$f":"IF($E144<>\"\",MAX($A$1:INDIRECT(CONCATENATE(\"$A$\",ROW()-1)))+1,\"\")","v":""},"",15.15,"Blinding layer:"]
[{"$f":"IF($E145<>\"\",MAX($A$1:INDIRECT(CONCATENATE(\"$A$\",ROW()-1)))+1,\"\")","v":""},""]
[{"$f":"IF($E146<>\"\",MAX($A$1:INDIRECT(CONCATENATE(\"$A$\",ROW()-1)))+1,\"\")","v":""},"",null,"Grade 15 MPa/19 mm concrete to:"]
[{"$f":"IF($E147<>\"\",MAX($A$1:INDIRECT(CONCATENATE(\"$A$\",ROW()-1)))+1,\"\")","v":""},""]
[{"$f":"IF($E148<>\"\",MAX($A$1:INDIRECT(CONCATENATE(\"$A$\",ROW()-1)))+1,\"\")","v":43},"C4.43",null,"50 mm thick in blinding","m2",853,null,{"$f":"F148*G148","v":0}]
[]
[]
[]
[{"$f":"IF($E152<>\"\",MAX($A$1:INDIRECT(CONCATENATE(\"$A$\",ROW()-1)))+1,\"\")","v":""},""]
[{"$f":"IF($E153<>\"\",MAX($A$1:INDIRECT(CONCATENATE(\"$A$\",ROW()-1)))+1,\"\")","v":""},""]
[{"$f":"IF($E154<>\"\",MAX($A$1:INDIRECT(CONCATENATE(\"$A$\",ROW()-1)))+1,\"\")","v":""},{"$f":"IF(A158<>\"\",$A$3&A158,\"\")","v":""},null," Carried forward / …"]
[{"$f":"IF($E155<>\"\",MAX($A$1:INDIRECT(CONCATENATE(\"$A$\",ROW()-1)))+1,\"\")","v":""},{"$f":"IF(A159<>\"\",$A$3&A159,\"\")","v":""},null," Brought forward / …"]
[{"$f":"IF($E156<>\"\",MAX($A$1:INDIRECT(CONCATENATE(\"$A$\",ROW()-1)))+1,\"\")","v":""},{"$f":"IF(A156<>\"\",$A$3&A156,\"\")","v":""}]
[{"$f":"IF($E157<>\"\",MAX($A$1:INDIRECT(CONCATENATE(\"$A$\",ROW()-1)))+1,\"\")","v":""},"",15.1,"Watertight concrete: ",null,null,{"$f":"IF(E157=\"\",\"\",(H157/F157))","v":""}]
[{"$f":"IF($E158<>\"\",MAX($A$1:INDIRECT(CONCATENATE(\"$A$\",ROW()-1)))+1,\"\")","v":""},"",null,null,null,null,""]
[{"$f":"IF($E159<>\"\",MAX($A$1:INDIRECT(CONCATENATE(\"$A$\",ROW()-1)))+1,\"\")","v":""},"",null,"Grade 15 MPa/19 mm concrete to:",null,null,""]
[{"$f":"IF($E160<>\"\",MAX($A$1:INDIRECT(CONCATENATE(\"$A$\",ROW()-1)))+1,\"\")","v":""},"",null,null,null,null,""]
[{"$f":"IF($E161<>\"\",MAX($A$1:INDIRECT(CONCATENATE(\"$A$\",ROW()-1)))+1,\"\")","v":44},"C4.44",null,"Benching, including sloped finish","m³",8,null,{"$f":"F161*G161","v":0}]
[{"$f":"IF($E162<>\"\",MAX($A$1:INDIRECT(CONCATENATE(\"$A$\",ROW()-1)))+1,\"\")","v":""},""]
[{"$f":"IF($E163<>\"\",MAX($A$1:INDIRECT(CONCATENATE(\"$A$\",ROW()-1)))+1,\"\")","v":45},"C4.45",null,"blinding layer at 50mm thick","m²",570]
[{"$f":"IF($E164<>\"\",MAX($A$1:INDIRECT(CONCATENATE(\"$A$\",ROW()-1)))+1,\"\")","v":""},""]
[{"$f":"IF($E165<>\"\",MAX($A$1:INDIRECT(CONCATENATE(\"$A$\",ROW()-1)))+1,\"\")","v":""},"",null,"Grade 35 MPa/19 mm watertight concrete to:"]
[{"$f":"IF($E166<>\"\",MAX($A$1:INDIRECT(CONCATENATE(\"$A$\",ROW()-1)))+1,\"\")","v":""},""]
[{"$f":"IF($E167<>\"\",MAX($A$1:INDIRECT(CONCATENATE(\"$A$\",ROW()-1)))+1,\"\")","v":46},"C4.46",null,"Column bases","m³",36,null,{"$f":"F167*G167","v":0}]
[{"$f":"IF($E168<>\"\",MAX($A$1:INDIRECT(CONCATENATE(\"$A$\",ROW()-1)))+1,\"\")","v":""},""]
[{"$f":"IF($E169<>\"\",MAX($A$1:INDIRECT(CONCATENATE(\"$A$\",ROW()-1)))+1,\"\")","v":47},"C4.47",null,"Trench floors and walls","m³",2,null,{"$f":"F169*G169","v":0}]
[{"$f":"IF($E170<>\"\",MAX($A$1:INDIRECT(CONCATENATE(\"$A$\",ROW()-1)))+1,\"\")","v":""},""]
[{"$f":"IF($E171<>\"\",MAX($A$1:INDIRECT(CONCATENATE(\"$A$\",ROW()-1)))+1,\"\")","v":48},"C4.48",null,"Floor slabs ","m³",390,null,{"$f":"F171*G171","v":0}]
[{"$f":"IF($E172<>\"\",MAX($A$1:INDIRECT(CONCATENATE(\"$A$\",ROW()-1)))+1,\"\")","v":""},""]
[{"$f":"IF($E173<>\"\",MAX($A$1:INDIRECT(CONCATENATE(\"$A$\",ROW()-1)))+1,\"\")","v":49},"C4.49",null,"Jockey floor slab, including thickenings","m³",12,null,{"$f":"F173*G173","v":0}]
[{"$f":"IF($E174<>\"\",MAX($A$1:INDIRECT(CONCATENATE(\"$A$\",ROW()-1)))+1,\"\")","v":""},""]
[{"$f":"IF($E175<>\"\",MAX($A$1:INDIRECT(CONCATENATE(\"$A$\",ROW()-1)))+1,\"\")","v":50},"C4.50",null,"False floor surface beds to 1% slope","m³",118,null,{"$f":"F175*G175","v":0}]
[{"$f":"IF($E176<>\"\",MAX($A$1:INDIRECT(CONCATENATE(\"$A$\",ROW()-1)))+1,\"\")","v":""},""]
[{"$f":"IF($E177<>\"\",MAX($A$1:INDIRECT(CONCATENATE(\"$A$\",ROW()-1)))+1,\"\")","v":51},"C4.51",null,"Columns ","m3",58,null,{"$f":"F177*G177","v":0}]
[{"$f":"IF($E178<>\"\",MAX($A$1:INDIRECT(CONCATENATE(\"$A$\",ROW()-1)))+1,\"\")","v":""},""]
[{"$f":"IF($E179<>\"\",MAX($A$1:INDIRECT(CONCATENATE(\"$A$\",ROW()-1)))+1,\"\")","v":52},"C4.52",null,"Walls, including integrated columns","m³",123]
[{"$f":"IF($E180<>\"\",MAX($A$1:INDIRECT(CONCATENATE(\"$A$\",ROW()-1)))+1,\"\")","v":""},""]
[{"$f":"IF($E181<>\"\",MAX($A$1:INDIRECT(CONCATENATE(\"$A$\",ROW()-1)))+1,\"\")","v":53},"C4.53",null,"Slabs","m³",129,null,{"$f":"F181*G181","v":0}]
[{"$f":"IF($E182<>\"\",MAX($A$1:INDIRECT(CONCATENATE(\"$A$\",ROW()-1)))+1,\"\")","v":""},""]
[{"$f":"IF($E183<>\"\",MAX($A$1:INDIRECT(CONCATENATE(\"$A$\",ROW()-1)))+1,\"\")","v":54},"C4.54",null,"Beams","m³",51,null,{"$f":"F183*G183","v":0}]
[{"$f":"IF($E184<>\"\",MAX($A$1:INDIRECT(CONCATENATE(\"$A$\",ROW()-1)))+1,\"\")","v":""},""]
[{"$f":"IF($E185<>\"\",MAX($A$1:INDIRECT(CONCATENATE(\"$A$\",ROW()-1)))+1,\"\")","v":55},"C4.55",null,"Crane and ring beams","m³",26,null,{"$f":"F185*G185","v":0}]
[{"$f":"IF($E186<>\"\",MAX($A$1:INDIRECT(CONCATENATE(\"$A$\",ROW()-1)))+1,\"\")","v":""},""]
[{"$f":"IF($E187<>\"\",MAX($A$1:INDIRECT(CONCATENATE(\"$A$\",ROW()-1)))+1,\"\")","v":56},"C4.56",null,"Upstand beams","m³",2,null,{"$f":"F187*G187","v":0}]
[{"$f":"IF($E188<>\"\",MAX($A$1:INDIRECT(CONCATENATE(\"$A$\",ROW()-1)))+1,\"\")","v":""},""]
[{"$f":"IF($E189<>\"\",MAX($A$1:INDIRECT(CONCATENATE(\"$A$\",ROW()-1)))+1,\"\")","v":57},"C4.57",null,"Plinths","m³",42,null,{"$f":"F189*G189","v":0}]
[{"$f":"IF($E190<>\"\",MAX($A$1:INDIRECT(CONCATENATE(\"$A$\",ROW()-1)))+1,\"\")","v":""},""]
[{"$f":"IF($E191<>\"\",MAX($A$1:INDIRECT(CONCATENATE(\"$A$\",ROW()-1)))+1,\"\")","v":58},"C4.58",null,"Ramps","m³",4,null,{"$f":"F191*G191","v":0}]
[{"$f":"IF($E192<>\"\",MAX($A$1:INDIRECT(CONCATENATE(\"$A$\",ROW()-1)))+1,\"\")","v":""},null,null,null,null,null,null,{"$f":"F192*G192","v":0}]
[{"$f":"IF($E193<>\"\",MAX($A$1:INDIRECT(CONCATENATE(\"$A$\",ROW()-1)))+1,\"\")","v":59},{"$f":"IF(A193<>\"\",$A$3&A193,\"\")","v":"C4.59"},null,"Sump","m³",6,null,0]
[{"$f":"IF($E194<>\"\",MAX($A$1:INDIRECT(CONCATENATE(\"$A$\",ROW()-1)))+1,\"\")","v":""},""]
[{"$f":"IF($E195<>\"\",MAX($A$1:INDIRECT(CONCATENATE(\"$A$\",ROW()-1)))+1,\"\")","v":""},"",15.5,"Unformed surface finishes: "]
[{"$f":"IF($E196<>\"\",MAX($A$1:INDIRECT(CONCATENATE(\"$A$\",ROW()-1)))+1,\"\")","v":""},""]
[{"$f":"IF($E197<>\"\",MAX($A$1:INDIRECT(CONCATENATE(\"$A$\",ROW()-1)))+1,\"\")","v":""},"",null,"Wood-floated finishes to:"]
[{"$f":"IF($E198<>\"\",MAX($A$1:INDIRECT(CONCATENATE(\"$A$\",ROW()-1)))+1,\"\")","v":""},""]
[{"$f":"IF($E199<>\"\",MAX($A$1:INDIRECT(CONCATENATE(\"$A$\",ROW()-1)))+1,\"\")","v":60},"C4.60",null,"Horizontal surfaces ","m²",155,null,{"$f":"F199*G199","v":0}]
[{"$f":"IF($E200<>\"\",MAX($A$1:INDIRECT(CONCATENATE(\"$A$\",ROW()-1)))+1,\"\")","v":""},""]
[{"$f":"IF($E201<>\"\",MAX($A$1:INDIRECT(CONCATENATE(\"$A$\",ROW()-1)))+1,\"\")","v":61},"C4.61",null,"Horizontal surfaces to falls","m²",14,null,{"$f":"F201*G201","v":0}]
[{"$f":"IF($E202<>\"\",MAX($A$1:INDIRECT(CONCATENATE(\"$A$\",ROW()-1)))+1,\"\")","v":""},""]
[{"$f":"IF($E203<>\"\",MAX($A$1:INDIRECT(CONCATENATE(\"$A$\",ROW()-1)))+1,\"\")","v":""},"",null,"Steel- or power-floated finishes to:"]
[{"$f":"IF($E204<>\"\",MAX($A$1:INDIRECT(CONCATENATE(\"$A$\",ROW()-1)))+1,\"\")","v":""},""]
[{"$f":"IF($E205<>\"\",MAX($A$1:INDIRECT(CONCATENATE(\"$A$\",ROW()-1)))+1,\"\")","v":62},"C4.62",null,"Horizontal surfaces (floors, slabs, plinths, beams, columns, etc.)","m²",1371]
[{"$f":"IF($E206<>\"\",MAX($A$1:INDIRECT(CONCATENATE(\"$A$\",ROW()-1)))+1,\"\")","v":""},""]
[{"$f":"IF($E207<>\"\",MAX($A$1:INDIRECT(CONCATENATE(\"$A$\",ROW()-1)))+1,\"\")","v":63},"C4.63",null,"Horizontal surfaces to falls","m²",717,null,{"$f":"F207*G207","v":0}]
[]
[]
[{"$f":"IF($E210<>\"\",MAX($A$1:INDIRECT(CONCATENATE(\"$A$\",ROW()-1)))+1,\"\")","v":""},null,null," Carried forward / …"]
[{"$f":"IF($E211<>\"\",MAX($A$1:INDIRECT(CONCATENATE(\"$A$\",ROW()-1)))+1,\"\")","v":""},null,null," Brought forward / …"]
[]
[{"$f":"IF($E213<>\"\",MAX($A$1:INDIRECT(CONCATENATE(\"$A$\",ROW()-1)))+1,\"\")","v":""},"",15.9,"Joints:"]
[{"$f":"IF($E214<>\"\",MAX($A$1:INDIRECT(CONCATENATE(\"$A$\",ROW()-1)))+1,\"\")","v":""},""]
[{"$f":"IF($E215<>\"\",MAX($A$1:INDIRECT(CONCATENATE(\"$A$\",ROW()-1)))+1,\"\")","v":""},"",null,"Isolation joints as detailed on the drawings:"]
[{"$f":"IF($E216<>\"\",MAX($A$1:INDIRECT(CONCATENATE(\"$A$\",ROW()-1)))+1,\"\")","v":""},""]
[{"$f":"IF($E217<>\"\",MAX($A$1:INDIRECT(CONCATENATE(\"$A$\",ROW()-1)))+1,\"\")","v":64},"C4.64",null,"10 mm Jointex between vertical or horizontal concrete surface and brickwork, 230 mm wide","m",629,null,{"$f":"F217*G217","v":0}]
[{"$f":"IF($E218<>\"\",MAX($A$1:INDIRECT(CONCATENATE(\"$A$\",ROW()-1)))+1,\"\")","v":""},""]
[{"$f":"IF($E219<>\"\",MAX($A$1:INDIRECT(CONCATENATE(\"$A$\",ROW()-1)))+1,\"\")","v":""},"",null,"Construction joints as per detail:"]
[{"$f":"IF($E220<>\"\",MAX($A$1:INDIRECT(CONCATENATE(\"$A$\",ROW()-1)))+1,\"\")","v":""}]
[{"$f":"IF($E221<>\"\",MAX($A$1:INDIRECT(CONCATENATE(\"$A$\",ROW()-1)))+1,\"\")","v":65},{"$f":"IF(A221<>\"\",$A$3&A221,\"\")","v":"C4.65"},null,"Vertical construction joint in concrete walls 300mm wide as per detail type A on on drawing ST-0350","m",26]
[{"$f":"IF($E222<>\"\",MAX($A$1:INDIRECT(CONCATENATE(\"$A$\",ROW()-1)))+1,\"\")","v":""}]
[{"$f":"IF($E223<>\"\",MAX($A$1:INDIRECT(CONCATENATE(\"$A$\",ROW()-1)))+1,\"\")","v":66},"C4.66",null,"Horizontal construction joint in concrete foors 400 mm thick as per detail type A on on drawing ST-0350","m",96,null,{"$f":"F223*G223","v":0}]
[{"$f":"IF($E224<>\"\",MAX($A$1:INDIRECT(CONCATENATE(\"$A$\",ROW()-1)))+1,\"\")","v":""},""]
[{"$f":"IF($E225<>\"\",MAX($A$1:INDIRECT(CONCATENATE(\"$A$\",ROW()-1)))+1,\"\")","v":""},"",null,"Sawn joints:"]
[{"$f":"IF($E226<>\"\",MAX($A$1:INDIRECT(CONCATENATE(\"$A$\",ROW()-1)))+1,\"\")","v":""},""]
[{"$f":"IF($E227<>\"\",MAX($A$1:INDIRECT(CONCATENATE(\"$A$\",ROW()-1)))+1,\"\")","v":67},"C4.67",null,"4 mm x 40 mm saw-cut joint","m",36,null,{"$f":"F227*G227","v":0}]
[{"$f":"IF($E228<>\"\",MAX($A$1:INDIRECT(CONCATENATE(\"$A$\",ROW()-1)))+1,\"\")","v":""},""]
[{"$f":"IF($E229<>\"\",MAX($A$1:INDIRECT(CONCATENATE(\"$A$\",ROW()-1)))+1,\"\")","v":""},"",null,"Sealing of joints with two part polysulphide \"Sondor Thioflex 600\" sealant including backing cord etc.:"]
[{"$f":"IF($E230<>\"\",MAX($A$1:INDIRECT(CONCATENATE(\"$A$\",ROW()-1)))+1,\"\")","v":""},""]
[{"$f":"IF($E231<>\"\",MAX($A$1:INDIRECT(CONCATENATE(\"$A$\",ROW()-1)))+1,\"\")","v":68},"C4.68",null,"4 mm x 10 mm in saw joints","m",36,null,{"$f":"F231*G231","v":0}]
[{"$f":"IF($E232<>\"\",MAX($A$1:INDIRECT(CONCATENATE(\"$A$\",ROW()-1)))+1,\"\")","v":""},""]
[{"$f":"IF($E233<>\"\",MAX($A$1:INDIRECT(CONCATENATE(\"$A$\",ROW()-1)))+1,\"\")","v":69},"C4.69",null,"10 x 10 mm in isolation joints","m",1257,null,{"$f":"F233*G233","v":0}]
[{"$f":"IF($E234<>\"\",MAX($A$1:INDIRECT(CONCATENATE(\"$A$\",ROW()-1)))+1,\"\")","v":""},""]
[{"$f":"IF($E235<>\"\",MAX($A$1:INDIRECT(CONCATENATE(\"$A$\",ROW()-1)))+1,\"\")","v":70},"C4.70",15.13,"Allowance for application of expansion/movement joint bridging flexible waterstop","m",20]
[{"$f":"IF($E236<>\"\",MAX($A$1:INDIRECT(CONCATENATE(\"$A$\",ROW()-1)))+1,\"\")","v":""},""]
[{"$f":"IF($E237<>\"\",MAX($A$1:INDIRECT(CONCATENATE(\"$A$\",ROW()-1)))+1,\"\")","v":71},"C4.71",15.14,"Allowance for application of an expansive watertight seal in a construction joint","m",20]
[{"$f":"IF($E238<>\"\",MAX($A$1:INDIRECT(CONCATENATE(\"$A$\",ROW()-1)))+1,\"\")","v":""},""]
[{"$f":"IF($E239<>\"\",MAX($A$1:INDIRECT(CONCATENATE(\"$A$\",ROW()-1)))+1,\"\")","v":""},"",15.6,"Manufacture (or supply) and erect precast elements for small units not exceeding 0,5 m³ of formed concrete:"]
[{"$f":"IF($E240<>\"\",MAX($A$1:INDIRECT(CONCATENATE(\"$A$\",ROW()-1)))+1,\"\")","v":""},""]
[{"$f":"IF($E241<>\"\",MAX($A$1:INDIRECT(CONCATENATE(\"$A$\",ROW()-1)))+1,\"\")","v":""},"",null,"The following types and sizes:"]
[{"$f":"IF($E242<>\"\",MAX($A$1:INDIRECT(CONCATENATE(\"$A$\",ROW()-1)))+1,\"\")","v":""},""]
[{"$f":"IF($E243<>\"\",MAX($A$1:INDIRECT(CONCATENATE(\"$A$\",ROW()-1)))+1,\"\")","v":72},"C4.72",null,"35 MPa cover slabs, size 1 400 mm x 1 350 mm x 250 mm thick with100 kg/m³ reinforcing and recessed lifting lugs","No",2,null,{"$f":"F243*G243","v":0}]
[{"$f":"IF($E244<>\"\",MAX($A$1:INDIRECT(CONCATENATE(\"$A$\",ROW()-1)))+1,\"\")","v":""},""]
[{"$f":"IF($E245<>\"\",MAX($A$1:INDIRECT(CONCATENATE(\"$A$\",ROW()-1)))+1,\"\")","v":""},"","15.10","Grouting:"]
[{"$f":"IF($E246<>\"\",MAX($A$1:INDIRECT(CONCATENATE(\"$A$\",ROW()-1)))+1,\"\")","v":""},""]
[{"$f":"IF($E247<>\"\",MAX($A$1:INDIRECT(CONCATENATE(\"$A$\",ROW()-1)))+1,\"\")","v":73},"C4.73",null,"Under base plates","m³","0.5",null,{"$f":"F247*G247","v":0}]
[{"$f":"IF($E248<>\"\",MAX($A$1:INDIRECT(CONCATENATE(\"$A$\",ROW()-1)))+1,\"\")","v":""},""]
[{"$f":"IF($E249<>\"\",MAX($A$1:INDIRECT(CONCATENATE(\"$A$\",ROW()-1)))+1,\"\")","v":74},"C4.74",null,"In walls","m³","1"]
[]
[]
[{"$f":"IF($E252<>\"\",MAX($A$1:INDIRECT(CONCATENATE(\"$A$\",ROW()-1)))+1,\"\")","v":""},null,null," Carried forward / …"]
[{"$f":"IF($E253<>\"\",MAX($A$1:INDIRECT(CONCATENATE(\"$A$\",ROW()-1)))+1,\"\")","v":""},null,null," Brought forward / …"]
[]
[{"$f":"IF($E255<>\"\",MAX($A$1:INDIRECT(CONCATENATE(\"$A$\",ROW()-1)))+1,\"\")","v":""},"",15.8,"Casting items in concrete:"]
[{"$f":"IF($E256<>\"\",MAX($A$1:INDIRECT(CONCATENATE(\"$A$\",ROW()-1)))+1,\"\")","v":""},""]
[{"$f":"IF($E257<>\"\",MAX($A$1:INDIRECT(CONCATENATE(\"$A$\",ROW()-1)))+1,\"\")","v":75},"C4.75",null,"Up to 300 mm nominal bore in up to 300 mm thick concrete","No","2",null,{"$f":"F257*G257","v":0}]
[{"$f":"IF($E258<>\"\",MAX($A$1:INDIRECT(CONCATENATE(\"$A$\",ROW()-1)))+1,\"\")","v":""},""]
[{"$f":"IF($E259<>\"\",MAX($A$1:INDIRECT(CONCATENATE(\"$A$\",ROW()-1)))+1,\"\")","v":76},"C4.76",null,"Over 300 mm up to 600 mm nominal bore in up to 300 mm thick concrete","No","2",null,{"$f":"F259*G259","v":0}]
[]
[null,null,15.11,"Subsoil drainage:"]
[{"$f":"IF($E262<>\"\",MAX($A$1:INDIRECT(CONCATENATE(\"$A$\",ROW()-1)))+1,\"\")","v":""}]
[{"$f":"IF($E263<>\"\",MAX($A$1:INDIRECT(CONCATENATE(\"$A$\",ROW()-1)))+1,\"\")","v":77},{"$f":"IF(A263<>\"\",$A$3&A263,\"\")","v":"C4.77"},null,"Subsoil drainage - 450x450mm subsoil drain with 110 diamater perforated pipe (uPVC) core drain and 19mm clean stone wrapped in grade 3 geotextile.","m",130]
[{"$f":"IF($E264<>\"\",MAX($A$1:INDIRECT(CONCATENATE(\"$A$\",ROW()-1)))+1,\"\")","v":""}]
[{"$f":"IF($E265<>\"\",MAX($A$1:INDIRECT(CONCATENATE(\"$A$\",ROW()-1)))+1,\"\")","v":78},{"$f":"IF(A265<>\"\",$A$3&A265,\"\")","v":"C4.78"},null,"Kaytech wick drain GPW 100 to perimeter of structure at 1m centers.","m",460]
[{"$f":"IF($E266<>\"\",MAX($A$1:INDIRECT(CONCATENATE(\"$A$\",ROW()-1)))+1,\"\")","v":""},""]
[{"$f":"IF($E267<>\"\",MAX($A$1:INDIRECT(CONCATENATE(\"$A$\",ROW()-1)))+1,\"\")","v":""},"","PSH 8.3\nPSH 8.3.14","Supply, fabrication, delivery and erection of steelwork:"]
[{"$f":"IF($E268<>\"\",MAX($A$1:INDIRECT(CONCATENATE(\"$A$\",ROW()-1)))+1,\"\")","v":""},""]
[{"$f":"IF($E269<>\"\",MAX($A$1:INDIRECT(CONCATENATE(\"$A$\",ROW()-1)))+1,\"\")","v":""},"",null,"Hot-dipped galvanized steel as per drawings, including erection bolts:"]
[{"$f":"IF($E270<>\"\",MAX($A$1:INDIRECT(CONCATENATE(\"$A$\",ROW()-1)))+1,\"\")","v":""},""]
[{"$f":"IF($E271<>\"\",MAX($A$1:INDIRECT(CONCATENATE(\"$A$\",ROW()-1)))+1,\"\")","v":""},"",null,"Roof structure:"]
[{"$f":"IF($E272<>\"\",MAX($A$1:INDIRECT(CONCATENATE(\"$A$\",ROW()-1)))+1,\"\")","v":""},""]
[{"$f":"IF($E273<>\"\",MAX($A$1:INDIRECT(CONCATENATE(\"$A$\",ROW()-1)))+1,\"\")","v":79},"C4.79",null,"Hot-rolled sections","t","9.86",null,{"$f":"F273*G273","v":0}]
[{"$f":"IF($E274<>\"\",MAX($A$1:INDIRECT(CONCATENATE(\"$A$\",ROW()-1)))+1,\"\")","v":""},""]
[{"$f":"IF($E275<>\"\",MAX($A$1:INDIRECT(CONCATENATE(\"$A$\",ROW()-1)))+1,\"\")","v":80},"C4.80",null,"Cold-rolled sections","t","6.16",null,{"$f":"F275*G275","v":0}]
[{"$f":"IF($E276<>\"\",MAX($A$1:INDIRECT(CONCATENATE(\"$A$\",ROW()-1)))+1,\"\")","v":""},""]
[{"$f":"IF($E277<>\"\",MAX($A$1:INDIRECT(CONCATENATE(\"$A$\",ROW()-1)))+1,\"\")","v":""},"",null,"Crane walkway:"]
[{"$f":"IF($E278<>\"\",MAX($A$1:INDIRECT(CONCATENATE(\"$A$\",ROW()-1)))+1,\"\")","v":""},""]
[{"$f":"IF($E279<>\"\",MAX($A$1:INDIRECT(CONCATENATE(\"$A$\",ROW()-1)))+1,\"\")","v":81},"C4.81",null,"Hot-rolled sections","t","1.27",null,{"$f":"F279*G279","v":0}]
[{"$f":"IF($E280<>\"\",MAX($A$1:INDIRECT(CONCATENATE(\"$A$\",ROW()-1)))+1,\"\")","v":""},""]
[{"$f":"IF($E281<>\"\",MAX($A$1:INDIRECT(CONCATENATE(\"$A$\",ROW()-1)))+1,\"\")","v":""},"",null,"Posts for Armco barriers:"]
[{"$f":"IF($E282<>\"\",MAX($A$1:INDIRECT(CONCATENATE(\"$A$\",ROW()-1)))+1,\"\")","v":""},""]
[{"$f":"IF($E283<>\"\",MAX($A$1:INDIRECT(CONCATENATE(\"$A$\",ROW()-1)))+1,\"\")","v":82},"C4.82",null,"Hot-rolled sections","t","0.55",null,{"$f":"F283*G283","v":0}]
[{"$f":"IF($E284<>\"\",MAX($A$1:INDIRECT(CONCATENATE(\"$A$\",ROW()-1)))+1,\"\")","v":""},""]
[null,null,null,"Staircases complete with stair treads and handrailing:"]
[{"$f":"IF($E286<>\"\",MAX($A$1:INDIRECT(CONCATENATE(\"$A$\",ROW()-1)))+1,\"\")","v":""},{"$f":"IF(A286<>\"\",$A$3&A286,\"\")","v":""}]
[{"$f":"IF($E287<>\"\",MAX($A$1:INDIRECT(CONCATENATE(\"$A$\",ROW()-1)))+1,\"\")","v":83},"C4.83",null,"Staircase 1,0 m wide x 2,4 m high comprising thirteen Vitagrid 40 x 4,5 x 1 000x 245 stair treads, 700 mm long platform at top, PC 180 x 70 stair stringers, baseplates and tubular handrailing","No",4,null,{"$f":"F287*G287","v":0}]
[{"$f":"IF($E288<>\"\",MAX($A$1:INDIRECT(CONCATENATE(\"$A$\",ROW()-1)))+1,\"\")","v":""},""]
[{"$f":"IF($E289<>\"\",MAX($A$1:INDIRECT(CONCATENATE(\"$A$\",ROW()-1)))+1,\"\")","v":84},"C4.84",null,"Staircase 1,0 m wide x 2,4 m high comprising thirteen Vitagrid 40 x 4,5 x 1 000x 245 stair treads, 1400 mm long platform at top, PC 180 x 70 stair stringers, baseplates and tubular handrailing","No",1]
[]
[]
[{"$f":"IF($E292<>\"\",MAX($A$1:INDIRECT(CONCATENATE(\"$A$\",ROW()-1)))+1,\"\")","v":""},null,null," Carried forward / …"]
[{"$f":"IF($E293<>\"\",MAX($A$1:INDIRECT(CONCATENATE(\"$A$\",ROW()-1)))+1,\"\")","v":""},null,null," Brought forward / …"]
[]
[{"$f":"IF($E295<>\"\",MAX($A$1:INDIRECT(CONCATENATE(\"$A$\",ROW()-1)))+1,\"\")","v":""},"","8.3.6","Holding-down (HD) bolts:"]
[{"$f":"IF($E296<>\"\",MAX($A$1:INDIRECT(CONCATENATE(\"$A$\",ROW()-1)))+1,\"\")","v":""},""]
[{"$f":"IF($E297<>\"\",MAX($A$1:INDIRECT(CONCATENATE(\"$A$\",ROW()-1)))+1,\"\")","v":85},"C4.85",null,"M20 Hilti Hit HY 200, 300 mm long HDG","No",72,null,{"$f":"F297*G297","v":0}]
[{"$f":"IF($E298<>\"\",MAX($A$1:INDIRECT(CONCATENATE(\"$A$\",ROW()-1)))+1,\"\")","v":""},""]
[{"$f":"IF($E299<>\"\",MAX($A$1:INDIRECT(CONCATENATE(\"$A$\",ROW()-1)))+1,\"\")","v":86},"C4.86",null,"M20 Hilti Hit HY 200, 200 mm long HDG","No",20,null,{"$f":"F299*G299","v":0}]
[{"$f":"IF($E300<>\"\",MAX($A$1:INDIRECT(CONCATENATE(\"$A$\",ROW()-1)))+1,\"\")","v":""},""]
[{"$f":"IF($E301<>\"\",MAX($A$1:INDIRECT(CONCATENATE(\"$A$\",ROW()-1)))+1,\"\")","v":87},"C4.87",null,"M16 chemical anchors 150 mm long","No",20,null,{"$f":"F301*G301","v":0}]
[{"$f":"IF($E302<>\"\",MAX($A$1:INDIRECT(CONCATENATE(\"$A$\",ROW()-1)))+1,\"\")","v":""},""]
[{"$f":"IF($E303<>\"\",MAX($A$1:INDIRECT(CONCATENATE(\"$A$\",ROW()-1)))+1,\"\")","v":88},"C4.88",null,"M16 chemical anchors 250 mm long","No",24,null,{"$f":"F303*G303","v":0}]
[{"$f":"IF($E304<>\"\",MAX($A$1:INDIRECT(CONCATENATE(\"$A$\",ROW()-1)))+1,\"\")","v":""},""]
[{"$f":"IF($E305<>\"\",MAX($A$1:INDIRECT(CONCATENATE(\"$A$\",ROW()-1)))+1,\"\")","v":89},"C4.89",null,"M24 chemical anchors 300 mm long","No",36,null,{"$f":"F305*G305","v":0}]
[]
[{"$f":"IF($E307<>\"\",MAX($A$1:INDIRECT(CONCATENATE(\"$A$\",ROW()-1)))+1,\"\")","v":""},"","SANS"]
[{"$f":"IF($E308<>\"\",MAX($A$1:INDIRECT(CONCATENATE(\"$A$\",ROW()-1)))+1,\"\")","v":""},"","1200 HA       ","STRUCTURAL STEELWORK (SUNDRY ITEMS)"]
[{"$f":"IF($E309<>\"\",MAX($A$1:INDIRECT(CONCATENATE(\"$A$\",ROW()-1)))+1,\"\")","v":""},"",8.3000000000000007]
[{"$f":"IF($E310<>\"\",MAX($A$1:INDIRECT(CONCATENATE(\"$A$\",ROW()-1)))+1,\"\")","v":""},"","PSHA 8.3"]
[{"$f":"IF($E311<>\"\",MAX($A$1:INDIRECT(CONCATENATE(\"$A$\",ROW()-1)))+1,\"\")","v":""},"","8.3.2","Handrails, including erection:"]
[{"$f":"IF($E312<>\"\",MAX($A$1:INDIRECT(CONCATENATE(\"$A$\",ROW()-1)))+1,\"\")","v":""},""]
[{"$f":"IF($E313<>\"\",MAX($A$1:INDIRECT(CONCATENATE(\"$A$\",ROW()-1)))+1,\"\")","v":""},"",null,"Galvanized steel industrial tubular handrails 1 000 mm high as per drawings:"]
[{"$f":"IF($E314<>\"\",MAX($A$1:INDIRECT(CONCATENATE(\"$A$\",ROW()-1)))+1,\"\")","v":""},""]
[{"$f":"IF($E315<>\"\",MAX($A$1:INDIRECT(CONCATENATE(\"$A$\",ROW()-1)))+1,\"\")","v":90},"C4.90",null,"Handrail assembly complete to crane walkway","m",13,null,{"$f":"F315*G315","v":0}]
[{"$f":"IF($E316<>\"\",MAX($A$1:INDIRECT(CONCATENATE(\"$A$\",ROW()-1)))+1,\"\")","v":""},""]
[{"$f":"IF($E317<>\"\",MAX($A$1:INDIRECT(CONCATENATE(\"$A$\",ROW()-1)))+1,\"\")","v":91},"C4.91",null,"Rails only (hand and knee rails measured)","m",74,null,{"$f":"F317*G317","v":0}]
[{"$f":"IF($E318<>\"\",MAX($A$1:INDIRECT(CONCATENATE(\"$A$\",ROW()-1)))+1,\"\")","v":""},""]
[{"$f":"IF($E319<>\"\",MAX($A$1:INDIRECT(CONCATENATE(\"$A$\",ROW()-1)))+1,\"\")","v":92},"C4.92",null,"Stanchions only","No",38]
[{"$f":"IF($E320<>\"\",MAX($A$1:INDIRECT(CONCATENATE(\"$A$\",ROW()-1)))+1,\"\")","v":""},""]
[{"$f":"IF($E321<>\"\",MAX($A$1:INDIRECT(CONCATENATE(\"$A$\",ROW()-1)))+1,\"\")","v":93},"C4.93",null,"Closed ends","No",10,null,{"$f":"F321*G321","v":0}]
[{"$f":"IF($E322<>\"\",MAX($A$1:INDIRECT(CONCATENATE(\"$A$\",ROW()-1)))+1,\"\")","v":""},""]
[{"$f":"IF($E323<>\"\",MAX($A$1:INDIRECT(CONCATENATE(\"$A$\",ROW()-1)))+1,\"\")","v":94},"C4.94",null,"Corners/bends","No",18,null,{"$f":"F323*G323","v":0}]
[{"$f":"IF($E324<>\"\",MAX($A$1:INDIRECT(CONCATENATE(\"$A$\",ROW()-1)))+1,\"\")","v":""},""]
[{"$f":"IF($E325<>\"\",MAX($A$1:INDIRECT(CONCATENATE(\"$A$\",ROW()-1)))+1,\"\")","v":95},"C4.95",null,"Knees","No",10,null,{"$f":"F325*G325","v":0}]
[{"$f":"IF($E326<>\"\",MAX($A$1:INDIRECT(CONCATENATE(\"$A$\",ROW()-1)))+1,\"\")","v":""},""]
[{"$f":"IF($E327<>\"\",MAX($A$1:INDIRECT(CONCATENATE(\"$A$\",ROW()-1)))+1,\"\")","v":96},"C4.96",null,"HD bolts, nuts and washers for each stanchion (fixed to concrete)","No",38,null,{"$f":"F327*G327","v":0}]
[{"$f":"IF($E328<>\"\",MAX($A$1:INDIRECT(CONCATENATE(\"$A$\",ROW()-1)))+1,\"\")","v":""},""]
[{"$f":"IF($E329<>\"\",MAX($A$1:INDIRECT(CONCATENATE(\"$A$\",ROW()-1)))+1,\"\")","v":""},"","8.3.4","Flooring, complete and installed with frames:"]
[{"$f":"IF($E330<>\"\",MAX($A$1:INDIRECT(CONCATENATE(\"$A$\",ROW()-1)))+1,\"\")","v":""},""]
[{"$f":"IF($E331<>\"\",MAX($A$1:INDIRECT(CONCATENATE(\"$A$\",ROW()-1)))+1,\"\")","v":97},"C4.97",null,"Rectagrid RS40 HDG grating, with 40 x 4,5 mm bars in both directions, banded (fixed to steel beams)","m²",12,null,{"$f":"F331*G331","v":0}]
[{"$f":"IF($E332<>\"\",MAX($A$1:INDIRECT(CONCATENATE(\"$A$\",ROW()-1)))+1,\"\")","v":""},""]
[{"$f":"IF($E333<>\"\",MAX($A$1:INDIRECT(CONCATENATE(\"$A$\",ROW()-1)))+1,\"\")","v":""},"",null,"Flooring, complete and installed (frames"]
[{"$f":"IF($E334<>\"\",MAX($A$1:INDIRECT(CONCATENATE(\"$A$\",ROW()-1)))+1,\"\")","v":""},"",null,"measured separately):"]
[{"$f":"IF($E335<>\"\",MAX($A$1:INDIRECT(CONCATENATE(\"$A$\",ROW()-1)))+1,\"\")","v":""},""]
[{"$f":"IF($E336<>\"\",MAX($A$1:INDIRECT(CONCATENATE(\"$A$\",ROW()-1)))+1,\"\")","v":""},"",null,"Open grid floors, hot-dipped galvanized:"]
[{"$f":"IF($E337<>\"\",MAX($A$1:INDIRECT(CONCATENATE(\"$A$\",ROW()-1)))+1,\"\")","v":""},""]
[{"$f":"IF($E338<>\"\",MAX($A$1:INDIRECT(CONCATENATE(\"$A$\",ROW()-1)))+1,\"\")","v":98},"C4.98",null,"Rectagrid RS 40 or equal approved bonded gratings with 40 mm x 4,5 mm bearing bars, in suitable panel sizes(drain channels)","m²",29,null,{"$f":"F338*G338","v":0}]
[]
[null,null,null," Carried forward / …"]
[null,null,null," Brought forward / …"]
[]
[{"$f":"IF($E343<>\"\",MAX($A$1:INDIRECT(CONCATENATE(\"$A$\",ROW()-1)))+1,\"\")","v":99},"C4.99",null,"Rectagrid RS40 or equal approved bonded gratings with 60 mm x 6 mm bearing bars, in suitable panels","m²",6,null,{"$f":"F343*G343","v":0}]
[{"$f":"IF($E344<>\"\",MAX($A$1:INDIRECT(CONCATENATE(\"$A$\",ROW()-1)))+1,\"\")","v":""},""]
[{"$f":"IF($E345<>\"\",MAX($A$1:INDIRECT(CONCATENATE(\"$A$\",ROW()-1)))+1,\"\")","v":""},"",null,"Frames and supports for banded grid flooring (hot-dipped galvanized):"]
[{"$f":"IF($E346<>\"\",MAX($A$1:INDIRECT(CONCATENATE(\"$A$\",ROW()-1)))+1,\"\")","v":""},""]
[{"$f":"IF($E347<>\"\",MAX($A$1:INDIRECT(CONCATENATE(\"$A$\",ROW()-1)))+1,\"\")","v":100},"C4.100",null,"45 mm x 45 mm x 5 mm angle sections with 30 x 5 x 150 mm long fishtail lugs welded at 500 mm centres and with 40mm x 5 mm flat section welded on along length, cast into concrete, etc. as shown on the drawings","m",215,null,{"$f":"F347*G347","v":0}]
[{"$f":"IF($E348<>\"\",MAX($A$1:INDIRECT(CONCATENATE(\"$A$\",ROW()-1)))+1,\"\")","v":""},""]
[{"$f":"IF($E349<>\"\",MAX($A$1:INDIRECT(CONCATENATE(\"$A$\",ROW()-1)))+1,\"\")","v":101},"C4.101",null,"70 mm x 70 mm x 8 mm angle sections with 30 x 5 x 150 mm long fishtail lugs welded at 500 mm centres and with 40mm x 5 mm flat section welded on along length, cast into concrete, etc. as shown on the drawings","m",23]
[]
[null,null,"SANS"]
[{"$f":"IF($E352<>\"\",MAX($A$1:INDIRECT(CONCATENATE(\"$A$\",ROW()-1)))+1,\"\")","v":""},{"$f":"IF(A352<>\"\",$A$3&A352,\"\")","v":""},"1200 MM","GUARDRAILS"]
[{"$f":"IF($E353<>\"\",MAX($A$1:INDIRECT(CONCATENATE(\"$A$\",ROW()-1)))+1,\"\")","v":""},""]
[{"$f":"IF($E354<>\"\",MAX($A$1:INDIRECT(CONCATENATE(\"$A$\",ROW()-1)))+1,\"\")","v":""},"","8.2.1","Guardrails on structural steel (structural steel measured elsewhere):"]
[{"$f":"IF($E355<>\"\",MAX($A$1:INDIRECT(CONCATENATE(\"$A$\",ROW()-1)))+1,\"\")","v":""},""]
[{"$f":"IF($E356<>\"\",MAX($A$1:INDIRECT(CONCATENATE(\"$A$\",ROW()-1)))+1,\"\")","v":102},"C4.102",null,"Galvanized (Armco)","m",30,null,{"$f":"F356*G356","v":0}]
[{"$f":"IF($E357<>\"\",MAX($A$1:INDIRECT(CONCATENATE(\"$A$\",ROW()-1)))+1,\"\")","v":""},""]
[{"$f":"IF($E358<>\"\",MAX($A$1:INDIRECT(CONCATENATE(\"$A$\",ROW()-1)))+1,\"\")","v":""},"",null,"End units:"]
[{"$f":"IF($E359<>\"\",MAX($A$1:INDIRECT(CONCATENATE(\"$A$\",ROW()-1)))+1,\"\")","v":""},""]
[{"$f":"IF($E360<>\"\",MAX($A$1:INDIRECT(CONCATENATE(\"$A$\",ROW()-1)))+1,\"\")","v":103},"C4.103","8.2.3","End wings to 300 mm radius (Armco)","No",24,null,{"$f":"F360*G360","v":0}]
[{"$f":"IF($E361<>\"\",MAX($A$1:INDIRECT(CONCATENATE(\"$A$\",ROW()-1)))+1,\"\")","v":""},""]
[{"$f":"IF($E362<>\"\",MAX($A$1:INDIRECT(CONCATENATE(\"$A$\",ROW()-1)))+1,\"\")","v":""},"","1200 HB","CLADDING AND SHEETING"]
[{"$f":"IF($E363<>\"\",MAX($A$1:INDIRECT(CONCATENATE(\"$A$\",ROW()-1)))+1,\"\")","v":""},"","8.2.2",null,null,null,""]
[{"$f":"IF($E364<>\"\",MAX($A$1:INDIRECT(CONCATENATE(\"$A$\",ROW()-1)))+1,\"\")","v":""},"","PSHB 8.2.2","Supply and install cladding and sheeting:",null,null,""]
[{"$f":"IF($E365<>\"\",MAX($A$1:INDIRECT(CONCATENATE(\"$A$\",ROW()-1)))+1,\"\")","v":""},"",null,null,null,null,""]
[{"$f":"IF($E366<>\"\",MAX($A$1:INDIRECT(CONCATENATE(\"$A$\",ROW()-1)))+1,\"\")","v":""},"",null,"0,53 mm thick Global Roofing \"Klip-tite 700\" profile Clean Colorbond Ultra (AZ200) heavy industrial grade G550 sheeting with \"Garden Route Green\" finish to one side (with 5-year guarantee):"]
[]
[{"$f":"IF($E368<>\"\",MAX($A$1:INDIRECT(CONCATENATE(\"$A$\",ROW()-1)))+1,\"\")","v":104},"C4.104",null,"Roof coverings with pitches not exceeding 25° fixed to steel purlins","m²",615,null,{"$f":"F368*G368","v":0}]
[{"$f":"IF($E369<>\"\",MAX($A$1:INDIRECT(CONCATENATE(\"$A$\",ROW()-1)))+1,\"\")","v":""},""]
[{"$f":"IF($E370<>\"\",MAX($A$1:INDIRECT(CONCATENATE(\"$A$\",ROW()-1)))+1,\"\")","v":105},"C4.105",null,"Roof covering for bullnose at eaves. Bullnose to have a radius of 450mm","m²",86,null,{"$f":"F370*G370","v":0}]
[{"$f":"IF($E371<>\"\",MAX($A$1:INDIRECT(CONCATENATE(\"$A$\",ROW()-1)))+1,\"\")","v":""},""]
[{"$f":"IF($E372<>\"\",MAX($A$1:INDIRECT(CONCATENATE(\"$A$\",ROW()-1)))+1,\"\")","v":106},"C4.106",null,"Side cladding fixed to steel girts","m²",130,null,{"$f":"F372*G372","v":0}]
[{"$f":"IF($E373<>\"\",MAX($A$1:INDIRECT(CONCATENATE(\"$A$\",ROW()-1)))+1,\"\")","v":""},""]
[{"$f":"IF($E374<>\"\",MAX($A$1:INDIRECT(CONCATENATE(\"$A$\",ROW()-1)))+1,\"\")","v":107},"C4.107",null,"Translucent sheeting. Global Roofing \"SUNTUF Bronze 25%\"","m²",120,null,{"$f":"F374*G374","v":0}]
[]
[]
[null,null,null," Carried forward / …"]
[null,null,null," Brought forward / …"]
[]
[{"$f":"IF($E380<>\"\",MAX($A$1:INDIRECT(CONCATENATE(\"$A$\",ROW()-1)))+1,\"\")","v":""},{"$f":"IF(A380<>\"\",$A$3&A380,\"\")","v":""},null,"Extra over for \"Alucushion\" white polyethylene-coated roof insulation with aluminium foil to one side Code (2906), including white PVC-coated straining wire spaced at 383 mm centres:"]
[{"$f":"IF($E381<>\"\",MAX($A$1:INDIRECT(CONCATENATE(\"$A$\",ROW()-1)))+1,\"\")","v":""},""]
[{"$f":"IF($E382<>\"\",MAX($A$1:INDIRECT(CONCATENATE(\"$A$\",ROW()-1)))+1,\"\")","v":108},"C4.108",null,"4 mm thick insulation laid taut over purlins or grids and fixed concurrent with roof covering and cladding overlapped longitudinally by 100 mm","m²",480]
[{"$f":"IF($E383<>\"\",MAX($A$1:INDIRECT(CONCATENATE(\"$A$\",ROW()-1)))+1,\"\")","v":""},""]
[{"$f":"IF($E384<>\"\",MAX($A$1:INDIRECT(CONCATENATE(\"$A$\",ROW()-1)))+1,\"\")","v":""},"","8.2.3"]
[{"$f":"IF($E385<>\"\",MAX($A$1:INDIRECT(CONCATENATE(\"$A$\",ROW()-1)))+1,\"\")","v":""},"","PSHB 8.2.3","Supply and install ancillaries:",null,null,""]
[{"$f":"IF($E386<>\"\",MAX($A$1:INDIRECT(CONCATENATE(\"$A$\",ROW()-1)))+1,\"\")","v":""},""]
[{"$f":"IF($E387<>\"\",MAX($A$1:INDIRECT(CONCATENATE(\"$A$\",ROW()-1)))+1,\"\")","v":""},"",null,"0,53 mm thick Clean Colourbond Ultra AZ200 sheeting with \"Garden Route Green\" finish to match roof sheeting and side cladding:",null,null,""]
[{"$f":"IF($E388<>\"\",MAX($A$1:INDIRECT(CONCATENATE(\"$A$\",ROW()-1)))+1,\"\")","v":""},"",null,null,null,null,""]
[{"$f":"IF($E389<>\"\",MAX($A$1:INDIRECT(CONCATENATE(\"$A$\",ROW()-1)))+1,\"\")","v":109},"C4.109",null,"Ridge flashing","m",43,null,{"$f":"F389*G389","v":0}]
[{"$f":"IF($E390<>\"\",MAX($A$1:INDIRECT(CONCATENATE(\"$A$\",ROW()-1)))+1,\"\")","v":""},""]
[{"$f":"IF($E391<>\"\",MAX($A$1:INDIRECT(CONCATENATE(\"$A$\",ROW()-1)))+1,\"\")","v":110},"C4.110",null,"External corner trim","m",14,null,{"$f":"F391*G391","v":0}]
[{"$f":"IF($E392<>\"\",MAX($A$1:INDIRECT(CONCATENATE(\"$A$\",ROW()-1)))+1,\"\")","v":""},""]
[{"$f":"IF($E393<>\"\",MAX($A$1:INDIRECT(CONCATENATE(\"$A$\",ROW()-1)))+1,\"\")","v":111},"C4.111",null,"Gable or barge flashing","m",31,null,{"$f":"F393*G393","v":0}]
[{"$f":"IF($E394<>\"\",MAX($A$1:INDIRECT(CONCATENATE(\"$A$\",ROW()-1)))+1,\"\")","v":""},""]
[{"$f":"IF($E395<>\"\",MAX($A$1:INDIRECT(CONCATENATE(\"$A$\",ROW()-1)))+1,\"\")","v":""},"",null,"Gable or barge flashing curved to suit"]
[{"$f":"IF($E396<>\"\",MAX($A$1:INDIRECT(CONCATENATE(\"$A$\",ROW()-1)))+1,\"\")","v":112},"C4.112",null,"bull nose","m",3,null,{"$f":"F396*G396","v":0}]
[{"$f":"IF($E397<>\"\",MAX($A$1:INDIRECT(CONCATENATE(\"$A$\",ROW()-1)))+1,\"\")","v":""},""]
[{"$f":"IF($E398<>\"\",MAX($A$1:INDIRECT(CONCATENATE(\"$A$\",ROW()-1)))+1,\"\")","v":113},"C4.113",null,"Drip flashing","m",113,null,{"$f":"F398*G398","v":0}]
[{"$f":"IF($E399<>\"\",MAX($A$1:INDIRECT(CONCATENATE(\"$A$\",ROW()-1)))+1,\"\")","v":""},""]
[{"$f":"IF($E400<>\"\",MAX($A$1:INDIRECT(CONCATENATE(\"$A$\",ROW()-1)))+1,\"\")","v":114},"C4.114",null,"Serrated closers","m",86,null,{"$f":"F400*G400","v":0}]
[{"$f":"IF($E401<>\"\",MAX($A$1:INDIRECT(CONCATENATE(\"$A$\",ROW()-1)))+1,\"\")","v":""},""]
[{"$f":"IF($E402<>\"\",MAX($A$1:INDIRECT(CONCATENATE(\"$A$\",ROW()-1)))+1,\"\")","v":115},"C4.115",null,"Polyclosers","m",86,null,{"$f":"F402*G402","v":0}]
[{"$f":"IF($E403<>\"\",MAX($A$1:INDIRECT(CONCATENATE(\"$A$\",ROW()-1)))+1,\"\")","v":""},""]
[{"$f":"IF($E404<>\"\",MAX($A$1:INDIRECT(CONCATENATE(\"$A$\",ROW()-1)))+1,\"\")","v":116},"C4.116",null,"Ridge roof ventilator powder-coated to match roof sheeting, 2 m long with500 mm wide throat, manual closure, stainless steel 316 mesh bird screen, closed ends and all flashings to seal watertight to roofing","No",4,null,{"$f":"F404*G404","v":0}]
[{"$f":"IF($E405<>\"\",MAX($A$1:INDIRECT(CONCATENATE(\"$A$\",ROW()-1)))+1,\"\")","v":""},""]
[{"$f":"IF($E406<>\"\",MAX($A$1:INDIRECT(CONCATENATE(\"$A$\",ROW()-1)))+1,\"\")","v":""},"","PD 11","BUILDING WORK"]
[{"$f":"IF($E407<>\"\",MAX($A$1:INDIRECT(CONCATENATE(\"$A$\",ROW()-1)))+1,\"\")","v":""},""]
[{"$f":"IF($E408<>\"\",MAX($A$1:INDIRECT(CONCATENATE(\"$A$\",ROW()-1)))+1,\"\")","v":""},"",11.01,"Brickwork:"]
[{"$f":"IF($E409<>\"\",MAX($A$1:INDIRECT(CONCATENATE(\"$A$\",ROW()-1)))+1,\"\")","v":""},""]
[{"$f":"IF($E410<>\"\",MAX($A$1:INDIRECT(CONCATENATE(\"$A$\",ROW()-1)))+1,\"\")","v":""},"",null,"Brick walls in Corobrick NFX 14 MPa non-facing bricks:"]
[{"$f":"IF($E411<>\"\",MAX($A$1:INDIRECT(CONCATENATE(\"$A$\",ROW()-1)))+1,\"\")","v":""},""]
[{"$f":"IF($E412<>\"\",MAX($A$1:INDIRECT(CONCATENATE(\"$A$\",ROW()-1)))+1,\"\")","v":117},"C4.117",null,"230 mm thick drain and cable trench walls","m²",86,null,{"$f":"F412*G412","v":0}]
[{"$f":"IF($E413<>\"\",MAX($A$1:INDIRECT(CONCATENATE(\"$A$\",ROW()-1)))+1,\"\")","v":""},""]
[{"$f":"IF($E414<>\"\",MAX($A$1:INDIRECT(CONCATENATE(\"$A$\",ROW()-1)))+1,\"\")","v":""},"",null,"Brick walls in Corobrick \"Tokai Red\" rustic FBX facebricks:"]
[{"$f":"IF($E415<>\"\",MAX($A$1:INDIRECT(CONCATENATE(\"$A$\",ROW()-1)))+1,\"\")","v":""},""]
[{"$f":"IF($E416<>\"\",MAX($A$1:INDIRECT(CONCATENATE(\"$A$\",ROW()-1)))+1,\"\")","v":118},"C4.118",null,"230 mm thick walls","m²",580]
[]
[null,null,null," Carried forward / …"]
[null,null,null," Brought forward / …"]
[]
[{"$f":"IF($E421<>\"\",MAX($A$1:INDIRECT(CONCATENATE(\"$A$\",ROW()-1)))+1,\"\")","v":119},"C4.119",null,"280 mm thick walls","m²",825]
[{"$f":"IF($E422<>\"\",MAX($A$1:INDIRECT(CONCATENATE(\"$A$\",ROW()-1)))+1,\"\")","v":""},""]
[{"$f":"IF($E423<>\"\",MAX($A$1:INDIRECT(CONCATENATE(\"$A$\",ROW()-1)))+1,\"\")","v":120},"C4.120",null,"Facebrick piers","m³",5]
[{"$f":"IF($E424<>\"\",MAX($A$1:INDIRECT(CONCATENATE(\"$A$\",ROW()-1)))+1,\"\")","v":""},""]
[{"$f":"IF($E425<>\"\",MAX($A$1:INDIRECT(CONCATENATE(\"$A$\",ROW()-1)))+1,\"\")","v":""},"",null,"Brick walls in Corobrick \"Corojem Red\" travertine FBX facebricks:"]
[{"$f":"IF($E426<>\"\",MAX($A$1:INDIRECT(CONCATENATE(\"$A$\",ROW()-1)))+1,\"\")","v":""},""]
[{"$f":"IF($E427<>\"\",MAX($A$1:INDIRECT(CONCATENATE(\"$A$\",ROW()-1)))+1,\"\")","v":121},"C4.121",null,"230 mm thick walls","m²",580,null,"Rate Only"]
[{"$f":"IF($E428<>\"\",MAX($A$1:INDIRECT(CONCATENATE(\"$A$\",ROW()-1)))+1,\"\")","v":""},""]
[{"$f":"IF($E429<>\"\",MAX($A$1:INDIRECT(CONCATENATE(\"$A$\",ROW()-1)))+1,\"\")","v":122},"C4.122",null,"280 mm thick walls","m²",825,null,"Rate Only"]
[{"$f":"IF($E430<>\"\",MAX($A$1:INDIRECT(CONCATENATE(\"$A$\",ROW()-1)))+1,\"\")","v":""},""]
[{"$f":"IF($E431<>\"\",MAX($A$1:INDIRECT(CONCATENATE(\"$A$\",ROW()-1)))+1,\"\")","v":123},"C4.123",null,"Facebrick piers","m³",5,null,"Rate Only"]
[]
[{"$f":"IF($E433<>\"\",MAX($A$1:INDIRECT(CONCATENATE(\"$A$\",ROW()-1)))+1,\"\")","v":""},{"$f":"IF(A433<>\"\",$A$3&A433,\"\")","v":""},11.02,"Plasterwork:",null,null,""]
[{"$f":"IF($E434<>\"\",MAX($A$1:INDIRECT(CONCATENATE(\"$A$\",ROW()-1)))+1,\"\")","v":""},""]
[{"$f":"IF($E435<>\"\",MAX($A$1:INDIRECT(CONCATENATE(\"$A$\",ROW()-1)))+1,\"\")","v":""},"",null,"15 mm thick, steel-float finish to:"]
[{"$f":"IF($E436<>\"\",MAX($A$1:INDIRECT(CONCATENATE(\"$A$\",ROW()-1)))+1,\"\")","v":""},""]
[{"$f":"IF($E437<>\"\",MAX($A$1:INDIRECT(CONCATENATE(\"$A$\",ROW()-1)))+1,\"\")","v":124},"C4.124",null,"Brick walls in drain trenches","m²",68,null,{"$f":"F437*G437","v":0}]
[{"$f":"IF($E438<>\"\",MAX($A$1:INDIRECT(CONCATENATE(\"$A$\",ROW()-1)))+1,\"\")","v":""},""]
[{"$f":"IF($E439<>\"\",MAX($A$1:INDIRECT(CONCATENATE(\"$A$\",ROW()-1)))+1,\"\")","v":""},"",11.03,"Floor or roof screeds:"]
[{"$f":"IF($E440<>\"\",MAX($A$1:INDIRECT(CONCATENATE(\"$A$\",ROW()-1)))+1,\"\")","v":""},""]
[{"$f":"IF($E441<>\"\",MAX($A$1:INDIRECT(CONCATENATE(\"$A$\",ROW()-1)))+1,\"\")","v":125},"C4.125",null,"100 mm thick screeds in top of cable trenches","m²",38,null,{"$f":"F441*G441","v":0}]
[{"$f":"IF($E442<>\"\",MAX($A$1:INDIRECT(CONCATENATE(\"$A$\",ROW()-1)))+1,\"\")","v":""},""]
[{"$f":"IF($E443<>\"\",MAX($A$1:INDIRECT(CONCATENATE(\"$A$\",ROW()-1)))+1,\"\")","v":""},"",11.04,"Waterproofing:"]
[{"$f":"IF($E444<>\"\",MAX($A$1:INDIRECT(CONCATENATE(\"$A$\",ROW()-1)))+1,\"\")","v":""},""]
[{"$f":"IF($E445<>\"\",MAX($A$1:INDIRECT(CONCATENATE(\"$A$\",ROW()-1)))+1,\"\")","v":126},"C4.126",null,"250 micron USB green waterproof sheeting, lapped with Brickgrip DPC and sealed with pressure-sensitive tape under surface beds","m²",59,null,{"$f":"F445*G445","v":0}]
[{"$f":"IF($E446<>\"\",MAX($A$1:INDIRECT(CONCATENATE(\"$A$\",ROW()-1)))+1,\"\")","v":""},""]
[{"$f":"IF($E447<>\"\",MAX($A$1:INDIRECT(CONCATENATE(\"$A$\",ROW()-1)))+1,\"\")","v":127},"C4.127",null,"375 micron Brikgrip damp-proof layer in walls","m²",30,null,{"$f":"F447*G447","v":0}]
[{"$f":"IF($E448<>\"\",MAX($A$1:INDIRECT(CONCATENATE(\"$A$\",ROW()-1)))+1,\"\")","v":""},""]
[{"$f":"IF($E449<>\"\",MAX($A$1:INDIRECT(CONCATENATE(\"$A$\",ROW()-1)))+1,\"\")","v":128},"C4.128",null,"One coat primer and one coat Sika Cemflex with waterproofing membrane as per manufacturer's specifications in drain trenches","m²",97]
[{"$f":"IF($E450<>\"\",MAX($A$1:INDIRECT(CONCATENATE(\"$A$\",ROW()-1)))+1,\"\")","v":""},""]
[{"$f":"IF($E451<>\"\",MAX($A$1:INDIRECT(CONCATENATE(\"$A$\",ROW()-1)))+1,\"\")","v":129},"C4.129",null,"4 mm thick \"Derbit SP-FR\" fully bonded torch-on waterproofing system on concrete roofs with a ten-year guarantee","m²",271]
[{"$f":"IF($E452<>\"\",MAX($A$1:INDIRECT(CONCATENATE(\"$A$\",ROW()-1)))+1,\"\")","v":""},""]
[]
[]
[]
[]
[]
[]
[]
[]
[]
[]
[]
[]
[null,null,null," Carried forward / …"]
[null,null,null," Brought forward / …"]
[]
[{"$f":"IF($E468<>\"\",MAX($A$1:INDIRECT(CONCATENATE(\"$A$\",ROW()-1)))+1,\"\")","v":""},"",11.05,"Doors and windows:"]
[{"$f":"IF($E469<>\"\",MAX($A$1:INDIRECT(CONCATENATE(\"$A$\",ROW()-1)))+1,\"\")","v":""},""]
[{"$f":"IF($E470<>\"\",MAX($A$1:INDIRECT(CONCATENATE(\"$A$\",ROW()-1)))+1,\"\")","v":""},"",null,"Refer to Drawing 106777-0502-DRG-CC-0333 for window and door schedules:"]
[{"$f":"IF($E471<>\"\",MAX($A$1:INDIRECT(CONCATENATE(\"$A$\",ROW()-1)))+1,\"\")","v":""},""]
[{"$f":"IF($E472<>\"\",MAX($A$1:INDIRECT(CONCATENATE(\"$A$\",ROW()-1)))+1,\"\")","v":""},"",null,"Roller shutter door by \"Serranda\" or similar approved, galvanized steel 1 mm thick solid slatted roller shutter doors with epoxy powder coat finish (olive green colour) including all necessary ironmongery, channel sections guides, canopy, T-bar, EPDM rubber weather seal (motorised with manual crankable override, anti-fall back safety brake and up/down switch control box):"]
[{"$f":"IF($E473<>\"\",MAX($A$1:INDIRECT(CONCATENATE(\"$A$\",ROW()-1)))+1,\"\")","v":""},""]
[{"$f":"IF($E474<>\"\",MAX($A$1:INDIRECT(CONCATENATE(\"$A$\",ROW()-1)))+1,\"\")","v":130},"C4.130",null,"Roller shutter door size 5 000 mm x \n4 500 mm high complete (D1, D2)","No",2]
[]
[{"$f":"IF($E476<>\"\",MAX($A$1:INDIRECT(CONCATENATE(\"$A$\",ROW()-1)))+1,\"\")","v":""},{"$f":"IF(A476<>\"\",$A$3&A476,\"\")","v":""},null,"Class D fire doors by \"Bitcon Industries\" or similar approved, finished with 2 coats of olive green colour enamel paint, including including all necessary ironmongery. "]
[{"$f":"IF($E477<>\"\",MAX($A$1:INDIRECT(CONCATENATE(\"$A$\",ROW()-1)))+1,\"\")","v":""},""]
[{"$f":"IF($E478<>\"\",MAX($A$1:INDIRECT(CONCATENATE(\"$A$\",ROW()-1)))+1,\"\")","v":131},"C4.131",null,"Double door size 1830 mm x 2 440 mm high (D6)","No",1,null,{"$f":"F478*G478","v":0}]
[{"$f":"IF($E479<>\"\",MAX($A$1:INDIRECT(CONCATENATE(\"$A$\",ROW()-1)))+1,\"\")","v":""},""]
[{"$f":"IF($E480<>\"\",MAX($A$1:INDIRECT(CONCATENATE(\"$A$\",ROW()-1)))+1,\"\")","v":132},"C4.132",null,"Single door size 900 mm x 2 032 mm high  (D7, D8, D11, D12)","No",4]
[{"$f":"IF($E481<>\"\",MAX($A$1:INDIRECT(CONCATENATE(\"$A$\",ROW()-1)))+1,\"\")","v":""},""]
[{"$f":"IF($E482<>\"\",MAX($A$1:INDIRECT(CONCATENATE(\"$A$\",ROW()-1)))+1,\"\")","v":""},"",null,"Purpose-made natural anodized aluminium door and frame with 6,38 mm clear laminated safety glass, , including including all necessary ironmongery. "]
[{"$f":"IF($E483<>\"\",MAX($A$1:INDIRECT(CONCATENATE(\"$A$\",ROW()-1)))+1,\"\")","v":""},""]
[{"$f":"IF($E484<>\"\",MAX($A$1:INDIRECT(CONCATENATE(\"$A$\",ROW()-1)))+1,\"\")","v":133},"C4.133",null,"Single door with half door panel size \n1 200 mm x 2 400 mm (D9)","No",1]
[{"$f":"IF($E485<>\"\",MAX($A$1:INDIRECT(CONCATENATE(\"$A$\",ROW()-1)))+1,\"\")","v":""},""]
[{"$f":"IF($E486<>\"\",MAX($A$1:INDIRECT(CONCATENATE(\"$A$\",ROW()-1)))+1,\"\")","v":""},"","PS 6.01","Security interlock system doors, type TDL\nor similar approved with epoxy finish (olive green colour) and 3CR12 door frames as per \nmanufacturer's detail, including all \nnecessary ironmongery:"]
[{"$f":"IF($E487<>\"\",MAX($A$1:INDIRECT(CONCATENATE(\"$A$\",ROW()-1)))+1,\"\")","v":""},""]
[{"$f":"IF($E488<>\"\",MAX($A$1:INDIRECT(CONCATENATE(\"$A$\",ROW()-1)))+1,\"\")","v":134},"C4.134",null,"Single door size 900 mm x 2 100 mm high \n(D3)","No",1,null,{"$f":"F488*G488","v":0}]
[{"$f":"IF($E489<>\"\",MAX($A$1:INDIRECT(CONCATENATE(\"$A$\",ROW()-1)))+1,\"\")","v":""},""]
[{"$f":"IF($E490<>\"\",MAX($A$1:INDIRECT(CONCATENATE(\"$A$\",ROW()-1)))+1,\"\")","v":135},"C4.135",null,"Double door size 1 830 mm x 2 440 mm high (D4)","No",1,null,{"$f":"F490*G490","v":0}]
[{"$f":"IF($E491<>\"\",MAX($A$1:INDIRECT(CONCATENATE(\"$A$\",ROW()-1)))+1,\"\")","v":""},""]
[{"$f":"IF($E492<>\"\",MAX($A$1:INDIRECT(CONCATENATE(\"$A$\",ROW()-1)))+1,\"\")","v":136},"C4.136",null,"Double door size 1 830 mm x 3 500 mm high (D5)","No",1,null,{"$f":"F492*G492","v":0}]
[]
[]
[null,null,null," Carried forward / …"]
[null,null,null," Brought forward / …"]
[]
[{"$f":"IF($E498<>\"\",MAX($A$1:INDIRECT(CONCATENATE(\"$A$\",ROW()-1)))+1,\"\")","v":""},{"$f":"IF(A498<>\"\",$A$3&A498,\"\")","v":""},null,"Galvanized mild-steel security fencing, gates and frames formed of steel profiles with 2 coats of enamel paint (olive green colour), complete with all heavy-duty ironmongery, security locking system, frames, etc. as shown on drawing 106777-0502-DRG-CC-0334:"]
[{"$f":"IF($E499<>\"\",MAX($A$1:INDIRECT(CONCATENATE(\"$A$\",ROW()-1)))+1,\"\")","v":""},""]
[{"$f":"IF($E500<>\"\",MAX($A$1:INDIRECT(CONCATENATE(\"$A$\",ROW()-1)))+1,\"\")","v":137},"C4.137",null,"Fence panel with single gate to suit opening 1 500 mm x 4 850 mm with gate size 1 000 mm x 2 100 mm high (SG3)","No",1]
[{"$f":"IF($E501<>\"\",MAX($A$1:INDIRECT(CONCATENATE(\"$A$\",ROW()-1)))+1,\"\")","v":""},""]
[{"$f":"IF($E502<>\"\",MAX($A$1:INDIRECT(CONCATENATE(\"$A$\",ROW()-1)))+1,\"\")","v":138},"C4.138",null,"Double gate to suit opening size 3 100 x 4 300 mm high (SG1, SG2)","No",2]
[{"$f":"IF($E503<>\"\",MAX($A$1:INDIRECT(CONCATENATE(\"$A$\",ROW()-1)))+1,\"\")","v":""},""]
[{"$f":"IF($E504<>\"\",MAX($A$1:INDIRECT(CONCATENATE(\"$A$\",ROW()-1)))+1,\"\")","v":139},"C4.139",null,"Purpose-made natural anodised aluminium louvres complete with frame for 230 mm wall, insect screen, etc. for opening size 400 mm x 400 mm","No",4]
[]
[{"$f":"IF($E506<>\"\",MAX($A$1:INDIRECT(CONCATENATE(\"$A$\",ROW()-1)))+1,\"\")","v":""},{"$f":"IF(A506<>\"\",$A$3&A506,\"\")","v":""},null,"Purpose-made natural anodized aluminium window shopfront with 6,38 mm clear laminated safety glass:"]
[{"$f":"IF($E507<>\"\",MAX($A$1:INDIRECT(CONCATENATE(\"$A$\",ROW()-1)))+1,\"\")","v":""},""]
[{"$f":"IF($E508<>\"\",MAX($A$1:INDIRECT(CONCATENATE(\"$A$\",ROW()-1)))+1,\"\")","v":140},"C4.140",null,"Window fronpfront size 3 660 mm x 3 200 mm high and 1200 mm x 800 mm, fixed panels (W1)","No",1,null,{"$f":"F508*G508","v":0}]
[{"$f":"IF($E509<>\"\",MAX($A$1:INDIRECT(CONCATENATE(\"$A$\",ROW()-1)))+1,\"\")","v":""},""]
[{"$f":"IF($E510<>\"\",MAX($A$1:INDIRECT(CONCATENATE(\"$A$\",ROW()-1)))+1,\"\")","v":141},"C4.141",null,"Window fronpfront size 1 240 mm x 3 200 mm high, fixed panels (W2)","No",1]
[{"$f":"IF($E511<>\"\",MAX($A$1:INDIRECT(CONCATENATE(\"$A$\",ROW()-1)))+1,\"\")","v":""},""]
[{"$f":"IF($E512<>\"\",MAX($A$1:INDIRECT(CONCATENATE(\"$A$\",ROW()-1)))+1,\"\")","v":""},"",11.08,"Joinery:"]
[{"$f":"IF($E513<>\"\",MAX($A$1:INDIRECT(CONCATENATE(\"$A$\",ROW()-1)))+1,\"\")","v":""},""]
[{"$f":"IF($E514<>\"\",MAX($A$1:INDIRECT(CONCATENATE(\"$A$\",ROW()-1)))+1,\"\")","v":""},"",null,"Items measured by number:"]
[{"$f":"IF($E515<>\"\",MAX($A$1:INDIRECT(CONCATENATE(\"$A$\",ROW()-1)))+1,\"\")","v":""},""]
[{"$f":"IF($E516<>\"\",MAX($A$1:INDIRECT(CONCATENATE(\"$A$\",ROW()-1)))+1,\"\")","v":142},"C4.142",null,"Single door 813 mm x 2 032 mm solid Swartland hardwood panel door with 86 mm x 53 mm hardwood frame, including all neccesary ironmongery and sealant (D10)","No",1,null,{"$f":"F516*G516","v":0}]
[{"$f":"IF($E517<>\"\",MAX($A$1:INDIRECT(CONCATENATE(\"$A$\",ROW()-1)))+1,\"\")","v":""},""]
[{"$f":"IF($E518<>\"\",MAX($A$1:INDIRECT(CONCATENATE(\"$A$\",ROW()-1)))+1,\"\")","v":""},"",11.1,"Plumbing and drainage, complete with taps, seats, traps, connections, etc. (refer to materials specifications):"]
[{"$f":"IF($E519<>\"\",MAX($A$1:INDIRECT(CONCATENATE(\"$A$\",ROW()-1)))+1,\"\")","v":""},""]
[{"$f":"IF($E520<>\"\",MAX($A$1:INDIRECT(CONCATENATE(\"$A$\",ROW()-1)))+1,\"\")","v":143},"C4.143",null,"\"Vaal Tuscany\" water closet and cistern","No",1]
[{"$f":"IF($E521<>\"\",MAX($A$1:INDIRECT(CONCATENATE(\"$A$\",ROW()-1)))+1,\"\")","v":""},""]
[{"$f":"IF($E522<>\"\",MAX($A$1:INDIRECT(CONCATENATE(\"$A$\",ROW()-1)))+1,\"\")","v":144},"C4.144",null,"\"Vaal Tuscany\" wall-mounted basin","No",1]
[{"$f":"IF($E523<>\"\",MAX($A$1:INDIRECT(CONCATENATE(\"$A$\",ROW()-1)))+1,\"\")","v":""},""]
[{"$f":"IF($E524<>\"\",MAX($A$1:INDIRECT(CONCATENATE(\"$A$\",ROW()-1)))+1,\"\")","v":145},"C4.145",null,"\"Latis LA-951\" single-lever basin mixer","No",1]
[{"$f":"IF($E525<>\"\",MAX($A$1:INDIRECT(CONCATENATE(\"$A$\",ROW()-1)))+1,\"\")","v":""},""]
[{"$f":"IF($E526<>\"\",MAX($A$1:INDIRECT(CONCATENATE(\"$A$\",ROW()-1)))+1,\"\")","v":146},"C4.146",null,"Fire hose reel with 30 m hose complete with nozzle, shut-off valve, pipework, etc.","No",3]
[]
[]
[]
[null,null,null," Carried forward / …"]
[null,null,null," Brought forward / …"]
[]
[{"$f":"IF($E533<>\"\",MAX($A$1:INDIRECT(CONCATENATE(\"$A$\",ROW()-1)))+1,\"\")","v":147},"C4.147",null,"100 mm diameter cast iron full bore roof outlet, including SSN coupling to uPVC pipe","No",5]
[{"$f":"IF($E534<>\"\",MAX($A$1:INDIRECT(CONCATENATE(\"$A$\",ROW()-1)))+1,\"\")","v":""},""]
[{"$f":"IF($E535<>\"\",MAX($A$1:INDIRECT(CONCATENATE(\"$A$\",ROW()-1)))+1,\"\")","v":148},"C4.148",null,"110 mm diameter heavy-duty uPVC rainwater downpipes cast into concrete columns","m",23]
[{"$f":"IF($E536<>\"\",MAX($A$1:INDIRECT(CONCATENATE(\"$A$\",ROW()-1)))+1,\"\")","v":""},""]
[{"$f":"IF($E537<>\"\",MAX($A$1:INDIRECT(CONCATENATE(\"$A$\",ROW()-1)))+1,\"\")","v":149},"C4.149",null,"Extra over 110 mm uPVC downpipe for bend or elbow","No",10]
[{"$f":"IF($E538<>\"\",MAX($A$1:INDIRECT(CONCATENATE(\"$A$\",ROW()-1)))+1,\"\")","v":""},""]
[{"$f":"IF($E539<>\"\",MAX($A$1:INDIRECT(CONCATENATE(\"$A$\",ROW()-1)))+1,\"\")","v":150},"C4.150",null,"Waste pipework for 2 sanitary fittings or points, including all bends etc., up to and including gulley or in ground up to 1 m from building, including all stub-stacks, two-way vent valves, etc.","Sum",1]
[{"$f":"IF($E540<>\"\",MAX($A$1:INDIRECT(CONCATENATE(\"$A$\",ROW()-1)))+1,\"\")","v":""},""]
[{"$f":"IF($E541<>\"\",MAX($A$1:INDIRECT(CONCATENATE(\"$A$\",ROW()-1)))+1,\"\")","v":151},"C4.151",null,"Cold water pipework reticulation built into walls from 1 m outside building to 2 sanitary fittings or water points, including all bends, etc.","Sum",1]
[{"$f":"IF($E542<>\"\",MAX($A$1:INDIRECT(CONCATENATE(\"$A$\",ROW()-1)))+1,\"\")","v":""},""]
[{"$f":"IF($E543<>\"\",MAX($A$1:INDIRECT(CONCATENATE(\"$A$\",ROW()-1)))+1,\"\")","v":152},"C4.152",null,"Fire water pipework reticulation to 3 fire hose reels, including all bends, etc. (from connection point on outside of external wall up to fire hose reel)","Sum",1]
[{"$f":"IF($E544<>\"\",MAX($A$1:INDIRECT(CONCATENATE(\"$A$\",ROW()-1)))+1,\"\")","v":""},""]
[{"$f":"IF($E545<>\"\",MAX($A$1:INDIRECT(CONCATENATE(\"$A$\",ROW()-1)))+1,\"\")","v":""},"",11.11,"Painting:"]
[{"$f":"IF($E546<>\"\",MAX($A$1:INDIRECT(CONCATENATE(\"$A$\",ROW()-1)))+1,\"\")","v":""},""]
[{"$f":"IF($E547<>\"\",MAX($A$1:INDIRECT(CONCATENATE(\"$A$\",ROW()-1)))+1,\"\")","v":""},"",null,"\"Sikafloor 263 ZA\" broad cast system trowel applied to a 4 mm thickness on primer with base layer, including casting into panels and installing 1,5 mm x 9 mm natural anodised aluminium strips with necessary sealant in joints, all in accordance with the manufacturer's specifications applied by an approved applicator inclusive of \"SIKA\" supervision, guarantee, etc. (type 1 floor finish):"]
[{"$f":"IF($E548<>\"\",MAX($A$1:INDIRECT(CONCATENATE(\"$A$\",ROW()-1)))+1,\"\")","v":""},""]
[{"$f":"IF($E549<>\"\",MAX($A$1:INDIRECT(CONCATENATE(\"$A$\",ROW()-1)))+1,\"\")","v":153},"C4.153",null,"On floors and plinths","m²",1205]
[{"$f":"IF($E550<>\"\",MAX($A$1:INDIRECT(CONCATENATE(\"$A$\",ROW()-1)))+1,\"\")","v":""},""]
[{"$f":"IF($E551<>\"\",MAX($A$1:INDIRECT(CONCATENATE(\"$A$\",ROW()-1)))+1,\"\")","v":""},"",null,"One coat wood primer and three coats exterior gloss wood sealant (clear):"]
[{"$f":"IF($E552<>\"\",MAX($A$1:INDIRECT(CONCATENATE(\"$A$\",ROW()-1)))+1,\"\")","v":""},""]
[{"$f":"IF($E553<>\"\",MAX($A$1:INDIRECT(CONCATENATE(\"$A$\",ROW()-1)))+1,\"\")","v":154},"C4.154",null,"Timber doors and frames","m²",4]
[{"$f":"IF($E554<>\"\",MAX($A$1:INDIRECT(CONCATENATE(\"$A$\",ROW()-1)))+1,\"\")","v":""},""]
[{"$f":"IF($E555<>\"\",MAX($A$1:INDIRECT(CONCATENATE(\"$A$\",ROW()-1)))+1,\"\")","v":""},"",11.12,"Miscellaneous items:"]
[{"$f":"IF($E556<>\"\",MAX($A$1:INDIRECT(CONCATENATE(\"$A$\",ROW()-1)))+1,\"\")","v":""},""]
[{"$f":"IF($E557<>\"\",MAX($A$1:INDIRECT(CONCATENATE(\"$A$\",ROW()-1)))+1,\"\")","v":""},"",null,"Items measured by number:"]
[{"$f":"IF($E558<>\"\",MAX($A$1:INDIRECT(CONCATENATE(\"$A$\",ROW()-1)))+1,\"\")","v":""},""]
[{"$f":"IF($E559<>\"\",MAX($A$1:INDIRECT(CONCATENATE(\"$A$\",ROW()-1)))+1,\"\")","v":155},"C4.155",null,"30 mm x 1,2 mm strap 800 mm long with one end fixed to concrete with two Hilti HPS-1 6/5 anchors per strap and other end built into brickwork","No",2590]
[]
[null,null,null," Carried forward / …"]
[null,null,null," Brought forward / …"]
[]
[{"$f":"IF($E564<>\"\",MAX($A$1:INDIRECT(CONCATENATE(\"$A$\",ROW()-1)))+1,\"\")","v":156},"C4.156",null,"110 mm diameter x 300 mm long uPVC sleeve cast into concrete slab","No",77]
[{"$f":"IF($E565<>\"\",MAX($A$1:INDIRECT(CONCATENATE(\"$A$\",ROW()-1)))+1,\"\")","v":""},""]
[{"$f":"IF($E566<>\"\",MAX($A$1:INDIRECT(CONCATENATE(\"$A$\",ROW()-1)))+1,\"\")","v":157},"C4.157",null,"Coring through slabs 150 mm diameter x 300 mm deep","No",2]
[{"$f":"IF($E567<>\"\",MAX($A$1:INDIRECT(CONCATENATE(\"$A$\",ROW()-1)))+1,\"\")","v":""},""]
[{"$f":"IF($E568<>\"\",MAX($A$1:INDIRECT(CONCATENATE(\"$A$\",ROW()-1)))+1,\"\")","v":158},"C4.158",null,"345 mm x 345 mm precast concrete pyramid-shaped coping on top of buck pier","No",7]
[{"$f":"IF($E569<>\"\",MAX($A$1:INDIRECT(CONCATENATE(\"$A$\",ROW()-1)))+1,\"\")","v":""},""]
[{"$f":"IF($E570<>\"\",MAX($A$1:INDIRECT(CONCATENATE(\"$A$\",ROW()-1)))+1,\"\")","v":159},{"$f":"IF(A570<>\"\",$A$3&A570,\"\")","v":"C4.159"},null,"5 kg CO2 fire extinguisher","No",1]
[{"$f":"IF($E571<>\"\",MAX($A$1:INDIRECT(CONCATENATE(\"$A$\",ROW()-1)))+1,\"\")","v":""},"",null,null,null,null,null,{"$f":"F571*G571","v":0}]
[{"$f":"IF($E572<>\"\",MAX($A$1:INDIRECT(CONCATENATE(\"$A$\",ROW()-1)))+1,\"\")","v":160},"C4.160",null,"9 kg DCP fire extinguisher","No",2]
[{"$f":"IF($E573<>\"\",MAX($A$1:INDIRECT(CONCATENATE(\"$A$\",ROW()-1)))+1,\"\")","v":""},"",null,null,null,null,null,{"$f":"F573*G573","v":0}]
[{"$f":"IF($E574<>\"\",MAX($A$1:INDIRECT(CONCATENATE(\"$A$\",ROW()-1)))+1,\"\")","v":""},"",null,"Standard photo luminescent safety signs:"]
[{"$f":"IF($E575<>\"\",MAX($A$1:INDIRECT(CONCATENATE(\"$A$\",ROW()-1)))+1,\"\")","v":""},""]
[{"$f":"IF($E576<>\"\",MAX($A$1:INDIRECT(CONCATENATE(\"$A$\",ROW()-1)))+1,\"\")","v":161},"C4.161",null,"Code F4, 190 mm high fixed to walls","No",3]
[{"$f":"IF($E577<>\"\",MAX($A$1:INDIRECT(CONCATENATE(\"$A$\",ROW()-1)))+1,\"\")","v":""},"",null,null,null,null,null,{"$f":"F577*G577","v":0}]
[{"$f":"IF($E578<>\"\",MAX($A$1:INDIRECT(CONCATENATE(\"$A$\",ROW()-1)))+1,\"\")","v":162},"C4.162",null,"Code F6, 190 mm high fixed to walkway","No",3]
[{"$f":"IF($E579<>\"\",MAX($A$1:INDIRECT(CONCATENATE(\"$A$\",ROW()-1)))+1,\"\")","v":""},"",null,null,null,null,null,{"$f":"F579*G579","v":0}]
[{"$f":"IF($E580<>\"\",MAX($A$1:INDIRECT(CONCATENATE(\"$A$\",ROW()-1)))+1,\"\")","v":163},"C4.163",null,"Code F45, 190 mm high fixed above doors","No",2]
[{"$f":"IF($E581<>\"\",MAX($A$1:INDIRECT(CONCATENATE(\"$A$\",ROW()-1)))+1,\"\")","v":""},"",null,null,null,null,null,{"$f":"F581*G581","v":0}]
[{"$f":"IF($E582<>\"\",MAX($A$1:INDIRECT(CONCATENATE(\"$A$\",ROW()-1)))+1,\"\")","v":164},"C4.164",null,"Code E2, 190 mm high fixed to walls","No",2]
[{"$f":"IF($E583<>\"\",MAX($A$1:INDIRECT(CONCATENATE(\"$A$\",ROW()-1)))+1,\"\")","v":""},"",null,null,null,null,null,{"$f":"F583*G583","v":0}]
[{"$f":"IF($E584<>\"\",MAX($A$1:INDIRECT(CONCATENATE(\"$A$\",ROW()-1)))+1,\"\")","v":165},"C4.165",null,"Code E2, 190 mm high fixed to walkway","No",2]
[{"$f":"IF($E585<>\"\",MAX($A$1:INDIRECT(CONCATENATE(\"$A$\",ROW()-1)))+1,\"\")","v":""},"",null,null,null,null,null,{"$f":"F585*G585","v":0}]
[{"$f":"IF($E586<>\"\",MAX($A$1:INDIRECT(CONCATENATE(\"$A$\",ROW()-1)))+1,\"\")","v":""},"",null,"Sanitary accessories:"]
[]
[{"$f":"IF($E588<>\"\",MAX($A$1:INDIRECT(CONCATENATE(\"$A$\",ROW()-1)))+1,\"\")","v":166},"C4.166",null,"Cobra AC-0905-100 toilet roll holder","No",1,null,{"$f":"F588*G588","v":0}]
[{"$f":"IF($E589<>\"\",MAX($A$1:INDIRECT(CONCATENATE(\"$A$\",ROW()-1)))+1,\"\")","v":""},""]
[{"$f":"IF($E590<>\"\",MAX($A$1:INDIRECT(CONCATENATE(\"$A$\",ROW()-1)))+1,\"\")","v":167},"C4.167",null,"\"KIMBERLY-CLARK\" Aquarius Regular Reflex Paper Dispenser (code PRD-6959000) or similar approved, wheel suitable for 300 m paper roll (colour: white)","No",1,null,{"$f":"F590*G590","v":0}]
[{"$f":"IF($E591<>\"\",MAX($A$1:INDIRECT(CONCATENATE(\"$A$\",ROW()-1)))+1,\"\")","v":""},""]
[{"$f":"IF($E592<>\"\",MAX($A$1:INDIRECT(CONCATENATE(\"$A$\",ROW()-1)))+1,\"\")","v":168},"C4.168",null,"\"KIMBERLY-CLARK\" Aquarius Wall Bin (code: WBP-6993000-1) or similar approved,  43 litre plastic, surface-mounted wall bin (colour: white)","No",1,null,{"$f":"F592*G592","v":0}]
[{"$f":"IF($E593<>\"\",MAX($A$1:INDIRECT(CONCATENATE(\"$A$\",ROW()-1)))+1,\"\")","v":""},""]
[{"$f":"IF($E594<>\"\",MAX($A$1:INDIRECT(CONCATENATE(\"$A$\",ROW()-1)))+1,\"\")","v":169},"C4.169",null,"4 mm thick glass mirror size 450 mm x        600 mm high, plugged to walls","No",1,null,{"$f":"F594*G594","v":0}]
[{"$f":"IF($E595<>\"\",MAX($A$1:INDIRECT(CONCATENATE(\"$A$\",ROW()-1)))+1,\"\")","v":""},""]
[{"$f":"IF($E596<>\"\",MAX($A$1:INDIRECT(CONCATENATE(\"$A$\",ROW()-1)))+1,\"\")","v":""},"",null,"Office furniture:"]
[{"$f":"IF($E597<>\"\",MAX($A$1:INDIRECT(CONCATENATE(\"$A$\",ROW()-1)))+1,\"\")","v":""},""]
[{"$f":"IF($E598<>\"\",MAX($A$1:INDIRECT(CONCATENATE(\"$A$\",ROW()-1)))+1,\"\")","v":170},"C4.170",null,"\"Workstation\" Slimline 1 800 x 900 mm desk with 1 200 x 600 mm credenza L combination, including vanity front board or similar approved. Vancouver Maple melamine 50 x 2 mm top and \n100 x 100 mm designer leg in black","No",1,null,{"$f":"F598*G598","v":0}]
[null,null,null," "]
[]
[]
[null,null,null," Carried forward / …"]
[null,null,null," Brought forward / …"]
[]
[{"$f":"IF($E605<>\"\",MAX($A$1:INDIRECT(CONCATENATE(\"$A$\",ROW()-1)))+1,\"\")","v":171},"C4.171",null,"Vancouver Maple melamine 1 500 x 800 \nx 450 mm 4-tier bookcase by \"Workstation\" or similar approved","No",1,null,{"$f":"F605*G605","v":0}]
[{"$f":"IF($E606<>\"\",MAX($A$1:INDIRECT(CONCATENATE(\"$A$\",ROW()-1)))+1,\"\")","v":""},""]
[{"$f":"IF($E607<>\"\",MAX($A$1:INDIRECT(CONCATENATE(\"$A$\",ROW()-1)))+1,\"\")","v":172},"C4.172",null,"Barrier mid back chairs, black colour by \"Workstation\" or similar approved","No",1,null,{"$f":"F607*G607","v":0}]
[{"$f":"IF($E608<>\"\",MAX($A$1:INDIRECT(CONCATENATE(\"$A$\",ROW()-1)))+1,\"\")","v":""},""]
[{"$f":"IF($E609<>\"\",MAX($A$1:INDIRECT(CONCATENATE(\"$A$\",ROW()-1)))+1,\"\")","v":173},"C4.173",null,"Barrier visitor chairs, black colour by \"Workstation\" or similar approved","No",2,null,{"$f":"F609*G609","v":0}]
[{"$f":"IF($E610<>\"\",MAX($A$1:INDIRECT(CONCATENATE(\"$A$\",ROW()-1)))+1,\"\")","v":""},""]
[{"$f":"IF($E611<>\"\",MAX($A$1:INDIRECT(CONCATENATE(\"$A$\",ROW()-1)))+1,\"\")","v":""},"",null,"Items measured by area:",null,null,""]
[{"$f":"IF($E612<>\"\",MAX($A$1:INDIRECT(CONCATENATE(\"$A$\",ROW()-1)))+1,\"\")","v":""},"",null,null,null,null,""]
[{"$f":"IF($E613<>\"\",MAX($A$1:INDIRECT(CONCATENATE(\"$A$\",ROW()-1)))+1,\"\")","v":""},"",null,"Ant poison, aldrin emulsifiable concentrates solution to SANS 618 spread at a rate recommended by the manufacturer:"]
[{"$f":"IF($E614<>\"\",MAX($A$1:INDIRECT(CONCATENATE(\"$A$\",ROW()-1)))+1,\"\")","v":""},""]
[{"$f":"IF($E615<>\"\",MAX($A$1:INDIRECT(CONCATENATE(\"$A$\",ROW()-1)))+1,\"\")","v":174},"C4.174",null,"Under jockey floor slab","m²",49,null,{"$f":"F615*G615","v":0}]
[{"$f":"IF($E616<>\"\",MAX($A$1:INDIRECT(CONCATENATE(\"$A$\",ROW()-1)))+1,\"\")","v":""},""]
[{"$f":"IF($E617<>\"\",MAX($A$1:INDIRECT(CONCATENATE(\"$A$\",ROW()-1)))+1,\"\")","v":""},"",null,"200 mm x 200 mm white ceramic glazed"]
[{"$f":"IF($E618<>\"\",MAX($A$1:INDIRECT(CONCATENATE(\"$A$\",ROW()-1)))+1,\"\")","v":175},"C4.175",null,"wall tiles in splash backs","m²",1,null,{"$f":"F618*G618","v":0}]
[{"$f":"IF($E619<>\"\",MAX($A$1:INDIRECT(CONCATENATE(\"$A$\",ROW()-1)))+1,\"\")","v":""},""]
[]
[]
[]
[]
[]
[]
[]
[]
[]
[]
[]
[]
[]
[]
[]
[]
[]
[]
[]
[]
[]
[]
[]
[]
[]
[]
[]
[]
[]
[]
[]
[]
[{"$f":"IF($E652<>\"\",MAX($A$1:INDIRECT(CONCATENATE(\"$A$\",ROW()-1)))+1,\"\")","v":""},{"$f":"IF(A652<>\"\",$A$3&A652,\"\")","v":""}]
[{"$f":"IF($E653<>\"\",MAX($A$1:INDIRECT(CONCATENATE(\"$A$\",ROW()-1)))+1,\"\")","v":""},null,null," TOTAL SECTION C4\n Carried to Summary",null,null,"R"]

{"sheet":"Section C5","index":8,"n_rows":329,"n_cols":8,"rows_kept":329,"cut":false,"hidden":false,"merged":[]}
["Item No","Item No","Payment Clause","Short Description","Unit","Quantity","Rate","Amount\n R             c"]
[]
["C5.",null,"SANS","SECTION: C5"]
[null,null,1200,"5Ml RESERVOIR"]
[]
[null,null,"DWS 0750","WATER RETAINING CONCRETE"]
[]
[null,null,15.3,"SCHEDULED FORMWORK ITEMS"]
[]
[{"$f":"IF($E10<>\"\",MAX($A$1:INDIRECT(CONCATENATE(\"$A$\",ROW()-1)))+1,\"\")","v":""},{"$f":"IF(A10<>\"\",$A$3&A10,\"\")","v":""},15.3,"Rough:"]
[{"$f":"IF($E11<>\"\",MAX($A$1:INDIRECT(CONCATENATE(\"$A$\",ROW()-1)))+1,\"\")","v":""},""]
[{"$f":"IF($E12<>\"\",MAX($A$1:INDIRECT(CONCATENATE(\"$A$\",ROW()-1)))+1,\"\")","v":""},"",null,"Vertical formwork to:"]
[{"$f":"IF($E13<>\"\",MAX($A$1:INDIRECT(CONCATENATE(\"$A$\",ROW()-1)))+1,\"\")","v":""},""]
[{"$f":"IF($E14<>\"\",MAX($A$1:INDIRECT(CONCATENATE(\"$A$\",ROW()-1)))+1,\"\")","v":1},"C5.1",null,"External face of reservoir footing, circular in plan, with radius 18,700 m","m2",50]
[{"$f":"IF($E15<>\"\",MAX($A$1:INDIRECT(CONCATENATE(\"$A$\",ROW()-1)))+1,\"\")","v":""},""]
[{"$f":"IF($E16<>\"\",MAX($A$1:INDIRECT(CONCATENATE(\"$A$\",ROW()-1)))+1,\"\")","v":2},"C5.2",null,"Vertical faces to mass concrete encasements under reservoir floor and footing","m2",120]
[{"$f":"IF($E17<>\"\",MAX($A$1:INDIRECT(CONCATENATE(\"$A$\",ROW()-1)))+1,\"\")","v":""},""]
[{"$f":"IF($E18<>\"\",MAX($A$1:INDIRECT(CONCATENATE(\"$A$\",ROW()-1)))+1,\"\")","v":3},"C5.3",null,"Reservoir outlet sump walls, external face","m2",16]
[{"$f":"IF($E19<>\"\",MAX($A$1:INDIRECT(CONCATENATE(\"$A$\",ROW()-1)))+1,\"\")","v":""},""]
[{"$f":"IF($E20<>\"\",MAX($A$1:INDIRECT(CONCATENATE(\"$A$\",ROW()-1)))+1,\"\")","v":4},"C5.4",null,"Sides of subsurface drain trenches due to overbreak","m2",180]
[{"$f":"IF($E21<>\"\",MAX($A$1:INDIRECT(CONCATENATE(\"$A$\",ROW()-1)))+1,\"\")","v":""},""]
[{"$f":"IF($E22<>\"\",MAX($A$1:INDIRECT(CONCATENATE(\"$A$\",ROW()-1)))+1,\"\")","v":""},"",15.3,"Smooth (off-form):"]
[{"$f":"IF($E23<>\"\",MAX($A$1:INDIRECT(CONCATENATE(\"$A$\",ROW()-1)))+1,\"\")","v":""},""]
[{"$f":"IF($E24<>\"\",MAX($A$1:INDIRECT(CONCATENATE(\"$A$\",ROW()-1)))+1,\"\")","v":""},"",null,"Vertical formwork to:"]
[{"$f":"IF($E25<>\"\",MAX($A$1:INDIRECT(CONCATENATE(\"$A$\",ROW()-1)))+1,\"\")","v":""},""]
[{"$f":"IF($E26<>\"\",MAX($A$1:INDIRECT(CONCATENATE(\"$A$\",ROW()-1)))+1,\"\")","v":5},"C5.5",null,"Reservoir column footings, square in plan 250 mm high","m2",36]
[{"$f":"IF($E27<>\"\",MAX($A$1:INDIRECT(CONCATENATE(\"$A$\",ROW()-1)))+1,\"\")","v":""},""]
[{"$f":"IF($E28<>\"\",MAX($A$1:INDIRECT(CONCATENATE(\"$A$\",ROW()-1)))+1,\"\")","v":6},"C5.6",null,"Access opening in slab, 420 mm high","m2",5]
[{"$f":"IF($E29<>\"\",MAX($A$1:INDIRECT(CONCATENATE(\"$A$\",ROW()-1)))+1,\"\")","v":""},""]
[{"$f":"IF($E30<>\"\",MAX($A$1:INDIRECT(CONCATENATE(\"$A$\",ROW()-1)))+1,\"\")","v":7},"C5.7",null,"Reservoir columns 350mm dia","m2",135]
[{"$f":"IF($E31<>\"\",MAX($A$1:INDIRECT(CONCATENATE(\"$A$\",ROW()-1)))+1,\"\")","v":""},""]
[{"$f":"IF($E32<>\"\",MAX($A$1:INDIRECT(CONCATENATE(\"$A$\",ROW()-1)))+1,\"\")","v":8},"C5.8",null,"Reservoir wall, internal face, circular in plan with radius 18,000 m","m2",620]
[{"$f":"IF($E33<>\"\",MAX($A$1:INDIRECT(CONCATENATE(\"$A$\",ROW()-1)))+1,\"\")","v":""},""]
[{"$f":"IF($E34<>\"\",MAX($A$1:INDIRECT(CONCATENATE(\"$A$\",ROW()-1)))+1,\"\")","v":9},"C5.9",null,"Reservoir wall, external face, circular in plan with radius 18,300 m","m2",630]
[{"$f":"IF($E35<>\"\",MAX($A$1:INDIRECT(CONCATENATE(\"$A$\",ROW()-1)))+1,\"\")","v":""},""]
[{"$f":"IF($E36<>\"\",MAX($A$1:INDIRECT(CONCATENATE(\"$A$\",ROW()-1)))+1,\"\")","v":10},"C5.10",null,"Reservoir roof, external face of slab, 250mm high, circular in plan with radius 18,300 m","m2",30]
[{"$f":"IF($E37<>\"\",MAX($A$1:INDIRECT(CONCATENATE(\"$A$\",ROW()-1)))+1,\"\")","v":""},""]
[{"$f":"IF($E38<>\"\",MAX($A$1:INDIRECT(CONCATENATE(\"$A$\",ROW()-1)))+1,\"\")","v":11},"C5.11",null,"Reservoir column heads, square in plan 400 mm high","m2",45]
[{"$f":"IF($E39<>\"\",MAX($A$1:INDIRECT(CONCATENATE(\"$A$\",ROW()-1)))+1,\"\")","v":""},""]
[{"$f":"IF($E40<>\"\",MAX($A$1:INDIRECT(CONCATENATE(\"$A$\",ROW()-1)))+1,\"\")","v":12},"C5.12",null,"Reservoir outlet sump walls, internal face","m2",11]
[]
[{"$f":"IF($E42<>\"\",MAX($A$1:INDIRECT(CONCATENATE(\"$A$\",ROW()-1)))+1,\"\")","v":""},null,null,"Horizontal formwork to:"]
[{"$f":"IF($E43<>\"\",MAX($A$1:INDIRECT(CONCATENATE(\"$A$\",ROW()-1)))+1,\"\")","v":""}]
[{"$f":"IF($E44<>\"\",MAX($A$1:INDIRECT(CONCATENATE(\"$A$\",ROW()-1)))+1,\"\")","v":13},{"$f":"IF(A44<>\"\",$A$3&A44,\"\")","v":"C5.13"},null,"Reservoir roof soffit (with 120mm fall from centre to perimeter)","m2",1020]
[{"$f":"IF($E45<>\"\",MAX($A$1:INDIRECT(CONCATENATE(\"$A$\",ROW()-1)))+1,\"\")","v":""},""]
[{"$f":"IF($E46<>\"\",MAX($A$1:INDIRECT(CONCATENATE(\"$A$\",ROW()-1)))+1,\"\")","v":14},"C5.14",null,"Reservoir column head soffits","m2",32]
[]
[{"$f":"IF($E48<>\"\",MAX($A$1:INDIRECT(CONCATENATE(\"$A$\",ROW()-1)))+1,\"\")","v":""},{"$f":"IF(A48<>\"\",$A$3&A48,\"\")","v":""},null," Carried forward / …"]
[{"$f":"IF($E49<>\"\",MAX($A$1:INDIRECT(CONCATENATE(\"$A$\",ROW()-1)))+1,\"\")","v":""},"",null," Brought forward / …"]
[]
[{"$f":"IF($E51<>\"\",MAX($A$1:INDIRECT(CONCATENATE(\"$A$\",ROW()-1)))+1,\"\")","v":""},"",15.3,"Narrow widths (up to 300mm wide):"]
[{"$f":"IF($E52<>\"\",MAX($A$1:INDIRECT(CONCATENATE(\"$A$\",ROW()-1)))+1,\"\")","v":""},""]
[{"$f":"IF($E53<>\"\",MAX($A$1:INDIRECT(CONCATENATE(\"$A$\",ROW()-1)))+1,\"\")","v":""},"",null,"Vertical smooth formwork to:"]
[{"$f":"IF($E54<>\"\",MAX($A$1:INDIRECT(CONCATENATE(\"$A$\",ROW()-1)))+1,\"\")","v":""},""]
[{"$f":"IF($E55<>\"\",MAX($A$1:INDIRECT(CONCATENATE(\"$A$\",ROW()-1)))+1,\"\")","v":15},"C5.15",null,"Floor joint, circular in plan, 150 mm high, with radius 10,100 m","m",65]
[{"$f":"IF($E56<>\"\",MAX($A$1:INDIRECT(CONCATENATE(\"$A$\",ROW()-1)))+1,\"\")","v":""},""]
[{"$f":"IF($E57<>\"\",MAX($A$1:INDIRECT(CONCATENATE(\"$A$\",ROW()-1)))+1,\"\")","v":16},"C5.16",null,"Floor joint, circular in plan, 150 mm high, with radius 16,900 m","m",110]
[{"$f":"IF($E58<>\"\",MAX($A$1:INDIRECT(CONCATENATE(\"$A$\",ROW()-1)))+1,\"\")","v":""},""]
[{"$f":"IF($E59<>\"\",MAX($A$1:INDIRECT(CONCATENATE(\"$A$\",ROW()-1)))+1,\"\")","v":17},"C5.17",null,"Floor joint, 150 mm high","m",185]
[{"$f":"IF($E60<>\"\",MAX($A$1:INDIRECT(CONCATENATE(\"$A$\",ROW()-1)))+1,\"\")","v":""},""]
[{"$f":"IF($E61<>\"\",MAX($A$1:INDIRECT(CONCATENATE(\"$A$\",ROW()-1)))+1,\"\")","v":18},"C5.18",null,"Vertical faces to upstand around access opening, 170 mm high","m",15]
[{"$f":"IF($E62<>\"\",MAX($A$1:INDIRECT(CONCATENATE(\"$A$\",ROW()-1)))+1,\"\")","v":""},""]
[{"$f":"IF($E63<>\"\",MAX($A$1:INDIRECT(CONCATENATE(\"$A$\",ROW()-1)))+1,\"\")","v":19},"C5.19",null,"Vertical faces to upstand around ultrasonic probe opening, circular in plan,100 mm high","m",2]
[{"$f":"IF($E64<>\"\",MAX($A$1:INDIRECT(CONCATENATE(\"$A$\",ROW()-1)))+1,\"\")","v":""},""]
[{"$f":"IF($E65<>\"\",MAX($A$1:INDIRECT(CONCATENATE(\"$A$\",ROW()-1)))+1,\"\")","v":20},"C5.20",null,"Vertical faces to roof downstand nib, 150mm high as per Detail 03 on Dwg. No. 106777-0503-DRG-ST-0402","m",5]
[{"$f":"IF($E66<>\"\",MAX($A$1:INDIRECT(CONCATENATE(\"$A$\",ROW()-1)))+1,\"\")","v":""},""]
[{"$f":"IF($E67<>\"\",MAX($A$1:INDIRECT(CONCATENATE(\"$A$\",ROW()-1)))+1,\"\")","v":21},"C5.21",null,"Vertical faces to divider strip under floor slab, 100mm high","m",180]
[{"$f":"IF($E68<>\"\",MAX($A$1:INDIRECT(CONCATENATE(\"$A$\",ROW()-1)))+1,\"\")","v":""},""]
[{"$f":"IF($E69<>\"\",MAX($A$1:INDIRECT(CONCATENATE(\"$A$\",ROW()-1)))+1,\"\")","v":""},"",null,"Vertical rough formwork to:"]
[{"$f":"IF($E70<>\"\",MAX($A$1:INDIRECT(CONCATENATE(\"$A$\",ROW()-1)))+1,\"\")","v":""},""]
[{"$f":"IF($E71<>\"\",MAX($A$1:INDIRECT(CONCATENATE(\"$A$\",ROW()-1)))+1,\"\")","v":22},"C5.22",null,"Vertical face to mass concrete in lieu of no-fines concrete under column bases, 100mm high","m",190]
[{"$f":"IF($E72<>\"\",MAX($A$1:INDIRECT(CONCATENATE(\"$A$\",ROW()-1)))+1,\"\")","v":""},""]
[{"$f":"IF($E73<>\"\",MAX($A$1:INDIRECT(CONCATENATE(\"$A$\",ROW()-1)))+1,\"\")","v":""},"",15.4,"Box out holes/form voids:"]
[{"$f":"IF($E74<>\"\",MAX($A$1:INDIRECT(CONCATENATE(\"$A$\",ROW()-1)))+1,\"\")","v":""},""]
[{"$f":"IF($E75<>\"\",MAX($A$1:INDIRECT(CONCATENATE(\"$A$\",ROW()-1)))+1,\"\")","v":23},"C5.23",null,"Small, circular up to 0,35 m dia, of depths over 0m and up to 0,5m.","No",1]
[]
[{"$f":"IF($E77<>\"\",MAX($A$1:INDIRECT(CONCATENATE(\"$A$\",ROW()-1)))+1,\"\")","v":""},{"$f":"IF(A77<>\"\",$A$3&A77,\"\")","v":""}]
[{"$f":"IF($E78<>\"\",MAX($A$1:INDIRECT(CONCATENATE(\"$A$\",ROW()-1)))+1,\"\")","v":""},"",15.2,"SCHEDULED REINFORCMENT ITEMS"]
[{"$f":"IF($E79<>\"\",MAX($A$1:INDIRECT(CONCATENATE(\"$A$\",ROW()-1)))+1,\"\")","v":""},""]
[{"$f":"IF($E80<>\"\",MAX($A$1:INDIRECT(CONCATENATE(\"$A$\",ROW()-1)))+1,\"\")","v":""},"",15.2,"Mild steel bars:"]
[{"$f":"IF($E81<>\"\",MAX($A$1:INDIRECT(CONCATENATE(\"$A$\",ROW()-1)))+1,\"\")","v":""},""]
[{"$f":"IF($E82<>\"\",MAX($A$1:INDIRECT(CONCATENATE(\"$A$\",ROW()-1)))+1,\"\")","v":24},"C5.24",null,"8 mm dia","t",1]
[{"$f":"IF($E83<>\"\",MAX($A$1:INDIRECT(CONCATENATE(\"$A$\",ROW()-1)))+1,\"\")","v":""},""]
[{"$f":"IF($E84<>\"\",MAX($A$1:INDIRECT(CONCATENATE(\"$A$\",ROW()-1)))+1,\"\")","v":25},"C5.25",null,"10 mm dia","t",1]
[{"$f":"IF($E85<>\"\",MAX($A$1:INDIRECT(CONCATENATE(\"$A$\",ROW()-1)))+1,\"\")","v":""},""]
[{"$f":"IF($E86<>\"\",MAX($A$1:INDIRECT(CONCATENATE(\"$A$\",ROW()-1)))+1,\"\")","v":26},"C5.26",null,"12 mm dia","t",1]
[{"$f":"IF($E87<>\"\",MAX($A$1:INDIRECT(CONCATENATE(\"$A$\",ROW()-1)))+1,\"\")","v":""},""]
[{"$f":"IF($E88<>\"\",MAX($A$1:INDIRECT(CONCATENATE(\"$A$\",ROW()-1)))+1,\"\")","v":""},"",15.2,"High tensile steel bars:"]
[{"$f":"IF($E89<>\"\",MAX($A$1:INDIRECT(CONCATENATE(\"$A$\",ROW()-1)))+1,\"\")","v":""},""]
[{"$f":"IF($E90<>\"\",MAX($A$1:INDIRECT(CONCATENATE(\"$A$\",ROW()-1)))+1,\"\")","v":27},"C5.27",null,"10 mm dia","t",27]
[{"$f":"IF($E91<>\"\",MAX($A$1:INDIRECT(CONCATENATE(\"$A$\",ROW()-1)))+1,\"\")","v":""},""]
[{"$f":"IF($E92<>\"\",MAX($A$1:INDIRECT(CONCATENATE(\"$A$\",ROW()-1)))+1,\"\")","v":28},"C5.28",null,"12 mm dia","t",22]
[]
[{"$f":"IF($E94<>\"\",MAX($A$1:INDIRECT(CONCATENATE(\"$A$\",ROW()-1)))+1,\"\")","v":""},{"$f":"IF(A94<>\"\",$A$3&A94,\"\")","v":""},null," Carried forward / …"]
[{"$f":"IF($E95<>\"\",MAX($A$1:INDIRECT(CONCATENATE(\"$A$\",ROW()-1)))+1,\"\")","v":""},"",null," Brought forward / …"]
[]
[{"$f":"IF($E97<>\"\",MAX($A$1:INDIRECT(CONCATENATE(\"$A$\",ROW()-1)))+1,\"\")","v":29},"C5.29",null,"16 mm dia","t",32]
[{"$f":"IF($E98<>\"\",MAX($A$1:INDIRECT(CONCATENATE(\"$A$\",ROW()-1)))+1,\"\")","v":""},""]
[{"$f":"IF($E99<>\"\",MAX($A$1:INDIRECT(CONCATENATE(\"$A$\",ROW()-1)))+1,\"\")","v":30},"C5.30",null,"20 mm dia","t",7]
[{"$f":"IF($E100<>\"\",MAX($A$1:INDIRECT(CONCATENATE(\"$A$\",ROW()-1)))+1,\"\")","v":""},""]
[{"$f":"IF($E101<>\"\",MAX($A$1:INDIRECT(CONCATENATE(\"$A$\",ROW()-1)))+1,\"\")","v":31},"C5.31",null,"25 mm dia","t",2]
[]
[{"$f":"IF($E103<>\"\",MAX($A$1:INDIRECT(CONCATENATE(\"$A$\",ROW()-1)))+1,\"\")","v":""},""]
[{"$f":"IF($E104<>\"\",MAX($A$1:INDIRECT(CONCATENATE(\"$A$\",ROW()-1)))+1,\"\")","v":""},"",15.1,"SCHEDULED CONCRETE ITEMS"]
[{"$f":"IF($E105<>\"\",MAX($A$1:INDIRECT(CONCATENATE(\"$A$\",ROW()-1)))+1,\"\")","v":""},""]
[{"$f":"IF($E106<>\"\",MAX($A$1:INDIRECT(CONCATENATE(\"$A$\",ROW()-1)))+1,\"\")","v":""},"",15.15,"Blinding layer:"]
[{"$f":"IF($E107<>\"\",MAX($A$1:INDIRECT(CONCATENATE(\"$A$\",ROW()-1)))+1,\"\")","v":""},""]
[{"$f":"IF($E108<>\"\",MAX($A$1:INDIRECT(CONCATENATE(\"$A$\",ROW()-1)))+1,\"\")","v":""},"",null,"Class 15MPa/19 mm concrete for: "]
[{"$f":"IF($E109<>\"\",MAX($A$1:INDIRECT(CONCATENATE(\"$A$\",ROW()-1)))+1,\"\")","v":""},""]
[{"$f":"IF($E110<>\"\",MAX($A$1:INDIRECT(CONCATENATE(\"$A$\",ROW()-1)))+1,\"\")","v":32},"C5.32",null,"Wall, floor and column footings, 75 mm thick","m2",1160]
[{"$f":"IF($E111<>\"\",MAX($A$1:INDIRECT(CONCATENATE(\"$A$\",ROW()-1)))+1,\"\")","v":""},""]
[{"$f":"IF($E112<>\"\",MAX($A$1:INDIRECT(CONCATENATE(\"$A$\",ROW()-1)))+1,\"\")","v":""},"",15.1,"Watertight concrete: "]
[{"$f":"IF($E113<>\"\",MAX($A$1:INDIRECT(CONCATENATE(\"$A$\",ROW()-1)))+1,\"\")","v":""},""]
[{"$f":"IF($E114<>\"\",MAX($A$1:INDIRECT(CONCATENATE(\"$A$\",ROW()-1)))+1,\"\")","v":""},"",null,"Class 35 MPa/19 mm Watertight Concrete to:"]
[{"$f":"IF($E115<>\"\",MAX($A$1:INDIRECT(CONCATENATE(\"$A$\",ROW()-1)))+1,\"\")","v":""},""]
[{"$f":"IF($E116<>\"\",MAX($A$1:INDIRECT(CONCATENATE(\"$A$\",ROW()-1)))+1,\"\")","v":33},"C5.33",null,"Reservoir column footings","m3",13]
[{"$f":"IF($E117<>\"\",MAX($A$1:INDIRECT(CONCATENATE(\"$A$\",ROW()-1)))+1,\"\")","v":""},""]
[{"$f":"IF($E118<>\"\",MAX($A$1:INDIRECT(CONCATENATE(\"$A$\",ROW()-1)))+1,\"\")","v":34},"C5.34",null,"Reservoir floor (including thickenings in floor)","m3",140]
[{"$f":"IF($E119<>\"\",MAX($A$1:INDIRECT(CONCATENATE(\"$A$\",ROW()-1)))+1,\"\")","v":""},""]
[{"$f":"IF($E120<>\"\",MAX($A$1:INDIRECT(CONCATENATE(\"$A$\",ROW()-1)))+1,\"\")","v":35},"C5.35",null,"Reservoir columns","m3",12]
[{"$f":"IF($E121<>\"\",MAX($A$1:INDIRECT(CONCATENATE(\"$A$\",ROW()-1)))+1,\"\")","v":""},""]
[{"$f":"IF($E122<>\"\",MAX($A$1:INDIRECT(CONCATENATE(\"$A$\",ROW()-1)))+1,\"\")","v":36},"C5.36",null,"Reservoir wall footing","m3",74]
[]
[{"$f":"IF($E124<>\"\",MAX($A$1:INDIRECT(CONCATENATE(\"$A$\",ROW()-1)))+1,\"\")","v":37},{"$f":"IF(A124<>\"\",$A$3&A124,\"\")","v":"C5.37"},null,"Reservoir wall ","m3",185]
[{"$f":"IF($E125<>\"\",MAX($A$1:INDIRECT(CONCATENATE(\"$A$\",ROW()-1)))+1,\"\")","v":""},""]
[{"$f":"IF($E126<>\"\",MAX($A$1:INDIRECT(CONCATENATE(\"$A$\",ROW()-1)))+1,\"\")","v":38},"C5.38",null,"Reservoir roof slab (including downstand nibs and upstands)","m3",270]
[{"$f":"IF($E127<>\"\",MAX($A$1:INDIRECT(CONCATENATE(\"$A$\",ROW()-1)))+1,\"\")","v":""},""]
[{"$f":"IF($E128<>\"\",MAX($A$1:INDIRECT(CONCATENATE(\"$A$\",ROW()-1)))+1,\"\")","v":39},"C5.39",null,"Reservoir column heads","m3",13]
[{"$f":"IF($E129<>\"\",MAX($A$1:INDIRECT(CONCATENATE(\"$A$\",ROW()-1)))+1,\"\")","v":""},""]
[{"$f":"IF($E130<>\"\",MAX($A$1:INDIRECT(CONCATENATE(\"$A$\",ROW()-1)))+1,\"\")","v":40},"C5.40",null,"Reservoir outlet sump base","m3",1]
[{"$f":"IF($E131<>\"\",MAX($A$1:INDIRECT(CONCATENATE(\"$A$\",ROW()-1)))+1,\"\")","v":""},""]
[{"$f":"IF($E132<>\"\",MAX($A$1:INDIRECT(CONCATENATE(\"$A$\",ROW()-1)))+1,\"\")","v":41},"C5.41",null,"Reservoir outlet sump walls","m3",4]
[{"$f":"IF($E133<>\"\",MAX($A$1:INDIRECT(CONCATENATE(\"$A$\",ROW()-1)))+1,\"\")","v":""},""]
[{"$f":"IF($E134<>\"\",MAX($A$1:INDIRECT(CONCATENATE(\"$A$\",ROW()-1)))+1,\"\")","v":""},"",null,"Class 15 MPa/19 mm:"]
[{"$f":"IF($E135<>\"\",MAX($A$1:INDIRECT(CONCATENATE(\"$A$\",ROW()-1)))+1,\"\")","v":""},""]
[{"$f":"IF($E136<>\"\",MAX($A$1:INDIRECT(CONCATENATE(\"$A$\",ROW()-1)))+1,\"\")","v":42},"C5.42",null,"Mass concrete for encasement of pipework and subsurface drain pipes under wall footing","m3",50]
[{"$f":"IF($E137<>\"\",MAX($A$1:INDIRECT(CONCATENATE(\"$A$\",ROW()-1)))+1,\"\")","v":""},""]
[{"$f":"IF($E138<>\"\",MAX($A$1:INDIRECT(CONCATENATE(\"$A$\",ROW()-1)))+1,\"\")","v":43},"C5.43",null,"Mass concrete for filling overbreak of pipework and subsurface drain trenches below reservoir","m3",55]
[{"$f":"IF($E139<>\"\",MAX($A$1:INDIRECT(CONCATENATE(\"$A$\",ROW()-1)))+1,\"\")","v":""},""]
[{"$f":"IF($E140<>\"\",MAX($A$1:INDIRECT(CONCATENATE(\"$A$\",ROW()-1)))+1,\"\")","v":44},"C5.44",null,"200 mm wide x 100 mm high divider strips under floor","m3",2]
[]
[{"$f":"IF($E142<>\"\",MAX($A$1:INDIRECT(CONCATENATE(\"$A$\",ROW()-1)))+1,\"\")","v":""},{"$f":"IF(A142<>\"\",$A$3&A142,\"\")","v":""},null," Carried forward / …"]
[{"$f":"IF($E143<>\"\",MAX($A$1:INDIRECT(CONCATENATE(\"$A$\",ROW()-1)))+1,\"\")","v":""},"",null," Brought forward / …"]
[]
[{"$f":"IF($E145<>\"\",MAX($A$1:INDIRECT(CONCATENATE(\"$A$\",ROW()-1)))+1,\"\")","v":45},"C5.45",null,"1900x1900x100 mm thick in lieu of no-fines concrete below column bases","m3",9]
[{"$f":"IF($E146<>\"\",MAX($A$1:INDIRECT(CONCATENATE(\"$A$\",ROW()-1)))+1,\"\")","v":""},""]
[{"$f":"IF($E147<>\"\",MAX($A$1:INDIRECT(CONCATENATE(\"$A$\",ROW()-1)))+1,\"\")","v":""},"",15.5,"Unformed surface finishes:"]
[{"$f":"IF($E148<>\"\",MAX($A$1:INDIRECT(CONCATENATE(\"$A$\",ROW()-1)))+1,\"\")","v":""},""]
[{"$f":"IF($E149<>\"\",MAX($A$1:INDIRECT(CONCATENATE(\"$A$\",ROW()-1)))+1,\"\")","v":""},"",null,"Wood-floated finish to:"]
[{"$f":"IF($E150<>\"\",MAX($A$1:INDIRECT(CONCATENATE(\"$A$\",ROW()-1)))+1,\"\")","v":""},""]
[{"$f":"IF($E151<>\"\",MAX($A$1:INDIRECT(CONCATENATE(\"$A$\",ROW()-1)))+1,\"\")","v":46},"C5.46",null,"Top of reservoir floor and wall footing (inside of reservoir)","m2",1000]
[{"$f":"IF($E152<>\"\",MAX($A$1:INDIRECT(CONCATENATE(\"$A$\",ROW()-1)))+1,\"\")","v":""},""]
[{"$f":"IF($E153<>\"\",MAX($A$1:INDIRECT(CONCATENATE(\"$A$\",ROW()-1)))+1,\"\")","v":47},"C5.47",null,"Top of reservoir roof slab (with 120mm fall from centre to perimeter)","m2",1060]
[{"$f":"IF($E154<>\"\",MAX($A$1:INDIRECT(CONCATENATE(\"$A$\",ROW()-1)))+1,\"\")","v":""},""]
[{"$f":"IF($E155<>\"\",MAX($A$1:INDIRECT(CONCATENATE(\"$A$\",ROW()-1)))+1,\"\")","v":48},"C5.48",null,"Top of upstand beams","m2",3]
[{"$f":"IF($E156<>\"\",MAX($A$1:INDIRECT(CONCATENATE(\"$A$\",ROW()-1)))+1,\"\")","v":""},""]
[{"$f":"IF($E157<>\"\",MAX($A$1:INDIRECT(CONCATENATE(\"$A$\",ROW()-1)))+1,\"\")","v":49},"C5.49",null,"Top of column bases","m2",50]
[{"$f":"IF($E158<>\"\",MAX($A$1:INDIRECT(CONCATENATE(\"$A$\",ROW()-1)))+1,\"\")","v":""},""]
[{"$f":"IF($E159<>\"\",MAX($A$1:INDIRECT(CONCATENATE(\"$A$\",ROW()-1)))+1,\"\")","v":""},"",null,"Steel-floated finish to:"]
[]
[{"$f":"IF($E161<>\"\",MAX($A$1:INDIRECT(CONCATENATE(\"$A$\",ROW()-1)))+1,\"\")","v":50},{"$f":"IF(A161<>\"\",$A$3&A161,\"\")","v":"C5.50"},null,"Top of mass concrete under column footings & mass concrete encasements under reservoir floor and footing","m2",125]
[]
[{"$f":"IF($E163<>\"\",MAX($A$1:INDIRECT(CONCATENATE(\"$A$\",ROW()-1)))+1,\"\")","v":51},{"$f":"IF(A163<>\"\",$A$3&A163,\"\")","v":"C5.51"},null,"Top of reservoir wall","m2",35]
[{"$f":"IF($E164<>\"\",MAX($A$1:INDIRECT(CONCATENATE(\"$A$\",ROW()-1)))+1,\"\")","v":""},""]
[{"$f":"IF($E165<>\"\",MAX($A$1:INDIRECT(CONCATENATE(\"$A$\",ROW()-1)))+1,\"\")","v":52},"C5.52",null,"Top of divider strips under reservoir floor","m2",20]
[{"$f":"IF($E166<>\"\",MAX($A$1:INDIRECT(CONCATENATE(\"$A$\",ROW()-1)))+1,\"\")","v":""},""]
[{"$f":"IF($E167<>\"\",MAX($A$1:INDIRECT(CONCATENATE(\"$A$\",ROW()-1)))+1,\"\")","v":53},"C5.53",null,"Top of blinding under ringfooting","m2",230]
[{"$f":"IF($E168<>\"\",MAX($A$1:INDIRECT(CONCATENATE(\"$A$\",ROW()-1)))+1,\"\")","v":""},""]
[{"$f":"IF($E169<>\"\",MAX($A$1:INDIRECT(CONCATENATE(\"$A$\",ROW()-1)))+1,\"\")","v":""},"",15.9,"Joints:"]
[{"$f":"IF($E170<>\"\",MAX($A$1:INDIRECT(CONCATENATE(\"$A$\",ROW()-1)))+1,\"\")","v":""},""]
[{"$f":"IF($E171<>\"\",MAX($A$1:INDIRECT(CONCATENATE(\"$A$\",ROW()-1)))+1,\"\")","v":54},"C5.54",null,"Waterstop joint type A in reservoir floor, complete with corners, junctions etc. as per detail Dwg. No. 106777-0503-DRG-ST-0400","m",360]
[{"$f":"IF($E172<>\"\",MAX($A$1:INDIRECT(CONCATENATE(\"$A$\",ROW()-1)))+1,\"\")","v":""},""]
[{"$f":"IF($E173<>\"\",MAX($A$1:INDIRECT(CONCATENATE(\"$A$\",ROW()-1)))+1,\"\")","v":55},"C5.55",null,"Horizontal construction joints in reservoir wall, complete, as per Detail 04 on Dwg. No. 106777-0503-DRG-ST-0400","m",342]
[{"$f":"IF($E174<>\"\",MAX($A$1:INDIRECT(CONCATENATE(\"$A$\",ROW()-1)))+1,\"\")","v":""},""]
[{"$f":"IF($E175<>\"\",MAX($A$1:INDIRECT(CONCATENATE(\"$A$\",ROW()-1)))+1,\"\")","v":56},"C5.56",null,"Horizontal construction joints in reservoir outlet sump walls, complete, as per Detail 03 on Dwg. No. 106777-0503-DRG-ST-0400 & Dwg. No. 106777-0503-DRG-ST-0405","m",12]
[{"$f":"IF($E176<>\"\",MAX($A$1:INDIRECT(CONCATENATE(\"$A$\",ROW()-1)))+1,\"\")","v":""},""]
[{"$f":"IF($E177<>\"\",MAX($A$1:INDIRECT(CONCATENATE(\"$A$\",ROW()-1)))+1,\"\")","v":57},"C5.57",null,"Joint between reservoir wall and roof, complete, as per Detail 05 on Dwg. No. 106777-0503-DRG-ST-0402","m",115]
[{"$f":"IF($E178<>\"\",MAX($A$1:INDIRECT(CONCATENATE(\"$A$\",ROW()-1)))+1,\"\")","v":""},""]
[{"$f":"IF($E179<>\"\",MAX($A$1:INDIRECT(CONCATENATE(\"$A$\",ROW()-1)))+1,\"\")","v":58},"C5.58",null,"Joint type C between reservoir wall and concrete apron, complete as per Section B on Dwg. No. 106777-0503-DRG-ST-0400 ","m",115]
[]
[{"$f":"IF($E181<>\"\",MAX($A$1:INDIRECT(CONCATENATE(\"$A$\",ROW()-1)))+1,\"\")","v":""},{"$f":"IF(A181<>\"\",$A$3&A181,\"\")","v":""},null," Carried forward / …"]
[{"$f":"IF($E182<>\"\",MAX($A$1:INDIRECT(CONCATENATE(\"$A$\",ROW()-1)))+1,\"\")","v":""},"",null," Brought forward / …"]
[]
[{"$f":"IF($E184<>\"\",MAX($A$1:INDIRECT(CONCATENATE(\"$A$\",ROW()-1)))+1,\"\")","v":59},"C5.59",null,"Joint type C between concrete apron panels, complete as per Elevation D on Dwg. No. 106777-0503-DRG-ST-0400 ","m",50]
[{"$f":"IF($E185<>\"\",MAX($A$1:INDIRECT(CONCATENATE(\"$A$\",ROW()-1)))+1,\"\")","v":""},""]
[{"$f":"IF($E186<>\"\",MAX($A$1:INDIRECT(CONCATENATE(\"$A$\",ROW()-1)))+1,\"\")","v":""},{"$f":"IF(A186<>\"\",$A$3&A186,\"\")","v":""},15.8,"Cast in of pipes with or without puddle flanges:"]
[{"$f":"IF($E187<>\"\",MAX($A$1:INDIRECT(CONCATENATE(\"$A$\",ROW()-1)))+1,\"\")","v":""},{"$f":"IF(A187<>\"\",$A$3&A187,\"\")","v":""}]
[{"$f":"IF($E188<>\"\",MAX($A$1:INDIRECT(CONCATENATE(\"$A$\",ROW()-1)))+1,\"\")","v":""},{"$f":"IF(A188<>\"\",$A$3&A188,\"\")","v":""},null,"Up to 300mm nominal bore:"]
[]
[{"$f":"IF($E190<>\"\",MAX($A$1:INDIRECT(CONCATENATE(\"$A$\",ROW()-1)))+1,\"\")","v":60},{"$f":"IF(A190<>\"\",$A$3&A190,\"\")","v":"C5.60"},null,"Through 250mm thick reservoir floor slab thickening","No",1]
[{"$f":"IF($E191<>\"\",MAX($A$1:INDIRECT(CONCATENATE(\"$A$\",ROW()-1)))+1,\"\")","v":""},{"$f":"IF(A191<>\"\",$A$3&A191,\"\")","v":""}]
[{"$f":"IF($E192<>\"\",MAX($A$1:INDIRECT(CONCATENATE(\"$A$\",ROW()-1)))+1,\"\")","v":""},{"$f":"IF(A192<>\"\",$A$3&A192,\"\")","v":""},null,"Over 300mm up to 600mm nominal bore:"]
[{"$f":"IF($E193<>\"\",MAX($A$1:INDIRECT(CONCATENATE(\"$A$\",ROW()-1)))+1,\"\")","v":61},{"$f":"IF(A193<>\"\",$A$3&A193,\"\")","v":"C5.61"},null,"Through 250mm thick reservoir floor slab thickening","No",2]
[{"$f":"IF($E194<>\"\",MAX($A$1:INDIRECT(CONCATENATE(\"$A$\",ROW()-1)))+1,\"\")","v":""},""]
[{"$f":"IF($E195<>\"\",MAX($A$1:INDIRECT(CONCATENATE(\"$A$\",ROW()-1)))+1,\"\")","v":62},"C5.62",null,"Through 250mm thick sump wall","No",1]
[{"$f":"IF($E196<>\"\",MAX($A$1:INDIRECT(CONCATENATE(\"$A$\",ROW()-1)))+1,\"\")","v":""},""]
[{"$f":"IF($E197<>\"\",MAX($A$1:INDIRECT(CONCATENATE(\"$A$\",ROW()-1)))+1,\"\")","v":""},{"$f":"IF(A197<>\"\",$A$3&A197,\"\")","v":""},15.11,"Miscellaneous works:"]
[{"$f":"IF($E198<>\"\",MAX($A$1:INDIRECT(CONCATENATE(\"$A$\",ROW()-1)))+1,\"\")","v":""},{"$f":"IF(A198<>\"\",$A$3&A198,\"\")","v":""}]
[{"$f":"IF($E199<>\"\",MAX($A$1:INDIRECT(CONCATENATE(\"$A$\",ROW()-1)))+1,\"\")","v":63},{"$f":"IF(A199<>\"\",$A$3&A199,\"\")","v":"C5.63"},null,"Internal ladder (Stainless Steel 316 with Stainless Steel bolts, nuts and washers), complete as per Dwg. No. 106777-0503-DRG-ST-0403","No",2]
[{"$f":"IF($E200<>\"\",MAX($A$1:INDIRECT(CONCATENATE(\"$A$\",ROW()-1)))+1,\"\")","v":""},{"$f":"IF(A200<>\"\",$A$3&A200,\"\")","v":""}]
[{"$f":"IF($E201<>\"\",MAX($A$1:INDIRECT(CONCATENATE(\"$A$\",ROW()-1)))+1,\"\")","v":64},{"$f":"IF(A201<>\"\",$A$3&A201,\"\")","v":"C5.64"},null,"External ladder (Stainless Steel 304 with Stainless Steel bolts, nuts and washers), complete as per Dwg. No. 106777-0503-DRG-ST-0403","No",1]
[]
[{"$f":"IF($E203<>\"\",MAX($A$1:INDIRECT(CONCATENATE(\"$A$\",ROW()-1)))+1,\"\")","v":65},{"$f":"IF(A203<>\"\",$A$3&A203,\"\")","v":"C5.65"},null,"Mentis Stainless Steel 304 balustrade on roof, complete (approximately 3.5m long and 1m high) as per Note 3 on Dwg. No. 106777-0503-DRG-ST-0402","No",3]
[{"$f":"IF($E204<>\"\",MAX($A$1:INDIRECT(CONCATENATE(\"$A$\",ROW()-1)))+1,\"\")","v":""},""]
[{"$f":"IF($E205<>\"\",MAX($A$1:INDIRECT(CONCATENATE(\"$A$\",ROW()-1)))+1,\"\")","v":66},"C5.66",null,"42 mm Ø (Stainless Steel 304) grab bar, complete as per Detail 01 on Dwg. No. 106777-0503-DRG-ST-0404","No",2]
[{"$f":"IF($E206<>\"\",MAX($A$1:INDIRECT(CONCATENATE(\"$A$\",ROW()-1)))+1,\"\")","v":""},""]
[{"$f":"IF($E207<>\"\",MAX($A$1:INDIRECT(CONCATENATE(\"$A$\",ROW()-1)))+1,\"\")","v":67},"C5.67",null,"Roof ventilators (Stainless Steel 304 with Stainless Steel 316 cast-in pipe), complete as per Detail 01 on Dwg. No. 106777-0503-DRG-ST-0402","No",6]
[{"$f":"IF($E208<>\"\",MAX($A$1:INDIRECT(CONCATENATE(\"$A$\",ROW()-1)))+1,\"\")","v":""},""]
[{"$f":"IF($E209<>\"\",MAX($A$1:INDIRECT(CONCATENATE(\"$A$\",ROW()-1)))+1,\"\")","v":68},"C5.68",null,"Ultrasonic probe purpose made cover (Stainless Steel 304), complete with fixing and cast in items as per Detail 02 on Dwg. No. 106777-0503-DRG-ST-0402","No",1]
[{"$f":"IF($E210<>\"\",MAX($A$1:INDIRECT(CONCATENATE(\"$A$\",ROW()-1)))+1,\"\")","v":""},""]
[{"$f":"IF($E211<>\"\",MAX($A$1:INDIRECT(CONCATENATE(\"$A$\",ROW()-1)))+1,\"\")","v":69},"C5.69",null,"Dome cover over scour inside of reservoir (Stainless Steel 316), complete as per Detail 02 on Dwg. No. 106777-0503-DRG-ST-0404","No",1]
[]
[{"$f":"IF($E213<>\"\",MAX($A$1:INDIRECT(CONCATENATE(\"$A$\",ROW()-1)))+1,\"\")","v":""},{"$f":"IF(A213<>\"\",$A$3&A213,\"\")","v":""},null," Carried forward / …"]
[{"$f":"IF($E214<>\"\",MAX($A$1:INDIRECT(CONCATENATE(\"$A$\",ROW()-1)))+1,\"\")","v":""},"",null," Brought forward / …"]
[]
[{"$f":"IF($E216<>\"\",MAX($A$1:INDIRECT(CONCATENATE(\"$A$\",ROW()-1)))+1,\"\")","v":70},"C5.70",null,"Dome cover over inlet inside of reservoir (Stainless Steel 316), complete as per Detail 03 on Dwg. No. 106777-0503-DRG-ST-0404","No",1]
[]
[{"$f":"IF($E218<>\"\",MAX($A$1:INDIRECT(CONCATENATE(\"$A$\",ROW()-1)))+1,\"\")","v":71},{"$f":"IF(A218<>\"\",$A$3&A218,\"\")","v":"C5.71"},null,"Mentis rectagrid cover over outlet sump (Stainless steel 316), complete with cast-in items as per Dwg. No. 106777-0503-DRG-ST-0405","No",1]
[{"$f":"IF($E219<>\"\",MAX($A$1:INDIRECT(CONCATENATE(\"$A$\",ROW()-1)))+1,\"\")","v":""},{"$f":"IF(A219<>\"\",$A$3&A219,\"\")","v":""}]
[{"$f":"IF($E220<>\"\",MAX($A$1:INDIRECT(CONCATENATE(\"$A$\",ROW()-1)))+1,\"\")","v":72},{"$f":"IF(A220<>\"\",$A$3&A220,\"\")","v":"C5.72"},null,"375 micron polyethylene bondbreaker with taped 100 mm laps and perforated at 500 mm c/c in two orthoganal directions","m2",975]
[{"$f":"IF($E221<>\"\",MAX($A$1:INDIRECT(CONCATENATE(\"$A$\",ROW()-1)))+1,\"\")","v":""},{"$f":"IF(A221<>\"\",$A$3&A221,\"\")","v":""}]
[{"$f":"IF($E222<>\"\",MAX($A$1:INDIRECT(CONCATENATE(\"$A$\",ROW()-1)))+1,\"\")","v":73},{"$f":"IF(A222<>\"\",$A$3&A222,\"\")","v":"C5.73"},null,"Precast concrete slab over access opening complete with aluminium cover and cast in items as per Dwg. No. 106777-0503-DRG-ST-0404","No",2]
[]
[{"$f":"IF($E224<>\"\",MAX($A$1:INDIRECT(CONCATENATE(\"$A$\",ROW()-1)))+1,\"\")","v":74},{"$f":"IF(A224<>\"\",$A$3&A224,\"\")","v":"C5.74"},null,"Precast coping units, complete with galvanized grout-in bar as per Dwg. No. 106777-0503-DRG-ST-0402","No",190]
[{"$f":"IF($E225<>\"\",MAX($A$1:INDIRECT(CONCATENATE(\"$A$\",ROW()-1)))+1,\"\")","v":""},""]
[{"$f":"IF($E226<>\"\",MAX($A$1:INDIRECT(CONCATENATE(\"$A$\",ROW()-1)))+1,\"\")","v":75},"C5.75",null,"20 mm thick 1:4 cement:sand mortar to the top surface of the no-fines concrete layer under the reservoir floor, with smooth steel-floated top surface","m2",860]
[{"$f":"IF($E227<>\"\",MAX($A$1:INDIRECT(CONCATENATE(\"$A$\",ROW()-1)))+1,\"\")","v":""},""]
[{"$f":"IF($E228<>\"\",MAX($A$1:INDIRECT(CONCATENATE(\"$A$\",ROW()-1)))+1,\"\")","v":76},"C5.76",null,"Roof nib plate (Stainless Steel 316), complete with cast-in items & jointex as per Detail 04 on Dwg. No. 106777-0503-DRG-ST-0402","No",4]
[{"$f":"IF($E229<>\"\",MAX($A$1:INDIRECT(CONCATENATE(\"$A$\",ROW()-1)))+1,\"\")","v":""},""]
[{"$f":"IF($E230<>\"\",MAX($A$1:INDIRECT(CONCATENATE(\"$A$\",ROW()-1)))+1,\"\")","v":77},"C5.77",null,"75x75x90mm concrete spacer blocks in reservoir floor (40MPa, watertight concrete)","No",1000]
[{"$f":"IF($E231<>\"\",MAX($A$1:INDIRECT(CONCATENATE(\"$A$\",ROW()-1)))+1,\"\")","v":""},""]
[{"$f":"IF($E232<>\"\",MAX($A$1:INDIRECT(CONCATENATE(\"$A$\",ROW()-1)))+1,\"\")","v":78},"C5.78",null,"Cast-in-situ concrete apron (25 Mpa concrete) at reservoir perimeter, complete with sand and G5 layerworks as per Drawing 106777-0502-DRG-CC-0202","m",130]
[{"$f":"IF($E233<>\"\",MAX($A$1:INDIRECT(CONCATENATE(\"$A$\",ROW()-1)))+1,\"\")","v":""},""]
[{"$f":"IF($E234<>\"\",MAX($A$1:INDIRECT(CONCATENATE(\"$A$\",ROW()-1)))+1,\"\")","v":79},"C5.79",null,"Stainless steel 316 support frame/brackets for overflow pipe, complete with stainless steel 316 bolts, foot plates & collar plates as per Dwg. No. 106777-0503-DRG-ST-0405","Sum",1]
[]
[{"$f":"IF($E236<>\"\",MAX($A$1:INDIRECT(CONCATENATE(\"$A$\",ROW()-1)))+1,\"\")","v":""},{"$f":"IF(A236<>\"\",$A$3&A236,\"\")","v":""},15.16,"Cast-in-situ no-fines concrete"]
[{"$f":"IF($E237<>\"\",MAX($A$1:INDIRECT(CONCATENATE(\"$A$\",ROW()-1)))+1,\"\")","v":""},{"$f":"IF(A237<>\"\",$A$3&A237,\"\")","v":""}]
[{"$f":"IF($E238<>\"\",MAX($A$1:INDIRECT(CONCATENATE(\"$A$\",ROW()-1)))+1,\"\")","v":80},{"$f":"IF(A238<>\"\",$A$3&A238,\"\")","v":"C5.80"},null,"No-fines concrete under floor ","m3",90]
[]
[{"$f":"IF($E240<>\"\",MAX($A$1:INDIRECT(CONCATENATE(\"$A$\",ROW()-1)))+1,\"\")","v":""},{"$f":"IF(A240<>\"\",$A$3&A240,\"\")","v":""}]
[{"$f":"IF($E241<>\"\",MAX($A$1:INDIRECT(CONCATENATE(\"$A$\",ROW()-1)))+1,\"\")","v":""},{"$f":"IF(A241<>\"\",$A$3&A241,\"\")","v":""},null," Carried forward / …"]
[{"$f":"IF($E242<>\"\",MAX($A$1:INDIRECT(CONCATENATE(\"$A$\",ROW()-1)))+1,\"\")","v":""},"",null," Brought forward / …"]
[{"$f":"IF($E243<>\"\",MAX($A$1:INDIRECT(CONCATENATE(\"$A$\",ROW()-1)))+1,\"\")","v":""},""]
[{"$f":"IF($E244<>\"\",MAX($A$1:INDIRECT(CONCATENATE(\"$A$\",ROW()-1)))+1,\"\")","v":""},{"$f":"IF(A244<>\"\",$A$3&A244,\"\")","v":""},"DWS 1810","SPECIALIST SERVICES"]
[]
[{"$f":"IF($E246<>\"\",MAX($A$1:INDIRECT(CONCATENATE(\"$A$\",ROW()-1)))+1,\"\")","v":81},{"$f":"IF(A246<>\"\",$A$3&A246,\"\")","v":"C5.81"},10.199999999999999,"Testing for watertightness (5Ml reservoir)","Sum",1]
[{"$f":"IF($E247<>\"\",MAX($A$1:INDIRECT(CONCATENATE(\"$A$\",ROW()-1)))+1,\"\")","v":""},{"$f":"IF(A247<>\"\",$A$3&A247,\"\")","v":""}]
[{"$f":"IF($E248<>\"\",MAX($A$1:INDIRECT(CONCATENATE(\"$A$\",ROW()-1)))+1,\"\")","v":82},{"$f":"IF(A248<>\"\",$A$3&A248,\"\")","v":"C5.82"},10.3,"Sterilization (5 Ml reservoir)","Sum",1]
[{"$f":"IF($E249<>\"\",MAX($A$1:INDIRECT(CONCATENATE(\"$A$\",ROW()-1)))+1,\"\")","v":""},{"$f":"IF(A249<>\"\",$A$3&A249,\"\")","v":""}]
[{"$f":"IF($E250<>\"\",MAX($A$1:INDIRECT(CONCATENATE(\"$A$\",ROW()-1)))+1,\"\")","v":83},{"$f":"IF(A250<>\"\",$A$3&A250,\"\")","v":"C5.83"},10.4,"Crushed stone on reservoir roof (19 mm clean washed aggregate, 80 mm thick)","m3",85]
[]
[{"$f":"IF($E252<>\"\",MAX($A$1:INDIRECT(CONCATENATE(\"$A$\",ROW()-1)))+1,\"\")","v":84},{"$f":"IF(A252<>\"\",$A$3&A252,\"\")","v":"C5.84"},10.5,"Lightning Protection (5Ml reservoir)","Sum",1]
[]
[]
[{"$f":"IF($E255<>\"\",MAX($A$1:INDIRECT(CONCATENATE(\"$A$\",ROW()-1)))+1,\"\")","v":""},{"$f":"IF(A255<>\"\",$A$3&A255,\"\")","v":""},"DWS1130","SUPPLY OF SPECIALS"]
[{"$f":"IF($E256<>\"\",MAX($A$1:INDIRECT(CONCATENATE(\"$A$\",ROW()-1)))+1,\"\")","v":""},""]
[{"$f":"IF($E257<>\"\",MAX($A$1:INDIRECT(CONCATENATE(\"$A$\",ROW()-1)))+1,\"\")","v":""},"","10","Supply of the following SS 316 pipe specials, PN 10 with all jointing material as per Dwg. No. 106777-0503-DRG-ST-0405"]
[{"$f":"IF($E258<>\"\",MAX($A$1:INDIRECT(CONCATENATE(\"$A$\",ROW()-1)))+1,\"\")","v":""},""]
[{"$f":"IF($E259<>\"\",MAX($A$1:INDIRECT(CONCATENATE(\"$A$\",ROW()-1)))+1,\"\")","v":85},"C5.85",null,"DN 600 Inlet bend with extension end and bellmouth, 6mm wall thickness","No",1]
[{"$f":"IF($E260<>\"\",MAX($A$1:INDIRECT(CONCATENATE(\"$A$\",ROW()-1)))+1,\"\")","v":""},""]
[{"$f":"IF($E261<>\"\",MAX($A$1:INDIRECT(CONCATENATE(\"$A$\",ROW()-1)))+1,\"\")","v":86},"C5.86",null,"DN 600 overflow bend with extension end 6mm wall thickness","No",1]
[{"$f":"IF($E262<>\"\",MAX($A$1:INDIRECT(CONCATENATE(\"$A$\",ROW()-1)))+1,\"\")","v":""},""]
[{"$f":"IF($E263<>\"\",MAX($A$1:INDIRECT(CONCATENATE(\"$A$\",ROW()-1)))+1,\"\")","v":87},"C5.87",null,"DN 600 overflow pipe with bellmouth, 6mm wall thickness","No",1]
[{"$f":"IF($E264<>\"\",MAX($A$1:INDIRECT(CONCATENATE(\"$A$\",ROW()-1)))+1,\"\")","v":""},""]
[{"$f":"IF($E265<>\"\",MAX($A$1:INDIRECT(CONCATENATE(\"$A$\",ROW()-1)))+1,\"\")","v":88},"C5.88",null,"DN 600 outlet pipe, 6mm wall thickness","No",1]
[{"$f":"IF($E266<>\"\",MAX($A$1:INDIRECT(CONCATENATE(\"$A$\",ROW()-1)))+1,\"\")","v":""},""]
[{"$f":"IF($E267<>\"\",MAX($A$1:INDIRECT(CONCATENATE(\"$A$\",ROW()-1)))+1,\"\")","v":89},"C5.89",null,"DN 250 scour bend with extension end and bellmouth, 4mm wall thickness","No",1]
[{"$f":"IF($E268<>\"\",MAX($A$1:INDIRECT(CONCATENATE(\"$A$\",ROW()-1)))+1,\"\")","v":""},""]
[{"$f":"IF($E269<>\"\",MAX($A$1:INDIRECT(CONCATENATE(\"$A$\",ROW()-1)))+1,\"\")","v":""},"","SANS"]
[{"$f":"IF($E270<>\"\",MAX($A$1:INDIRECT(CONCATENATE(\"$A$\",ROW()-1)))+1,\"\")","v":""},"","1200 LE\nPSLE 8.2.14","Supply and install subsurface drains complete:"]
[{"$f":"IF($E271<>\"\",MAX($A$1:INDIRECT(CONCATENATE(\"$A$\",ROW()-1)))+1,\"\")","v":""},""]
[{"$f":"IF($E272<>\"\",MAX($A$1:INDIRECT(CONCATENATE(\"$A$\",ROW()-1)))+1,\"\")","v":90},"C5.90",null,"110mm dia uPVC subsoil drain complete as per Dwg No. 106777-0502-DRG-CC-0209 & 106777-0503-DRG-ST-0401","m",110]
[{"$f":"IF($E273<>\"\",MAX($A$1:INDIRECT(CONCATENATE(\"$A$\",ROW()-1)))+1,\"\")","v":""},""]
[{"$f":"IF($E274<>\"\",MAX($A$1:INDIRECT(CONCATENATE(\"$A$\",ROW()-1)))+1,\"\")","v":91},"C5.91",null,"110mm dia uPVC ring subsoil system complete as per Dwg No. 106777-0502-DRG-CC-0209 & 106777-0503-DRG-ST-0401","m",120]
[{"$f":"IF($E275<>\"\",MAX($A$1:INDIRECT(CONCATENATE(\"$A$\",ROW()-1)))+1,\"\")","v":""},""]
[{"$f":"IF($E276<>\"\",MAX($A$1:INDIRECT(CONCATENATE(\"$A$\",ROW()-1)))+1,\"\")","v":92},"C5.92",null,"110mm dia uPVC Class 34 (solid wall) as per Dwg No. 106777-0502-DRG-CC-0209 & 106777-0503-DRG-ST-0401","m",90]
[]
[]
[]
[{"$f":"IF($E280<>\"\",MAX($A$1:INDIRECT(CONCATENATE(\"$A$\",ROW()-1)))+1,\"\")","v":""},{"$f":"IF(A280<>\"\",$A$3&A280,\"\")","v":""},null," Carried forward / …"]
[{"$f":"IF($E281<>\"\",MAX($A$1:INDIRECT(CONCATENATE(\"$A$\",ROW()-1)))+1,\"\")","v":""},"",null," Brought forward / …"]
[]
[{"$f":"IF($E283<>\"\",MAX($A$1:INDIRECT(CONCATENATE(\"$A$\",ROW()-1)))+1,\"\")","v":""},"","PSLE 8.2.15","Rodding eye with cap for subsoil pipes, complete with mass concrete encasement as per Dwg. No. 106777-0503-DRG-ST-0401 "]
[{"$f":"IF($E284<>\"\",MAX($A$1:INDIRECT(CONCATENATE(\"$A$\",ROW()-1)))+1,\"\")","v":""},""]
[{"$f":"IF($E285<>\"\",MAX($A$1:INDIRECT(CONCATENATE(\"$A$\",ROW()-1)))+1,\"\")","v":93},"C5.93",null,"110mm dia uPVC","No",6]
[{"$f":"IF($E286<>\"\",MAX($A$1:INDIRECT(CONCATENATE(\"$A$\",ROW()-1)))+1,\"\")","v":""},""]
[{"$f":"IF($E287<>\"\",MAX($A$1:INDIRECT(CONCATENATE(\"$A$\",ROW()-1)))+1,\"\")","v":""},""]
[{"$f":"IF($E288<>\"\",MAX($A$1:INDIRECT(CONCATENATE(\"$A$\",ROW()-1)))+1,\"\")","v":""},"","PD 11","BUILDING WORK"]
[{"$f":"IF($E289<>\"\",MAX($A$1:INDIRECT(CONCATENATE(\"$A$\",ROW()-1)))+1,\"\")","v":""},""]
[{"$f":"IF($E290<>\"\",MAX($A$1:INDIRECT(CONCATENATE(\"$A$\",ROW()-1)))+1,\"\")","v":""},"",11.01,"Brickwork:"]
[{"$f":"IF($E291<>\"\",MAX($A$1:INDIRECT(CONCATENATE(\"$A$\",ROW()-1)))+1,\"\")","v":""},""]
[{"$f":"IF($E292<>\"\",MAX($A$1:INDIRECT(CONCATENATE(\"$A$\",ROW()-1)))+1,\"\")","v":""},"",null,"Brick walls in Corobrick NFP 7 MPa non-facing bricks (including brick reinforcing) for:"]
[{"$f":"IF($E293<>\"\",MAX($A$1:INDIRECT(CONCATENATE(\"$A$\",ROW()-1)))+1,\"\")","v":""},""]
[{"$f":"IF($E294<>\"\",MAX($A$1:INDIRECT(CONCATENATE(\"$A$\",ROW()-1)))+1,\"\")","v":94},"C5.94",null,"230mm thick wall around outlet sump, 0.5m high as per Dwg. No 106777-0503-DRG-ST-0405","m2",5]
[]
[]
[{"$f":"IF($E297<>\"\",MAX($A$1:INDIRECT(CONCATENATE(\"$A$\",ROW()-1)))+1,\"\")","v":""},{"$f":"IF(A297<>\"\",$A$3&A297,\"\")","v":""}]
[]
[]
[]
[]
[]
[]
[]
[]
[]
[]
[]
[]
[]
[]
[]
[]
[]
[]
[]
[]
[]
[]
[]
[]
[]
[]
[]
[]
[{"$f":"IF($E326<>\"\",MAX($A$1:INDIRECT(CONCATENATE(\"$A$\",ROW()-1)))+1,\"\")","v":""},""]
[{"$f":"IF($E327<>\"\",MAX($A$1:INDIRECT(CONCATENATE(\"$A$\",ROW()-1)))+1,\"\")","v":""},""]
[{"$f":"IF($E328<>\"\",MAX($A$1:INDIRECT(CONCATENATE(\"$A$\",ROW()-1)))+1,\"\")","v":""},""]
[{"$f":"IF($E329<>\"\",MAX($A$1:INDIRECT(CONCATENATE(\"$A$\",ROW()-1)))+1,\"\")","v":""},null,null,{"$f":"\" TOTAL SECTION \"&$A$3&\":\n Carried to Summary\"","v":" TOTAL SECTION C5.:\n Carried to Summary"},null,null,"R"]

{"sheet":"Section C6","index":9,"n_rows":147,"n_cols":8,"rows_kept":147,"cut":false,"hidden":false,"merged":[]}
["Item No","Item No","Payment Clause","Short Description","Unit","Quantity","Rate","Amount\n R             c"]
[]
["C6.",null,"SANS","SECTION: C6"]
[null,null,"1200 C","RIVER PROTECTION AND CROSSINGS"]
[]
[{"$f":"IF($E6<>\"\",MAX($A$1:INDIRECT(CONCATENATE(\"$A$\",ROW()-1)))+1,\"\")","v":""},{"$f":"IF(A6<>\"\",$A$3&A6,\"\")","v":""},null,"Site Clearance"]
[{"$f":"IF($E7<>\"\",MAX($A$1:INDIRECT(CONCATENATE(\"$A$\",ROW()-1)))+1,\"\")","v":""},""]
[{"$f":"IF($E8<>\"\",MAX($A$1:INDIRECT(CONCATENATE(\"$A$\",ROW()-1)))+1,\"\")","v":1},"C6.1","8.2.1\nPSC 8.2.1","Clear and grub vegetation and trees including tree stumps (Max tree girth 1.0 m)","m2",200]
[{"$f":"IF($E9<>\"\",MAX($A$1:INDIRECT(CONCATENATE(\"$A$\",ROW()-1)))+1,\"\")","v":""},""]
[{"$f":"IF($E10<>\"\",MAX($A$1:INDIRECT(CONCATENATE(\"$A$\",ROW()-1)))+1,\"\")","v":""},"","8.2.2","Remove and grub trees and tree stumps of girth"]
[{"$f":"IF($E11<>\"\",MAX($A$1:INDIRECT(CONCATENATE(\"$A$\",ROW()-1)))+1,\"\")","v":""},""]
[{"$f":"IF($E12<>\"\",MAX($A$1:INDIRECT(CONCATENATE(\"$A$\",ROW()-1)))+1,\"\")","v":""},"",null,"Over      and       Up to"]
[{"$f":"IF($E13<>\"\",MAX($A$1:INDIRECT(CONCATENATE(\"$A$\",ROW()-1)))+1,\"\")","v":""},""]
[{"$f":"IF($E14<>\"\",MAX($A$1:INDIRECT(CONCATENATE(\"$A$\",ROW()-1)))+1,\"\")","v":2},"C6.2",null,"1 m                     2 m","No",1]
[{"$f":"IF($E15<>\"\",MAX($A$1:INDIRECT(CONCATENATE(\"$A$\",ROW()-1)))+1,\"\")","v":""},""]
[{"$f":"IF($E16<>\"\",MAX($A$1:INDIRECT(CONCATENATE(\"$A$\",ROW()-1)))+1,\"\")","v":3},"C6.3",null,"2 m                     3 m","No",1]
[{"$f":"IF($E17<>\"\",MAX($A$1:INDIRECT(CONCATENATE(\"$A$\",ROW()-1)))+1,\"\")","v":""},""]
[{"$f":"IF($E18<>\"\",MAX($A$1:INDIRECT(CONCATENATE(\"$A$\",ROW()-1)))+1,\"\")","v":4},"C6.4","PSC 8.2.11","Take down existing fence and reinstate (stock fence up to 1.8 m high)","m",200]
[{"$f":"IF($E19<>\"\",MAX($A$1:INDIRECT(CONCATENATE(\"$A$\",ROW()-1)))+1,\"\")","v":""},""]
[{"$f":"IF($E20<>\"\",MAX($A$1:INDIRECT(CONCATENATE(\"$A$\",ROW()-1)))+1,\"\")","v":5},"C6.5","PSC 8.2.10","Remove 150 mm thick layer of topsoil to stockpile and maintain","m³",30]
[{"$f":"IF($E21<>\"\",MAX($A$1:INDIRECT(CONCATENATE(\"$A$\",ROW()-1)))+1,\"\")","v":""},""]
[{"$f":"IF($E22<>\"\",MAX($A$1:INDIRECT(CONCATENATE(\"$A$\",ROW()-1)))+1,\"\")","v":6},"C6.6","1200 D\n8.3.10\nPSD 8.3.10","Topsoiling","m²",30]
[{"$f":"IF($E23<>\"\",MAX($A$1:INDIRECT(CONCATENATE(\"$A$\",ROW()-1)))+1,\"\")","v":""},""]
[{"$f":"IF($E24<>\"\",MAX($A$1:INDIRECT(CONCATENATE(\"$A$\",ROW()-1)))+1,\"\")","v":7},"C6.7","1200 A\nPSA 8.10","Temporary fencing where existing fencing has been taken down","m",500]
[{"$f":"IF($E25<>\"\",MAX($A$1:INDIRECT(CONCATENATE(\"$A$\",ROW()-1)))+1,\"\")","v":""},""," "]
[{"$f":"IF($E26<>\"\",MAX($A$1:INDIRECT(CONCATENATE(\"$A$\",ROW()-1)))+1,\"\")","v":""},"","1200 D","EARTHWORKS"]
[{"$f":"IF($E27<>\"\",MAX($A$1:INDIRECT(CONCATENATE(\"$A$\",ROW()-1)))+1,\"\")","v":""},""]
[{"$f":"IF($E28<>\"\",MAX($A$1:INDIRECT(CONCATENATE(\"$A$\",ROW()-1)))+1,\"\")","v":""},"",null,"Bulk Excavation"]
[{"$f":"IF($E29<>\"\",MAX($A$1:INDIRECT(CONCATENATE(\"$A$\",ROW()-1)))+1,\"\")","v":""},""]
[{"$f":"IF($E30<>\"\",MAX($A$1:INDIRECT(CONCATENATE(\"$A$\",ROW()-1)))+1,\"\")","v":8},"C6.8","8.3.2\nPSD 8.3.2\n","Excavate in all materials and dispose","m³",500]
[{"$f":"IF($E31<>\"\",MAX($A$1:INDIRECT(CONCATENATE(\"$A$\",ROW()-1)))+1,\"\")","v":""},""]
[{"$f":"IF($E32<>\"\",MAX($A$1:INDIRECT(CONCATENATE(\"$A$\",ROW()-1)))+1,\"\")","v":""},"","8.3.2\nPSD 8.3.2","Extra Over Item C6.8 Bulk Excavations above:"]
[{"$f":"IF($E33<>\"\",MAX($A$1:INDIRECT(CONCATENATE(\"$A$\",ROW()-1)))+1,\"\")","v":""},""]
[{"$f":"IF($E34<>\"\",MAX($A$1:INDIRECT(CONCATENATE(\"$A$\",ROW()-1)))+1,\"\")","v":9},"C6.9"," ","Hard rock excavation","m3",200]
[{"$f":"IF($E35<>\"\",MAX($A$1:INDIRECT(CONCATENATE(\"$A$\",ROW()-1)))+1,\"\")","v":""},""]
[{"$f":"IF($E36<>\"\",MAX($A$1:INDIRECT(CONCATENATE(\"$A$\",ROW()-1)))+1,\"\")","v":10},"C6.10","8.3.3\nPSDB 8.3.3","Hand excavation and backfill where ordered by the Engineer","m3",100]
[]
[]
[]
[]
[]
[]
[]
[]
[]
[]
[{"$f":"IF($E47<>\"\",MAX($A$1:INDIRECT(CONCATENATE(\"$A$\",ROW()-1)))+1,\"\")","v":""},{"$f":"IF(A47<>\"\",$A$3&A47,\"\")","v":""},null," Carried forward / …"]
[{"$f":"IF($E48<>\"\",MAX($A$1:INDIRECT(CONCATENATE(\"$A$\",ROW()-1)))+1,\"\")","v":""},"",null," Brought forward / …"]
[]
[{"$f":"IF($E50<>\"\",MAX($A$1:INDIRECT(CONCATENATE(\"$A$\",ROW()-1)))+1,\"\")","v":""},null,"DWS 0750","CONCRETE  (STRUCTURAL)"]
[{"$f":"IF($E51<>\"\",MAX($A$1:INDIRECT(CONCATENATE(\"$A$\",ROW()-1)))+1,\"\")","v":""},null," "]
[{"$f":"IF($E52<>\"\",MAX($A$1:INDIRECT(CONCATENATE(\"$A$\",ROW()-1)))+1,\"\")","v":""},null,null,"Scheduled formwork items"]
[{"$f":"IF($E53<>\"\",MAX($A$1:INDIRECT(CONCATENATE(\"$A$\",ROW()-1)))+1,\"\")","v":""},{"$f":"IF(A53<>\"\",$A$3&A53,\"\")","v":""}]
[11,"C6.11","15.3","Rough Vertical Formwork","m²",30]
[]
[{"$f":"IF($E56<>\"\",MAX($A$1:INDIRECT(CONCATENATE(\"$A$\",ROW()-1)))+1,\"\")","v":""},"",null,"SCHEDULED REINFORCEMENT ITEMS"]
[{"$f":"IF($E57<>\"\",MAX($A$1:INDIRECT(CONCATENATE(\"$A$\",ROW()-1)))+1,\"\")","v":""},""]
[{"$f":"IF($E58<>\"\",MAX($A$1:INDIRECT(CONCATENATE(\"$A$\",ROW()-1)))+1,\"\")","v":12},"C6.12","15.2","High Tensile steel bars","kg",615]
[{"$f":"IF($E59<>\"\",MAX($A$1:INDIRECT(CONCATENATE(\"$A$\",ROW()-1)))+1,\"\")","v":""},""]
[{"$f":"IF($E60<>\"\",MAX($A$1:INDIRECT(CONCATENATE(\"$A$\",ROW()-1)))+1,\"\")","v":""},"",null,"SCHEDULED CONCRETE ITEMS"]
[{"$f":"IF($E61<>\"\",MAX($A$1:INDIRECT(CONCATENATE(\"$A$\",ROW()-1)))+1,\"\")","v":""},""]
[{"$f":"IF($E62<>\"\",MAX($A$1:INDIRECT(CONCATENATE(\"$A$\",ROW()-1)))+1,\"\")","v":""},"","15.15","Blinding Layer"]
[{"$f":"IF($E63<>\"\",MAX($A$1:INDIRECT(CONCATENATE(\"$A$\",ROW()-1)))+1,\"\")","v":""},""]
[{"$f":"IF($E64<>\"\",MAX($A$1:INDIRECT(CONCATENATE(\"$A$\",ROW()-1)))+1,\"\")","v":""},"",null,"Class 15 MPa / 19 mm concrete of"]
[{"$f":"IF($E65<>\"\",MAX($A$1:INDIRECT(CONCATENATE(\"$A$\",ROW()-1)))+1,\"\")","v":""},""]
[{"$f":"IF($E66<>\"\",MAX($A$1:INDIRECT(CONCATENATE(\"$A$\",ROW()-1)))+1,\"\")","v":13},"C6.13",null,"50 mm thickness","m²",15]
[{"$f":"IF($E67<>\"\",MAX($A$1:INDIRECT(CONCATENATE(\"$A$\",ROW()-1)))+1,\"\")","v":""},""]
[{"$f":"IF($E68<>\"\",MAX($A$1:INDIRECT(CONCATENATE(\"$A$\",ROW()-1)))+1,\"\")","v":""},"","15.1","Strength Concrete"]
[{"$f":"IF($E69<>\"\",MAX($A$1:INDIRECT(CONCATENATE(\"$A$\",ROW()-1)))+1,\"\")","v":""},""]
[{"$f":"IF($E70<>\"\",MAX($A$1:INDIRECT(CONCATENATE(\"$A$\",ROW()-1)))+1,\"\")","v":""},"",null,"Class 25 MPa / 19 mm concrete to:"]
[{"$f":"IF($E71<>\"\",MAX($A$1:INDIRECT(CONCATENATE(\"$A$\",ROW()-1)))+1,\"\")","v":""},""]
[{"$f":"IF($E72<>\"\",MAX($A$1:INDIRECT(CONCATENATE(\"$A$\",ROW()-1)))+1,\"\")","v":14},"C6.14",null,"Top of walkway","m³",5]
[{"$f":"IF($E73<>\"\",MAX($A$1:INDIRECT(CONCATENATE(\"$A$\",ROW()-1)))+1,\"\")","v":""},""]
[{"$f":"IF($E74<>\"\",MAX($A$1:INDIRECT(CONCATENATE(\"$A$\",ROW()-1)))+1,\"\")","v":15},"C6.15",null,"Floor of walkway","m³",5]
[{"$f":"IF($E75<>\"\",MAX($A$1:INDIRECT(CONCATENATE(\"$A$\",ROW()-1)))+1,\"\")","v":""},""]
[{"$f":"IF($E76<>\"\",MAX($A$1:INDIRECT(CONCATENATE(\"$A$\",ROW()-1)))+1,\"\")","v":""},"","15.5","Unformed surface finishes"]
[{"$f":"IF($E77<>\"\",MAX($A$1:INDIRECT(CONCATENATE(\"$A$\",ROW()-1)))+1,\"\")","v":""},""]
[{"$f":"IF($E78<>\"\",MAX($A$1:INDIRECT(CONCATENATE(\"$A$\",ROW()-1)))+1,\"\")","v":""},"",null,"Wood-floated finishes to:"]
[{"$f":"IF($E79<>\"\",MAX($A$1:INDIRECT(CONCATENATE(\"$A$\",ROW()-1)))+1,\"\")","v":""},""]
[{"$f":"IF($E80<>\"\",MAX($A$1:INDIRECT(CONCATENATE(\"$A$\",ROW()-1)))+1,\"\")","v":16},"C6.16",null,"Horizontal Surfaces","m²",60]
[{"$f":"IF($E81<>\"\",MAX($A$1:INDIRECT(CONCATENATE(\"$A$\",ROW()-1)))+1,\"\")","v":""},""]
[null,null,"SANS"]
[{"$f":"IF($E83<>\"\",MAX($A$1:INDIRECT(CONCATENATE(\"$A$\",ROW()-1)))+1,\"\")","v":""},"","1200 DK","Gabions and Reno Mattresses"]
[{"$f":"IF($E84<>\"\",MAX($A$1:INDIRECT(CONCATENATE(\"$A$\",ROW()-1)))+1,\"\")","v":""},""]
[{"$f":"IF($E85<>\"\",MAX($A$1:INDIRECT(CONCATENATE(\"$A$\",ROW()-1)))+1,\"\")","v":""},"","8.2.2        PSDK 8.2.2","Gabions of galvanised wire,                              80 mm x 100 mm mesh, 2.7 mm dia wire:"]
[{"$f":"IF($E86<>\"\",MAX($A$1:INDIRECT(CONCATENATE(\"$A$\",ROW()-1)))+1,\"\")","v":""},""]
[{"$f":"IF($E87<>\"\",MAX($A$1:INDIRECT(CONCATENATE(\"$A$\",ROW()-1)))+1,\"\")","v":17},"C6.17",null,"2.0 m x 1.0 m, 0.5 m","m³",300]
[{"$f":"IF($E88<>\"\",MAX($A$1:INDIRECT(CONCATENATE(\"$A$\",ROW()-1)))+1,\"\")","v":""},""]
[{"$f":"IF($E89<>\"\",MAX($A$1:INDIRECT(CONCATENATE(\"$A$\",ROW()-1)))+1,\"\")","v":18},"C6.18",null,"2.0 m x 1.0 m x 1.0 m","m³",300]
[{"$f":"IF($E90<>\"\",MAX($A$1:INDIRECT(CONCATENATE(\"$A$\",ROW()-1)))+1,\"\")","v":""},""]
[{"$f":"IF($E91<>\"\",MAX($A$1:INDIRECT(CONCATENATE(\"$A$\",ROW()-1)))+1,\"\")","v":""},"","8.2.2        PSDK 8.2.2","Reno mattresses of galvanised wire, 60 mm x 100 mm mesh, 2.2 mm dia wire:"]
[{"$f":"IF($E92<>\"\",MAX($A$1:INDIRECT(CONCATENATE(\"$A$\",ROW()-1)))+1,\"\")","v":""},""]
[{"$f":"IF($E93<>\"\",MAX($A$1:INDIRECT(CONCATENATE(\"$A$\",ROW()-1)))+1,\"\")","v":19},"C6.19"," ","2.0 m x 1.0 m 0.3 m","m³",250]
[]
[{"$f":"IF($E95<>\"\",MAX($A$1:INDIRECT(CONCATENATE(\"$A$\",ROW()-1)))+1,\"\")","v":""},{"$f":"IF(A95<>\"\",$A$3&A95,\"\")","v":""},"8.2.4","Geotextile"]
[{"$f":"IF($E96<>\"\",MAX($A$1:INDIRECT(CONCATENATE(\"$A$\",ROW()-1)))+1,\"\")","v":""},""]
[{"$f":"IF($E97<>\"\",MAX($A$1:INDIRECT(CONCATENATE(\"$A$\",ROW()-1)))+1,\"\")","v":20},"C6.20",null,"Supply and place geotextile Mactex 20.2 or equal approved behind gabions and mattresses","m²",1650]
[]
[{"$f":"IF($E99<>\"\",MAX($A$1:INDIRECT(CONCATENATE(\"$A$\",ROW()-1)))+1,\"\")","v":""},{"$f":"IF(A99<>\"\",$A$3&A99,\"\")","v":""},null," Carried forward / …"]
[{"$f":"IF($E100<>\"\",MAX($A$1:INDIRECT(CONCATENATE(\"$A$\",ROW()-1)))+1,\"\")","v":""},"",null," Brought forward / …"]
[]
[{"$f":"IF($E102<>\"\",MAX($A$1:INDIRECT(CONCATENATE(\"$A$\",ROW()-1)))+1,\"\")","v":""},"","SANS"]
[{"$f":"IF($E103<>\"\",MAX($A$1:INDIRECT(CONCATENATE(\"$A$\",ROW()-1)))+1,\"\")","v":""},"","1200 LE          8.2.2","Culverts"]
[{"$f":"IF($E104<>\"\",MAX($A$1:INDIRECT(CONCATENATE(\"$A$\",ROW()-1)))+1,\"\")","v":""},""]
[{"$f":"IF($E105<>\"\",MAX($A$1:INDIRECT(CONCATENATE(\"$A$\",ROW()-1)))+1,\"\")","v":21},"C6.21",null,"1200 x 1200 mm box culvert","No",15]
[{"$f":"IF($E106<>\"\",MAX($A$1:INDIRECT(CONCATENATE(\"$A$\",ROW()-1)))+1,\"\")","v":""},""]
[{"$f":"IF($E107<>\"\",MAX($A$1:INDIRECT(CONCATENATE(\"$A$\",ROW()-1)))+1,\"\")","v":""},"","DWS 0750","CONCRETE FOR CAUSEWAY"]
[{"$f":"IF($E108<>\"\",MAX($A$1:INDIRECT(CONCATENATE(\"$A$\",ROW()-1)))+1,\"\")","v":""},""," "]
[{"$f":"IF($E109<>\"\",MAX($A$1:INDIRECT(CONCATENATE(\"$A$\",ROW()-1)))+1,\"\")","v":""},"",null,"Scheduled formwork items"]
[{"$f":"IF($E110<>\"\",MAX($A$1:INDIRECT(CONCATENATE(\"$A$\",ROW()-1)))+1,\"\")","v":""},""]
[{"$f":"IF($E111<>\"\",MAX($A$1:INDIRECT(CONCATENATE(\"$A$\",ROW()-1)))+1,\"\")","v":22},"C6.22","15.3","Rough Vertical Formwork","m²",10]
[{"$f":"IF($E112<>\"\",MAX($A$1:INDIRECT(CONCATENATE(\"$A$\",ROW()-1)))+1,\"\")","v":""},""]
[{"$f":"IF($E113<>\"\",MAX($A$1:INDIRECT(CONCATENATE(\"$A$\",ROW()-1)))+1,\"\")","v":""},"",null,"SCHEDULED REINFORCEMENT ITEMS"]
[{"$f":"IF($E114<>\"\",MAX($A$1:INDIRECT(CONCATENATE(\"$A$\",ROW()-1)))+1,\"\")","v":""},""]
[{"$f":"IF($E115<>\"\",MAX($A$1:INDIRECT(CONCATENATE(\"$A$\",ROW()-1)))+1,\"\")","v":23},"C6.23","15.2","High Tensile steel bars","kg",1100]
[{"$f":"IF($E116<>\"\",MAX($A$1:INDIRECT(CONCATENATE(\"$A$\",ROW()-1)))+1,\"\")","v":""},""]
[{"$f":"IF($E117<>\"\",MAX($A$1:INDIRECT(CONCATENATE(\"$A$\",ROW()-1)))+1,\"\")","v":""},"",null,"SCHEDULED CONCRETE ITEMS"]
[{"$f":"IF($E118<>\"\",MAX($A$1:INDIRECT(CONCATENATE(\"$A$\",ROW()-1)))+1,\"\")","v":""},""]
[{"$f":"IF($E119<>\"\",MAX($A$1:INDIRECT(CONCATENATE(\"$A$\",ROW()-1)))+1,\"\")","v":""},"","15.1","Strength Concrete"]
[{"$f":"IF($E120<>\"\",MAX($A$1:INDIRECT(CONCATENATE(\"$A$\",ROW()-1)))+1,\"\")","v":""},""]
[{"$f":"IF($E121<>\"\",MAX($A$1:INDIRECT(CONCATENATE(\"$A$\",ROW()-1)))+1,\"\")","v":""},"",null,"Class 25 MPa / 19 mm concrete to:"]
[{"$f":"IF($E122<>\"\",MAX($A$1:INDIRECT(CONCATENATE(\"$A$\",ROW()-1)))+1,\"\")","v":""},""]
[{"$f":"IF($E123<>\"\",MAX($A$1:INDIRECT(CONCATENATE(\"$A$\",ROW()-1)))+1,\"\")","v":24},"C6.24",null,"Concrete Causeway","m³",15]
[{"$f":"IF($E124<>\"\",MAX($A$1:INDIRECT(CONCATENATE(\"$A$\",ROW()-1)))+1,\"\")","v":""},""]
[{"$f":"IF($E125<>\"\",MAX($A$1:INDIRECT(CONCATENATE(\"$A$\",ROW()-1)))+1,\"\")","v":""},"","15.5","Unformed surface finishes"]
[{"$f":"IF($E126<>\"\",MAX($A$1:INDIRECT(CONCATENATE(\"$A$\",ROW()-1)))+1,\"\")","v":""},""]
[{"$f":"IF($E127<>\"\",MAX($A$1:INDIRECT(CONCATENATE(\"$A$\",ROW()-1)))+1,\"\")","v":""},"",null,"Wood-floated finishes to:"]
[{"$f":"IF($E128<>\"\",MAX($A$1:INDIRECT(CONCATENATE(\"$A$\",ROW()-1)))+1,\"\")","v":""},""]
[{"$f":"IF($E129<>\"\",MAX($A$1:INDIRECT(CONCATENATE(\"$A$\",ROW()-1)))+1,\"\")","v":25},"C6.25",null,"Horizontal Surfaces","m²",80]
[{"$f":"IF($E130<>\"\",MAX($A$1:INDIRECT(CONCATENATE(\"$A$\",ROW()-1)))+1,\"\")","v":""},""]
[{"$f":"IF($E131<>\"\",MAX($A$1:INDIRECT(CONCATENATE(\"$A$\",ROW()-1)))+1,\"\")","v":""},"",null,"MISCELLANEOUS"]
[{"$f":"IF($E132<>\"\",MAX($A$1:INDIRECT(CONCATENATE(\"$A$\",ROW()-1)))+1,\"\")","v":""},""]
[{"$f":"IF($E133<>\"\",MAX($A$1:INDIRECT(CONCATENATE(\"$A$\",ROW()-1)))+1,\"\")","v":26},"C6.26","1200 A\nPSA 8.10\nPSA 8.5.1","Environmental rehabiliation where required by the Engineer and Employer not covered under the specifications","Prov Sum","-","-",200000]
[{"$f":"IF($E134<>\"\",MAX($A$1:INDIRECT(CONCATENATE(\"$A$\",ROW()-1)))+1,\"\")","v":""},""]
[{"$f":"IF($E135<>\"\",MAX($A$1:INDIRECT(CONCATENATE(\"$A$\",ROW()-1)))+1,\"\")","v":27},"C6.27",null,"Percentage adjustment on the item above for Contractor's overheads and profit (State % and extend as an amount)","   %",200000]
[{"$f":"IF($E136<>\"\",MAX($A$1:INDIRECT(CONCATENATE(\"$A$\",ROW()-1)))+1,\"\")","v":""},""]
[{"$f":"IF($E137<>\"\",MAX($A$1:INDIRECT(CONCATENATE(\"$A$\",ROW()-1)))+1,\"\")","v":28},"C6.28",null,"Fencing in river, 1.2 m high, 6 wire strands as directed by the Engineer","Prov Sum","-","-",200000]
[{"$f":"IF($E138<>\"\",MAX($A$1:INDIRECT(CONCATENATE(\"$A$\",ROW()-1)))+1,\"\")","v":""},""]
[{"$f":"IF($E139<>\"\",MAX($A$1:INDIRECT(CONCATENATE(\"$A$\",ROW()-1)))+1,\"\")","v":29},"C6.29",null,"Percentage adjustment on the item above for Contractor's overheads and profit (State % and extend as an amount)","   %",200000]
[]
[]
[]
[]
[]
[]
[]
[{"$f":"IF($E147<>\"\",MAX($A$1:INDIRECT(CONCATENATE(\"$A$\",ROW()-1)))+1,\"\")","v":""},{"$f":"IF(A147<>\"\",$A$3&A147,\"\")","v":""},null," TOTAL SECTION C6:\n Carried to Summary",null,null,"R"]

{"sheet":"Section C7","index":10,"n_rows":521,"n_cols":9,"rows_kept":521,"cut":false,"hidden":false,"merged":[]}
["Item No","Item No","Payment Clause","Short Description","Unit","Quantity","Rate","Amount\n R             c"]
[]
["C7.",null,null,"SECTION: C7"]
[null,null,null,"PUMP STATION AND RESERVOIR:"]
[null,null,null,"ACCESS ROAD"]
[]
[null,null,"SANS"]
[null,null,"1200 C","Site Clearing"]
[]
[{"$f":"IF($E10<>\"\",MAX($A$1:INDIRECT(CONCATENATE(\"$A$\",ROW()-1)))+1,\"\")","v":1},{"$f":"IF(A10<>\"\",$A$3&A10,\"\")","v":"C7.1"},"\nPSC 8.2.1","Clear and grub areas of pump station and reservoir site, including internal access roads:","m²",15695]
[{"$f":"IF($E11<>\"\",MAX($A$1:INDIRECT(CONCATENATE(\"$A$\",ROW()-1)))+1,\"\")","v":""},""]
[{"$f":"IF($E12<>\"\",MAX($A$1:INDIRECT(CONCATENATE(\"$A$\",ROW()-1)))+1,\"\")","v":""},"","8.2.2","Remove and grub large trees and tree  stumps of girth:"]
[{"$f":"IF($E13<>\"\",MAX($A$1:INDIRECT(CONCATENATE(\"$A$\",ROW()-1)))+1,\"\")","v":""},""]
[2,"C7.2",null,"Over 1,0 m and up to and including 2,0 m","No",20]
[{"$f":"IF($E15<>\"\",MAX($A$1:INDIRECT(CONCATENATE(\"$A$\",ROW()-1)))+1,\"\")","v":""},""]
[{"$f":"IF($E16<>\"\",MAX($A$1:INDIRECT(CONCATENATE(\"$A$\",ROW()-1)))+1,\"\")","v":3},"C7.3",null,"Over 2,0 m and up to and including 3,0 m","No",5]
[{"$f":"IF($E17<>\"\",MAX($A$1:INDIRECT(CONCATENATE(\"$A$\",ROW()-1)))+1,\"\")","v":""},""]
[{"$f":"IF($E18<>\"\",MAX($A$1:INDIRECT(CONCATENATE(\"$A$\",ROW()-1)))+1,\"\")","v":4},"C7.4","PSC 8.2.11","Take down and re-erect existing fence","m",255]
[{"$f":"IF($E19<>\"\",MAX($A$1:INDIRECT(CONCATENATE(\"$A$\",ROW()-1)))+1,\"\")","v":""},""]
[5,{"$f":"IF(A20<>\"\",$A$3&A20,\"\")","v":"C7.5"},"8.2.10\nPSC 8.2.10","Remove topsoil to nominal depth of 150 mm and stockpile","m³",3055," "," "]
[{"$f":"IF($E21<>\"\",MAX($A$1:INDIRECT(CONCATENATE(\"$A$\",ROW()-1)))+1,\"\")","v":""},{"$f":"IF(A21<>\"\",$A$3&A21,\"\")","v":""}]
[{"$f":"IF($E22<>\"\",MAX($A$1:INDIRECT(CONCATENATE(\"$A$\",ROW()-1)))+1,\"\")","v":6},"C7.6",null,"Provisional sum for new fence material","Sum",1," ",50000," "]
[{"$f":"IF($E23<>\"\",MAX($A$1:INDIRECT(CONCATENATE(\"$A$\",ROW()-1)))+1,\"\")","v":""},""]
[{"$f":"IF($E24<>\"\",MAX($A$1:INDIRECT(CONCATENATE(\"$A$\",ROW()-1)))+1,\"\")","v":""},"",null,"EARTHWORKS"]
[{"$f":"IF($E25<>\"\",MAX($A$1:INDIRECT(CONCATENATE(\"$A$\",ROW()-1)))+1,\"\")","v":""},""]
[{"$f":"IF($E26<>\"\",MAX($A$1:INDIRECT(CONCATENATE(\"$A$\",ROW()-1)))+1,\"\")","v":""},""]
[{"$f":"IF($E27<>\"\",MAX($A$1:INDIRECT(CONCATENATE(\"$A$\",ROW()-1)))+1,\"\")","v":7},"C7.7","1200 DM\n8.3.4","Cut to fill for site access roads","m³",3610]
[null,""]
[8,"C7.8","1200 PSDM\n8.3.5","Import to fill for access roads, minimum G7 quality material ","m³",2930]
[{"$f":"IF($E30<>\"\",MAX($A$1:INDIRECT(CONCATENATE(\"$A$\",ROW()-1)))+1,\"\")","v":""},""]
[{"$f":"IF($E31<>\"\",MAX($A$1:INDIRECT(CONCATENATE(\"$A$\",ROW()-1)))+1,\"\")","v":9},"C7.9","PSD 8.3.14","Temporary stockpile of material","m³",500]
[{"$f":"IF($E32<>\"\",MAX($A$1:INDIRECT(CONCATENATE(\"$A$\",ROW()-1)))+1,\"\")","v":""},""]
[{"$f":"IF($E33<>\"\",MAX($A$1:INDIRECT(CONCATENATE(\"$A$\",ROW()-1)))+1,\"\")","v":""},"",null,"Extra-over for bulk excavation:"]
[{"$f":"IF($E34<>\"\",MAX($A$1:INDIRECT(CONCATENATE(\"$A$\",ROW()-1)))+1,\"\")","v":""},""]
[{"$f":"IF($E35<>\"\",MAX($A$1:INDIRECT(CONCATENATE(\"$A$\",ROW()-1)))+1,\"\")","v":10},"C7.10","8.3.2\nPSD 8.3.2","For hard rock excavation","m³",720]
[{"$f":"IF($E36<>\"\",MAX($A$1:INDIRECT(CONCATENATE(\"$A$\",ROW()-1)))+1,\"\")","v":""},""]
[{"$f":"IF($E37<>\"\",MAX($A$1:INDIRECT(CONCATENATE(\"$A$\",ROW()-1)))+1,\"\")","v":""},"",null,"Topsoiling (to 150 mm deep) from stockpile for:             "]
[{"$f":"IF($E38<>\"\",MAX($A$1:INDIRECT(CONCATENATE(\"$A$\",ROW()-1)))+1,\"\")","v":""},""]
[{"$f":"IF($E39<>\"\",MAX($A$1:INDIRECT(CONCATENATE(\"$A$\",ROW()-1)))+1,\"\")","v":11},"C7.11","8.3.10\nPSD 8.3.10","Embankments and cut slopes","m²",3400]
[{"$f":"IF($E40<>\"\",MAX($A$1:INDIRECT(CONCATENATE(\"$A$\",ROW()-1)))+1,\"\")","v":""},""]
[{"$f":"IF($E41<>\"\",MAX($A$1:INDIRECT(CONCATENATE(\"$A$\",ROW()-1)))+1,\"\")","v":12},"C7.12","8.3.11\n","Grassing of embankments by means of hydroseeding","m²",3400]
[]
[]
[]
[]
[]
[]
[]
[]
[{"$f":"IF($E50<>\"\",MAX($A$1:INDIRECT(CONCATENATE(\"$A$\",ROW()-1)))+1,\"\")","v":""},null,null," Carried forward / …"]
[{"$f":"IF($E51<>\"\",MAX($A$1:INDIRECT(CONCATENATE(\"$A$\",ROW()-1)))+1,\"\")","v":""},null,null," Brought forward / …"]
[]
[{"$f":"IF($E53<>\"\",MAX($A$1:INDIRECT(CONCATENATE(\"$A$\",ROW()-1)))+1,\"\")","v":""},"",null,"LAYERWORKS "]
[{"$f":"IF($E54<>\"\",MAX($A$1:INDIRECT(CONCATENATE(\"$A$\",ROW()-1)))+1,\"\")","v":""},""]
[null,null,"SANS"]
[{"$f":"IF($E56<>\"\",MAX($A$1:INDIRECT(CONCATENATE(\"$A$\",ROW()-1)))+1,\"\")","v":""},"","1200 DM","Treatment of roadbed"]
[{"$f":"IF($E57<>\"\",MAX($A$1:INDIRECT(CONCATENATE(\"$A$\",ROW()-1)))+1,\"\")","v":""},""]
[{"$f":"IF($E58<>\"\",MAX($A$1:INDIRECT(CONCATENATE(\"$A$\",ROW()-1)))+1,\"\")","v":13},"C7.13","8.3.3\nPSDM 8.3.3","Roadbed preparation and compaction of material to a minimum of 93% MOD AASHTO (or 100% for sand), 150 mm thick","m³",460]
[null,""]
[13,"C7.13","8.3.5","150 mm G7 selected material compacted to 93% MOD AASHTO","m³",460]
[]
[{"$f":"IF($E62<>\"\",MAX($A$1:INDIRECT(CONCATENATE(\"$A$\",ROW()-1)))+1,\"\")","v":""},"","1200 ME","Subbase:"]
[{"$f":"IF($E63<>\"\",MAX($A$1:INDIRECT(CONCATENATE(\"$A$\",ROW()-1)))+1,\"\")","v":""},""]
[{"$f":"IF($E64<>\"\",MAX($A$1:INDIRECT(CONCATENATE(\"$A$\",ROW()-1)))+1,\"\")","v":""},"","8.3.3\nPSME 8.3.3","Construct the subbase course using material from commercial sources."]
[{"$f":"IF($E65<>\"\",MAX($A$1:INDIRECT(CONCATENATE(\"$A$\",ROW()-1)))+1,\"\")","v":""},""]
[{"$f":"IF($E66<>\"\",MAX($A$1:INDIRECT(CONCATENATE(\"$A$\",ROW()-1)))+1,\"\")","v":14},"C7.14",null,"150 mm G5 wearing course compacted to 95% MOD AASHTO","m³",910]
[null,""]
[null,"","1200 MF","Base: "]
[null,""]
[null,null,null,"Construct base with material from commercial source:"]
[]
[15,{"$f":"IF(A72<>\"\",$A$3&A72,\"\")","v":"C7.15"},"8.3.3","150mm C4 Compacted to 96% MOD AASHTO","m³",80]
[null,""]
[null,"","1200 MJ","Segmented Paving"]
[null,""]
[null,null,null,"Construction of paving complete"]
[]
[16,{"$f":"IF(A78<>\"\",$A$3&A78,\"\")","v":"C7.16"},"8.2.2","80mm Thick Type S-A blocks on 20mm sand:","m²",510]
[null,""]
[null,"",null,"KERBING AND CHANNELING"]
[]
[null,null,"1200MK","Precast concrete edging as per DWG 106777-0003-DRG-CC-0286"]
[]
[null,null,"8.2.1","Kerb: type E1 (Fig.10)","m",300]
[null,""]
[{"$f":"IF($E86<>\"\",MAX($A$1:INDIRECT(CONCATENATE(\"$A$\",ROW()-1)))+1,\"\")","v":""},"","1200 MM","Ancillary Roadworks"]
[]
[17,{"$f":"IF(A88<>\"\",$A$3&A88,\"\")","v":"C7.17"},"8.2.1","Supply and erect galvanized guardrails on timber posts","m",40]
[{"$f":"IF($E89<>\"\",MAX($A$1:INDIRECT(CONCATENATE(\"$A$\",ROW()-1)))+1,\"\")","v":""},""]
[null,null,8.36,"Supply and erect permanent regulations road sign"]
[{"$f":"IF($E91<>\"\",MAX($A$1:INDIRECT(CONCATENATE(\"$A$\",ROW()-1)))+1,\"\")","v":""},""]
[{"$f":"IF($E92<>\"\",MAX($A$1:INDIRECT(CONCATENATE(\"$A$\",ROW()-1)))+1,\"\")","v":18},"C7.18",null,"\"STOP\" sign (R1) 610mm DIA","No",1]
[]
[]
[{"$f":"IF($E95<>\"\",MAX($A$1:INDIRECT(CONCATENATE(\"$A$\",ROW()-1)))+1,\"\")","v":""},""]
[]
[{"$f":"IF($E97<>\"\",MAX($A$1:INDIRECT(CONCATENATE(\"$A$\",ROW()-1)))+1,\"\")","v":""},null,null," Carried forward / …"]
[{"$f":"IF($E98<>\"\",MAX($A$1:INDIRECT(CONCATENATE(\"$A$\",ROW()-1)))+1,\"\")","v":""},null,null," Brought forward / …"]
[]
[null,null,null,"STORMWATER"]
[]
[null,null,"SANS"]
[{"$f":"IF($E103<>\"\",MAX($A$1:INDIRECT(CONCATENATE(\"$A$\",ROW()-1)))+1,\"\")","v":""},"","1200 DB","Pipe Trenching"]
[{"$f":"IF($E104<>\"\",MAX($A$1:INDIRECT(CONCATENATE(\"$A$\",ROW()-1)))+1,\"\")","v":""},""]
[19,"C7.19","8.3.2","Excavate in all materials for trenches, backfill, compact and dispose of surplus material for:"]
[{"$f":"IF($E106<>\"\",MAX($A$1:INDIRECT(CONCATENATE(\"$A$\",ROW()-1)))+1,\"\")","v":""},""]
[{"$f":"IF($E107<>\"\",MAX($A$1:INDIRECT(CONCATENATE(\"$A$\",ROW()-1)))+1,\"\")","v":""},"",null,"Pipes up to 600 mm dia for depths:"]
[{"$f":"IF($E108<>\"\",MAX($A$1:INDIRECT(CONCATENATE(\"$A$\",ROW()-1)))+1,\"\")","v":""},""]
[{"$f":"IF($E109<>\"\",MAX($A$1:INDIRECT(CONCATENATE(\"$A$\",ROW()-1)))+1,\"\")","v":""},"",null,"Over       and      Up to"]
[{"$f":"IF($E110<>\"\",MAX($A$1:INDIRECT(CONCATENATE(\"$A$\",ROW()-1)))+1,\"\")","v":""},""]
[{"$f":"IF($E111<>\"\",MAX($A$1:INDIRECT(CONCATENATE(\"$A$\",ROW()-1)))+1,\"\")","v":20},"C7.20",null,"0,0 m                  1,0 m","m",43]
[{"$f":"IF($E112<>\"\",MAX($A$1:INDIRECT(CONCATENATE(\"$A$\",ROW()-1)))+1,\"\")","v":""},""]
[{"$f":"IF($E113<>\"\",MAX($A$1:INDIRECT(CONCATENATE(\"$A$\",ROW()-1)))+1,\"\")","v":21},"C7.21",null,"1,0 m                  2,0 m","m",15]
[{"$f":"IF($E114<>\"\",MAX($A$1:INDIRECT(CONCATENATE(\"$A$\",ROW()-1)))+1,\"\")","v":""},""]
[20,"C7.20",null,"Side drains in all materials","m³",1210]
[{"$f":"IF($E116<>\"\",MAX($A$1:INDIRECT(CONCATENATE(\"$A$\",ROW()-1)))+1,\"\")","v":""},""]
[{"$f":"IF($E117<>\"\",MAX($A$1:INDIRECT(CONCATENATE(\"$A$\",ROW()-1)))+1,\"\")","v":22},"C7.22",null,"Additional excavation in all material for stone pitching","m³",1130]
[]
[null,{"$f":"IF(A119<>\"\",$A$3&A119,\"\")","v":""},"8.3.2","Extra-over item C1.17 for:"]
[null,""]
[22,"C7.22",null,"Excavate unsuitable material from trench bottom and dispose of off site","m³",30]
[{"$f":"IF($E122<>\"\",MAX($A$1:INDIRECT(CONCATENATE(\"$A$\",ROW()-1)))+1,\"\")","v":""},""]
[23,"C7.23","PSDB 8.4","Hard excavation","m³",480]
[null,""]
[null,"",null,"Excavation ancillaries"]
[null,""]
[null,null,null,"Make up deficiency in backfill material:"]
[null,""]
[24,"C7.24","8.3.3.1","From other necessary excavations on Site","m3",50]
[null,""]
[25,"C7.25","8.3.3.3","Additional compaction in road reserves ","m3",100]
[null,""]
[null,"",null,"SECTION LB: BEDDING (PIPES)"]
[null,""]
[null,"","1200 LB\n8.2.2.1","Provision of bedding from trench excavation "]
[null,""]
[26,"C7.26",null,"Selected granular material","m3",15]
[null,""]
[27,"C7.27",null,"Selected fill material","m3",20]
[null,""]
[null,"","8.2.2.1","From other necessary excavations:"]
[null,""]
[28,"C7.28",null,"Selected granular material","m3",15]
[null,""]
[29,"C7.29",null,"Selected fill material","m3",20]
[]
[]
[]
[]
[{"$f":"IF($E150<>\"\",MAX($A$1:INDIRECT(CONCATENATE(\"$A$\",ROW()-1)))+1,\"\")","v":""},null,null," Carried forward / …"]
[{"$f":"IF($E151<>\"\",MAX($A$1:INDIRECT(CONCATENATE(\"$A$\",ROW()-1)))+1,\"\")","v":""},null,null," Brought forward / …"]
[]
[null,"","8.2.2.3","From commercial sources: (Provisional)"]
[null,""]
[30,"C7.30",null,"Selected granular material","m3",15]
[null,""]
[31,"C7.31",null,"Selected fill material","m3",20]
[null,""]
[null,"",null,"Existing services that intersect or adjoin a trench"]
[null,""]
[null,"","PSDB 8.3.5","Services that intersect a trench:"]
[null,""]
[32,"C7.32",null,"Watermains up to 200 mm dia","No",1]
[]
[33,"C7.33",null,"Sewers up to 200 mm dia","No",1]
[null,""]
[34,"C7.34",null,"Stormwater pipes 300 mm to 600 mm dia","No",1]
[null,""]
[35,"C7.35",null,"Cables","No",1]
[]
[null,"",null,"Services that adjoin a trench:"]
[null,""]
[36,"C7.36",null,"Watermains up to 200 mm dia","m",1]
[null,""]
[37,"C7.37",null,"Sewers up to 200 mm dia","m",1]
[null,""]
[null,"",null,"SECTION LE: STORMWATER DRAINAGE"]
[]
[null,"","SANS"]
[null,"","1200 LE","Pipes"]
[null,""]
[null,"",null,"Supply, lay, joint and bed Class C reinforced concrete pipes Type SC Class 100D with ogee joints wrapped with geofabric"]
[null,{"$f":"IF(A183<>\"\",$A$3&A183,\"\")","v":""}]
[38,"C7.38","8.2.1","375 mm dia","m",65]
[null,""]
[39,"C7.39","8.2.1","450 mm dia","m",10]
[null,""]
[40,"C7.40","8.2.1","525 mm dia","m",10]
[]
[41,"C7.41","8.2.1","600 mm dia","m",15]
[null,""]
[null,"","1200 LE\n8.2.8","Headwalls"]
[null,"",null,"Supply and install Inlet Structure (Refer to DRG 106777-0502-DRG-CC-0287)"]
[null,""]
[42,"C7.42","PSLE 8.3","On pipes up to 450 mm dia","No",2]
[null,""]
[43,"C7.43","PSLE 8.3","On pipes up to 600 mm dia","No",2]
[]
[]
[]
[]
[{"$f":"IF($E202<>\"\",MAX($A$1:INDIRECT(CONCATENATE(\"$A$\",ROW()-1)))+1,\"\")","v":""},null,null," Carried forward / …"]
[{"$f":"IF($E203<>\"\",MAX($A$1:INDIRECT(CONCATENATE(\"$A$\",ROW()-1)))+1,\"\")","v":""},null,null," Brought forward / …"]
[]
[null,"",null,"Supply and install headwall (Refer to DRG 106777-0502-DRG-CC-0288)"]
[]
[44,"C7.44","PSLE 8.3","Pipes up to 450 mm dia","No",6]
[]
[45,"C7.45","PSLE 8.3","Pipe up to 600 mm dia","No",2]
[null,""]
[null,null,"SANS"]
[null,"","1200 DK","Gabions and Pitching"]
[null,""]
[null,"",null,"Medium grouted stone pitching for:"]
[null,""]
[46,"C7.46","8.2.5","Side drain","m2",3670]
[null,""]
[47,"C7.47","8.2.5","Headwall outlet","m2",25]
[null,""]
[null,"","DWA 0750","Concrete Small Works"]
[null,""]
[null,"",null,"Repair or replacement of existing road side drain at access road intersection with R409 Highway"]
[null,""]
[48,"C7.48",15.3,"Formwork: Rough ","m2",40]
[null,""]
[49,"C7.49",15.1,"20MPa Concrete","m3",20]
[null,""]
[]
[]
[]
[]
[]
[]
[]
[]
[]
[]
[]
[]
[]
[]
[]
[]
[]
[]
[]
[]
[]
[]
[]
[]
[]
[]
[]
[null,{"$f":"IF(A255<>\"\",$A$3&A255,\"\")","v":""}]
[null,""]
[null,null,null," TOTAL SECTION C7:\n Carried to Summary",null,null,"R"]
[null,""]
[null,""]
[null,""]
[null,""]
[null,""]
[null,""]
[null,""]
[null,""]
[null,""]
[null,""]
[null,""]
[null,""]
[null,""]
[null,""]
[null,""]
[null,""]
[null,""]
[null,""]
[null,""]
[null,""]
[null,""]
[null,""]
[null,""]
[null,""]
[null,""]
[null,""]
[null,""]
[null,""]
[null,""]
[null,""]
[null,""]
[null,""]
[null,""]
[null,""]
[null,""]
[null,""]
[null,""]
[null,""]
[null,""]
[null,""]
[null,""]
[null,""]
[null,""]
[null,""]
[null,""]
[null,""]
[null,""]
[null,""]
[null,""]
[null,""]
[null,""]
[null,""]
[null,""]
[null,""]
[null,""]
[null,""]
[null,""]
[null,""]
[null,""]
[null,""]
[null,""]
[null,{"$f":"IF(A319<>\"\",$A$3&A319,\"\")","v":""}]
[null,""]
[null,""]
[null,""]
[null,""]
[null,""]
[null,""]
[null,""]
[null,""]
[null,""]
[null,""]
[null,""]
[null,""]
[null,""]
[null,""]
[null,""]
[null,""]
[null,""]
[null,""]
[null,""]
[null,""]
[null,""]
[null,""]
[null,""]
[null,""]
[null,""]
[null,""]
[null,""]
[null,""]
[null,""]
[null,""]
[null,""]
[null,""]
[null,""]
[null,""]
[null,""]
[null,""]
[null,""]
[null,""]
[null,""]
[null,""]
[null,""]
[null,""]
[null,""]
[null,""]
[null,""]
[null,""]
[null,""]
[null,""]
[null,""]
[null,""]
[null,""]
[null,""]
[null,""]
[null,""]
[null,""]
[null,""]
[null,""]
[null,""]
[null,""]
[null,""]
[null,""]
[null,""]
[null,""]
[null,{"$f":"IF(A383<>\"\",$A$3&A383,\"\")","v":""}]
[null,""]
[null,""]
[null,""]
[null,""]
[null,""]
[null,""]
[null,""]
[null,""]
[null,""]
[null,""]
[null,""]
[null,""]
[null,""]
[null,""]
[null,""]
[null,""]
[null,""]
[null,""]
[null,""]
[null,""]
[null,""]
[null,""]
[null,""]
[null,""]
[null,""]
[null,""]
[null,""]
[null,""]
[null,""]
[null,""]
[null,""]
[null,""]
[null,""]
[null,""]
[null,""]
[null,""]
[null,""]
[null,""]
[null,""]
[null,""]
[null,""]
[null,""]
[null,""]
[null,""]
[null,""]
[null,""]
[null,""]
[null,""]
[null,""]
[null,""]
[null,""]
[null,""]
[null,""]
[null,""]
[null,""]
[null,""]
[null,""]
[null,""]
[null,""]
[null,""]
[null,""]
[null,""]
[null,""]
[null,{"$f":"IF(A447<>\"\",$A$3&A447,\"\")","v":""}]
[null,""]
[null,""]
[null,""]
[null,""]
[null,""]
[null,""]
[null,""]
[null,""]
[null,""]
[null,""]
[null,""]
[null,""]
[null,""]
[null,""]
[null,""]
[null,""]
[null,""]
[null,""]
[null,""]
[null,""]
[null,""]
[null,""]
[null,""]
[null,""]
[null,""]
[null,""]
[null,""]
[null,""]
[null,""]
[null,""]
[null,""]
[null,""]
[null,""]
[null,""]
[null,""]
[null,""]
[null,""]
[null,""]
[null,""]
[null,""]
[null,""]
[null,""]
[null,""]
[null,""]
[null,""]
[null,""]
[null,""]
[null,""]
[null,""]
[null,""]
[null,""]
[null,""]
[null,""]
[null,""]
[null,""]
[null,""]
[null,""]
[null,""]
[null,""]
[null,""]
[null,""]
[null,""]
[null,""]
[null,{"$f":"IF(A511<>\"\",$A$3&A511,\"\")","v":""}]
[null,""]
[null,""]
[null,""]
[null,""]
[null,""]
[null,""]
[null,""]
[null,""]
[null,""]
[null,""]

{"sheet":"M&E Flysheet ","index":11,"n_rows":22,"n_cols":1,"rows_kept":22,"cut":false,"hidden":false,"merged":[[21,0,21,9]]}
[]
[]
[]
[]
[]
[]
[]
[]
[]
[]
[]
[]
[]
[]
[]
[]
[]
[]
[]
[]
[]
["Mechanical and Electrical Works"]

{"sheet":"ME1","index":12,"n_rows":41,"n_cols":8,"rows_kept":41,"cut":false,"hidden":false,"merged":[]}
["Item No","Item No","Chief Reference","Short Description","Unit","Quantity","Rate","Amount\n R             c"]
[]
["ME1.",null,null,{"$f":"\"SECTION \"&A3","v":"SECTION ME1."}]
[null,null,null,"M&E WORKS - PUMP STATION"]
[null,null,null,"MULTI-STAGE PUMPS"]
[]
[null,null,null,"Allow for all costs and expenses in connnection with the following items:"]
[]
[{"$f":"IF($E9<>\"\",MAX($A$1:INDIRECT(CONCATENATE(\"$A$\",ROW()-1)))+1,\"\")","v":1},{"$f":"IF(A9<>\"\",$A$3&A9,\"\")","v":"ME1.1"},null,"Plinth Design","Sum","-","-"]
[{"$f":"IF($E10<>\"\",MAX($A$1:INDIRECT(CONCATENATE(\"$A$\",ROW()-1)))+1,\"\")","v":""},{"$f":"IF(A10<>\"\",$A$3&A10,\"\")","v":""}]
[{"$f":"IF($E11<>\"\",MAX($A$1:INDIRECT(CONCATENATE(\"$A$\",ROW()-1)))+1,\"\")","v":""},"",null,"Allow for all the costs and expenses in connection with the design, manufacture, painting, factory testing and supplying of the following materials and equipment:"]
[{"$f":"IF($E12<>\"\",MAX($A$1:INDIRECT(CONCATENATE(\"$A$\",ROW()-1)))+1,\"\")","v":""},""]
[{"$f":"IF($E13<>\"\",MAX($A$1:INDIRECT(CONCATENATE(\"$A$\",ROW()-1)))+1,\"\")","v":2},"ME1.2","PS 9.4","Pump","No.",4]
[{"$f":"IF($E14<>\"\",MAX($A$1:INDIRECT(CONCATENATE(\"$A$\",ROW()-1)))+1,\"\")","v":""},""]
[{"$f":"IF($E15<>\"\",MAX($A$1:INDIRECT(CONCATENATE(\"$A$\",ROW()-1)))+1,\"\")","v":3},"ME1.3",null,"Pump Motor","No.",4]
[{"$f":"IF($E16<>\"\",MAX($A$1:INDIRECT(CONCATENATE(\"$A$\",ROW()-1)))+1,\"\")","v":""},""]
[{"$f":"IF($E17<>\"\",MAX($A$1:INDIRECT(CONCATENATE(\"$A$\",ROW()-1)))+1,\"\")","v":4},"ME1.4","PS 9.4","Baseplates and anchor fasteners","Sum","-","-"]
[{"$f":"IF($E18<>\"\",MAX($A$1:INDIRECT(CONCATENATE(\"$A$\",ROW()-1)))+1,\"\")","v":""},""]
[{"$f":"IF($E19<>\"\",MAX($A$1:INDIRECT(CONCATENATE(\"$A$\",ROW()-1)))+1,\"\")","v":5},"ME1.5",null,"Flushing/cooling water system for seals complete with filter and isolation valves","Sum","-","-"]
[{"$f":"IF($E20<>\"\",MAX($A$1:INDIRECT(CONCATENATE(\"$A$\",ROW()-1)))+1,\"\")","v":""},""]
[{"$f":"IF($E21<>\"\",MAX($A$1:INDIRECT(CONCATENATE(\"$A$\",ROW()-1)))+1,\"\")","v":""},"",null,"Allow for all the costs and expenses in connection with the delivery, offloading and storage of the following:"]
[{"$f":"IF($E22<>\"\",MAX($A$1:INDIRECT(CONCATENATE(\"$A$\",ROW()-1)))+1,\"\")","v":""},""]
[{"$f":"IF($E23<>\"\",MAX($A$1:INDIRECT(CONCATENATE(\"$A$\",ROW()-1)))+1,\"\")","v":6},"ME1.6",null,{"$f":"\"All materials and equipment summarized in \" &D3& \" complete\"","v":"All materials and equipment summarized in SECTION ME1. complete"},"Sum","-","-"]
[{"$f":"IF($E24<>\"\",MAX($A$1:INDIRECT(CONCATENATE(\"$A$\",ROW()-1)))+1,\"\")","v":""},""]
[{"$f":"IF($E25<>\"\",MAX($A$1:INDIRECT(CONCATENATE(\"$A$\",ROW()-1)))+1,\"\")","v":""},"",null,"Allow for all costs and expenses in connection with the Site installation of the following:-"]
[{"$f":"IF($E26<>\"\",MAX($A$1:INDIRECT(CONCATENATE(\"$A$\",ROW()-1)))+1,\"\")","v":""},""]
[{"$f":"IF($E27<>\"\",MAX($A$1:INDIRECT(CONCATENATE(\"$A$\",ROW()-1)))+1,\"\")","v":7},"ME1.7",null,{"$f":"\"All materials and equipment summarized in \" &D3& \" complete\"","v":"All materials and equipment summarized in SECTION ME1. complete"},"Sum","-","-"]
[{"$f":"IF($E28<>\"\",MAX($A$1:INDIRECT(CONCATENATE(\"$A$\",ROW()-1)))+1,\"\")","v":""},""]
[{"$f":"IF($E29<>\"\",MAX($A$1:INDIRECT(CONCATENATE(\"$A$\",ROW()-1)))+1,\"\")","v":""},"",null,"Other:-"]
[{"$f":"IF($E30<>\"\",MAX($A$1:INDIRECT(CONCATENATE(\"$A$\",ROW()-1)))+1,\"\")","v":""},""]
[{"$f":"IF($E31<>\"\",MAX($A$1:INDIRECT(CONCATENATE(\"$A$\",ROW()-1)))+1,\"\")","v":8},"ME1.8",null,"All other items not included above but which are nevertheless necessary to meet the Scope of Work and/or are required for the proper, safe and effective operation of the plant (Specify)","Sum","-","-"]
[{"$f":"IF($E32<>\"\",MAX($A$1:INDIRECT(CONCATENATE(\"$A$\",ROW()-1)))+1,\"\")","v":""},"",null,"……………………………………………….."]
[{"$f":"IF($E33<>\"\",MAX($A$1:INDIRECT(CONCATENATE(\"$A$\",ROW()-1)))+1,\"\")","v":""},"",null,"……………………………………………….."]
[null,"",null,"……………………………………………….."]
[null,"",null,"……………………………………………….."]
[]
[]
[]
[]
[{"$f":"IF($E40<>\"\",MAX($A$1:INDIRECT(CONCATENATE(\"$A$\",ROW()-1)))+1,\"\")","v":""},""]
[null,null,null,{"$f":"\" TOTAL SECTION \"&$A$3&\":\n Carried to Summary\"","v":" TOTAL SECTION ME1.:\n Carried to Summary"},null,null,"R"]

{"sheet":"ME2","index":13,"n_rows":43,"n_cols":8,"rows_kept":43,"cut":false,"hidden":false,"merged":[]}
["Item No","Item No","Chief Reference","Short Description","Unit","Quantity","Rate","Amount\n R             c"]
[]
["ME2.",null,null,{"$f":"\"SECTION \"&A3","v":"SECTION ME2."}]
[null,null,null,"M&E WORKS - PUMP STATION"]
[null,null,null,"PLUNGER VALVE"]
[]
[null,null,null,"Allow for all the costs and expenses in connection with the design, manufacture, painting, factory testing and supplying of the following materials and equipment:"]
[]
[{"$f":"IF($E9<>\"\",MAX($A$1:INDIRECT(CONCATENATE(\"$A$\",ROW()-1)))+1,\"\")","v":1},{"$f":"IF(A9<>\"\",$A$3&A9,\"\")","v":"ME2.1"},"PS 9.7","DN400 Plunger valve","No",4," "]
[{"$f":"IF($E10<>\"\",MAX($A$1:INDIRECT(CONCATENATE(\"$A$\",ROW()-1)))+1,\"\")","v":""},{"$f":"IF(A10<>\"\",$A$3&A10,\"\")","v":""}]
[{"$f":"IF($E11<>\"\",MAX($A$1:INDIRECT(CONCATENATE(\"$A$\",ROW()-1)))+1,\"\")","v":2},"ME2.2","PS 9.11","Thrust supports for four off plunger valves","Sum","-","-"]
[{"$f":"IF($E12<>\"\",MAX($A$1:INDIRECT(CONCATENATE(\"$A$\",ROW()-1)))+1,\"\")","v":""},""]
[{"$f":"IF($E13<>\"\",MAX($A$1:INDIRECT(CONCATENATE(\"$A$\",ROW()-1)))+1,\"\")","v":""},"",null,"Allow for all the costs and expenses in connection with the delivery, offloading and storage of the following:"]
[{"$f":"IF($E14<>\"\",MAX($A$1:INDIRECT(CONCATENATE(\"$A$\",ROW()-1)))+1,\"\")","v":""},""]
[{"$f":"IF($E15<>\"\",MAX($A$1:INDIRECT(CONCATENATE(\"$A$\",ROW()-1)))+1,\"\")","v":3},"ME2.3",null,{"$f":"\"All materials and equipment summarized in \"&$D$3&\" complete\"","v":"All materials and equipment summarized in SECTION ME2. complete"},"Sum","-","-"]
[{"$f":"IF($E16<>\"\",MAX($A$1:INDIRECT(CONCATENATE(\"$A$\",ROW()-1)))+1,\"\")","v":""},""]
[{"$f":"IF($E17<>\"\",MAX($A$1:INDIRECT(CONCATENATE(\"$A$\",ROW()-1)))+1,\"\")","v":""},"",null,"Allow for all costs and expenses in connection with the Site installation of the following:-"]
[{"$f":"IF($E18<>\"\",MAX($A$1:INDIRECT(CONCATENATE(\"$A$\",ROW()-1)))+1,\"\")","v":""},""]
[{"$f":"IF($E19<>\"\",MAX($A$1:INDIRECT(CONCATENATE(\"$A$\",ROW()-1)))+1,\"\")","v":4},"ME2.4",null,{"$f":"\"All materials and equipment summarized in \"&$D$3&\" complete\"","v":"All materials and equipment summarized in SECTION ME2. complete"},"Sum","-","-"]
[{"$f":"IF($E20<>\"\",MAX($A$1:INDIRECT(CONCATENATE(\"$A$\",ROW()-1)))+1,\"\")","v":""},""]
[{"$f":"IF($E21<>\"\",MAX($A$1:INDIRECT(CONCATENATE(\"$A$\",ROW()-1)))+1,\"\")","v":""},"",null,"Other:-"]
[{"$f":"IF($E22<>\"\",MAX($A$1:INDIRECT(CONCATENATE(\"$A$\",ROW()-1)))+1,\"\")","v":""},""]
[{"$f":"IF($E23<>\"\",MAX($A$1:INDIRECT(CONCATENATE(\"$A$\",ROW()-1)))+1,\"\")","v":5},"ME2.5",null,"All other items not included above but which are nevertheless necessary to meet the Scope of Work and/or are required for the proper, safe and effective operation of the plant (Specify)","Sum","-","-"]
[{"$f":"IF($E24<>\"\",MAX($A$1:INDIRECT(CONCATENATE(\"$A$\",ROW()-1)))+1,\"\")","v":""},"",null,"……………………………………………….."]
[{"$f":"IF($E25<>\"\",MAX($A$1:INDIRECT(CONCATENATE(\"$A$\",ROW()-1)))+1,\"\")","v":""},"",null,"……………………………………………….."]
[{"$f":"IF($E26<>\"\",MAX($A$1:INDIRECT(CONCATENATE(\"$A$\",ROW()-1)))+1,\"\")","v":""},"",null,"……………………………………………….."]
[{"$f":"IF($E27<>\"\",MAX($A$1:INDIRECT(CONCATENATE(\"$A$\",ROW()-1)))+1,\"\")","v":""},"",null,"……………………………………………….."]
[{"$f":"IF($E28<>\"\",MAX($A$1:INDIRECT(CONCATENATE(\"$A$\",ROW()-1)))+1,\"\")","v":""},"",null,"……………………………………………….."]
[]
[]
[]
[]
[]
[]
[]
[]
[]
[{"$f":"IF($E38<>\"\",MAX($A$1:INDIRECT(CONCATENATE(\"$A$\",ROW()-1)))+1,\"\")","v":""},""]
[{"$f":"IF($E39<>\"\",MAX($A$1:INDIRECT(CONCATENATE(\"$A$\",ROW()-1)))+1,\"\")","v":""},""]
[]
[{"$f":"IF($E41<>\"\",MAX($A$1:INDIRECT(CONCATENATE(\"$A$\",ROW()-1)))+1,\"\")","v":""},""]
[{"$f":"IF($E42<>\"\",MAX($A$1:INDIRECT(CONCATENATE(\"$A$\",ROW()-1)))+1,\"\")","v":""},""]
[null,null,null,{"$f":"\" TOTAL SECTION \"&$A$3&\":\n Carried to Summary\"","v":" TOTAL SECTION ME2.:\n Carried to Summary"},null,null,"R"]

{"sheet":"ME3","index":14,"n_rows":40,"n_cols":8,"rows_kept":40,"cut":false,"hidden":false,"merged":[]}
["Item No","Item No","Chief Reference","Short Description","Unit","Quantity","Rate","Amount\n R             c"]
[]
["ME3.",null,null,{"$f":"\"SECTION \"&A3","v":"SECTION ME3."}]
[null,null,null,"M&E WORKS - PUMP STATION"]
[null,null,null,"ISOLATION AND CHECK VALVES"]
[]
[null,null,null,"Allow for all the costs and expenses in connection with the design, manufacture, painting, factory testing and supplying of the following materials and equipment:"]
[]
[{"$f":"IF($E9<>\"\",MAX($A$1:INDIRECT(CONCATENATE(\"$A$\",ROW()-1)))+1,\"\")","v":1},{"$f":"IF(A9<>\"\",$A$3&A9,\"\")","v":"ME3.1"},"PS 9.5","DN600 eccentric axis butterfly valve (PN10), including electric actuator","No",1]
[{"$f":"IF($E10<>\"\",MAX($A$1:INDIRECT(CONCATENATE(\"$A$\",ROW()-1)))+1,\"\")","v":""},{"$f":"IF(A10<>\"\",$A$3&A10,\"\")","v":""}]
[{"$f":"IF($E11<>\"\",MAX($A$1:INDIRECT(CONCATENATE(\"$A$\",ROW()-1)))+1,\"\")","v":2},"ME3.2","PS 9.5","DN400 eccentric axis butterfly valve (PN63), complete with electric actuator","No",4]
[{"$f":"IF($E12<>\"\",MAX($A$1:INDIRECT(CONCATENATE(\"$A$\",ROW()-1)))+1,\"\")","v":""},""]
[{"$f":"IF($E13<>\"\",MAX($A$1:INDIRECT(CONCATENATE(\"$A$\",ROW()-1)))+1,\"\")","v":3},{"$f":"IF(A13<>\"\",$A$3&A13,\"\")","v":"ME3.3"},"PS 9.6","DN400 metal seated wedge gate valve (PN63) complete with electric actuator","No",4]
[{"$f":"IF($E14<>\"\",MAX($A$1:INDIRECT(CONCATENATE(\"$A$\",ROW()-1)))+1,\"\")","v":""},{"$f":"IF(A14<>\"\",$A$3&A14,\"\")","v":""}]
[{"$f":"IF($E15<>\"\",MAX($A$1:INDIRECT(CONCATENATE(\"$A$\",ROW()-1)))+1,\"\")","v":4},{"$f":"IF(A15<>\"\",$A$3&A15,\"\")","v":"ME3.4"},"PS 9.5","DN500 eccentric axis butterfly valve (PN63), complete with electric actuator","No",1]
[{"$f":"IF($E16<>\"\",MAX($A$1:INDIRECT(CONCATENATE(\"$A$\",ROW()-1)))+1,\"\")","v":""},{"$f":"IF(A16<>\"\",$A$3&A16,\"\")","v":""}]
[{"$f":"IF($E17<>\"\",MAX($A$1:INDIRECT(CONCATENATE(\"$A$\",ROW()-1)))+1,\"\")","v":5},{"$f":"IF(A17<>\"\",$A$3&A17,\"\")","v":"ME3.5"},"PS 9.8","DN500 Nozzle check valve (PN63)","No",1]
[{"$f":"IF($E18<>\"\",MAX($A$1:INDIRECT(CONCATENATE(\"$A$\",ROW()-1)))+1,\"\")","v":""},{"$f":"IF(A18<>\"\",$A$3&A18,\"\")","v":""}]
[{"$f":"IF($E19<>\"\",MAX($A$1:INDIRECT(CONCATENATE(\"$A$\",ROW()-1)))+1,\"\")","v":""},"",null,"Allow for all the costs and expenses in connection with the delivery, offloading and storage of the following:"]
[{"$f":"IF($E20<>\"\",MAX($A$1:INDIRECT(CONCATENATE(\"$A$\",ROW()-1)))+1,\"\")","v":""},""]
[{"$f":"IF($E21<>\"\",MAX($A$1:INDIRECT(CONCATENATE(\"$A$\",ROW()-1)))+1,\"\")","v":6},"ME3.6",null,{"$f":"\"All materials and equipment summarized in \"&$D$3&\" complete\"","v":"All materials and equipment summarized in SECTION ME3. complete"},"Sum","-","-"]
[{"$f":"IF($E22<>\"\",MAX($A$1:INDIRECT(CONCATENATE(\"$A$\",ROW()-1)))+1,\"\")","v":""},""]
[{"$f":"IF($E23<>\"\",MAX($A$1:INDIRECT(CONCATENATE(\"$A$\",ROW()-1)))+1,\"\")","v":""},"",null,"Allow for all costs and expenses in connection with the Site installation of the following:-"]
[{"$f":"IF($E24<>\"\",MAX($A$1:INDIRECT(CONCATENATE(\"$A$\",ROW()-1)))+1,\"\")","v":""},""]
[{"$f":"IF($E25<>\"\",MAX($A$1:INDIRECT(CONCATENATE(\"$A$\",ROW()-1)))+1,\"\")","v":7},"ME3.7",null,{"$f":"\"All materials and equipment summarized in \"&$D$3&\" complete\"","v":"All materials and equipment summarized in SECTION ME3. complete"},"Sum","-","-"]
[{"$f":"IF($E26<>\"\",MAX($A$1:INDIRECT(CONCATENATE(\"$A$\",ROW()-1)))+1,\"\")","v":""},""]
[{"$f":"IF($E27<>\"\",MAX($A$1:INDIRECT(CONCATENATE(\"$A$\",ROW()-1)))+1,\"\")","v":""},"",null,"Other:-"]
[{"$f":"IF($E28<>\"\",MAX($A$1:INDIRECT(CONCATENATE(\"$A$\",ROW()-1)))+1,\"\")","v":""},""]
[{"$f":"IF($E29<>\"\",MAX($A$1:INDIRECT(CONCATENATE(\"$A$\",ROW()-1)))+1,\"\")","v":8},"ME3.8",null,"All other items not included above but which are nevertheless necessary to meet the Scope of Work and/or are required for the proper, safe and effective operation of the plant (Specify)","Sum","-","-"]
[{"$f":"IF($E30<>\"\",MAX($A$1:INDIRECT(CONCATENATE(\"$A$\",ROW()-1)))+1,\"\")","v":""},"",null,"……………………………………………….."]
[{"$f":"IF($E31<>\"\",MAX($A$1:INDIRECT(CONCATENATE(\"$A$\",ROW()-1)))+1,\"\")","v":""},"",null,"……………………………………………….."]
[{"$f":"IF($E32<>\"\",MAX($A$1:INDIRECT(CONCATENATE(\"$A$\",ROW()-1)))+1,\"\")","v":""},"",null,"……………………………………………….."]
[null,null,null,"……………………………………………….."]
[]
[]
[]
[]
[]
[]
[null,null,null,{"$f":"\" TOTAL SECTION \"&$A$3&\":\n Carried to Summary\"","v":" TOTAL SECTION ME3.:\n Carried to Summary"},null,null,"R"]

{"sheet":"ME4","index":15,"n_rows":82,"n_cols":8,"rows_kept":82,"cut":false,"hidden":false,"merged":[]}
["Item No","Item No","Chief Reference","Short Description","Unit","Quantity","Rate","Amount\n R             c"]
[]
["ME4.",null,null,{"$f":"\"SECTION \"&A3","v":"SECTION ME4."}]
[null,null,null,"M&E WORKS - PUMP STATION"]
[null,null,null,"PIPEWORK AND SUPPORTS"]
[]
[null,null,null,"Allow for all costs and expenses in connnection with the following items:"]
[null,null,null,null,null,null,null," "]
[{"$f":"IF($E9<>\"\",MAX($A$1:INDIRECT(CONCATENATE(\"$A$\",ROW()-1)))+1,\"\")","v":1},{"$f":"IF(A9<>\"\",$A$3&A9,\"\")","v":"ME4.1"},null,"Design of pipework","Sum","-","-"]
[{"$f":"IF($E10<>\"\",MAX($A$1:INDIRECT(CONCATENATE(\"$A$\",ROW()-1)))+1,\"\")","v":""},{"$f":"IF(A10<>\"\",$A$3&A10,\"\")","v":""},null,null,null,null,null," "]
[{"$f":"IF($E11<>\"\",MAX($A$1:INDIRECT(CONCATENATE(\"$A$\",ROW()-1)))+1,\"\")","v":2},"ME4.2","PS 9.11","Design of pipework supports","Sum","-","-"]
[{"$f":"IF($E12<>\"\",MAX($A$1:INDIRECT(CONCATENATE(\"$A$\",ROW()-1)))+1,\"\")","v":""},""]
[{"$f":"IF($E13<>\"\",MAX($A$1:INDIRECT(CONCATENATE(\"$A$\",ROW()-1)))+1,\"\")","v":""},"",null,"Allow for all the costs and expenses in connection with the design, manufacture, painting, factory testing and supplying of the following materials and equipment:"]
[{"$f":"IF($E14<>\"\",MAX($A$1:INDIRECT(CONCATENATE(\"$A$\",ROW()-1)))+1,\"\")","v":""},""]
[{"$f":"IF($E15<>\"\",MAX($A$1:INDIRECT(CONCATENATE(\"$A$\",ROW()-1)))+1,\"\")","v":3},"ME4.3","PS 9.9","Suction manifold pipework upstream of pump suction isolation valves","Sum","-","-"]
[{"$f":"IF($E16<>\"\",MAX($A$1:INDIRECT(CONCATENATE(\"$A$\",ROW()-1)))+1,\"\")","v":""},""]
[{"$f":"IF($E17<>\"\",MAX($A$1:INDIRECT(CONCATENATE(\"$A$\",ROW()-1)))+1,\"\")","v":4},"ME4.4","PS 9.9","Discharge manfiold pipework downstream of pump discharge isolation valves","Sum","-","-"]
[{"$f":"IF($E18<>\"\",MAX($A$1:INDIRECT(CONCATENATE(\"$A$\",ROW()-1)))+1,\"\")","v":""},""]
[{"$f":"IF($E19<>\"\",MAX($A$1:INDIRECT(CONCATENATE(\"$A$\",ROW()-1)))+1,\"\")","v":5},"ME4.5","PS 9.9","Pump suction line pipework from pump suction isolation valves to pump inlets","Sum","-","-"]
[{"$f":"IF($E20<>\"\",MAX($A$1:INDIRECT(CONCATENATE(\"$A$\",ROW()-1)))+1,\"\")","v":""},""]
[{"$f":"IF($E21<>\"\",MAX($A$1:INDIRECT(CONCATENATE(\"$A$\",ROW()-1)))+1,\"\")","v":6},"ME4.6","PS 9.9","Pump discharge line pipework from pump outlets to pump discharge isolation valves","Sum","-","-"]
[{"$f":"IF($E22<>\"\",MAX($A$1:INDIRECT(CONCATENATE(\"$A$\",ROW()-1)))+1,\"\")","v":""},""]
[{"$f":"IF($E23<>\"\",MAX($A$1:INDIRECT(CONCATENATE(\"$A$\",ROW()-1)))+1,\"\")","v":7},"ME4.7","PS 9.11","Pipework supports for suction manifold","Sum","-","-"]
[{"$f":"IF($E24<>\"\",MAX($A$1:INDIRECT(CONCATENATE(\"$A$\",ROW()-1)))+1,\"\")","v":""},""]
[{"$f":"IF($E25<>\"\",MAX($A$1:INDIRECT(CONCATENATE(\"$A$\",ROW()-1)))+1,\"\")","v":8},"ME4.8","PS 9.11","Supports for suction isolation valves","Sum","-","-"]
[{"$f":"IF($E26<>\"\",MAX($A$1:INDIRECT(CONCATENATE(\"$A$\",ROW()-1)))+1,\"\")","v":""},""]
[{"$f":"IF($E27<>\"\",MAX($A$1:INDIRECT(CONCATENATE(\"$A$\",ROW()-1)))+1,\"\")","v":9},"ME4.9","PS 9.11","Pipework supports for discharge manifold","Sum","-","-"]
[]
[{"$f":"IF($E29<>\"\",MAX($A$1:INDIRECT(CONCATENATE(\"$A$\",ROW()-1)))+1,\"\")","v":10},{"$f":"IF(A29<>\"\",$A$3&A29,\"\")","v":"ME4.10"},"PS 9.10","Suction manifold flange adaptors","No",2," "]
[{"$f":"IF($E30<>\"\",MAX($A$1:INDIRECT(CONCATENATE(\"$A$\",ROW()-1)))+1,\"\")","v":""},""]
[{"$f":"IF($E31<>\"\",MAX($A$1:INDIRECT(CONCATENATE(\"$A$\",ROW()-1)))+1,\"\")","v":11},"ME4.11","PS 9.10","Pump suction line restrained flange adaptors","No",8," "]
[{"$f":"IF($E32<>\"\",MAX($A$1:INDIRECT(CONCATENATE(\"$A$\",ROW()-1)))+1,\"\")","v":""},""]
[{"$f":"IF($E33<>\"\",MAX($A$1:INDIRECT(CONCATENATE(\"$A$\",ROW()-1)))+1,\"\")","v":12},"ME4.12","PS 9.10","Pump discharge line restrained flange adaptors","No",8," "]
[]
[{"$f":"IF($E35<>\"\",MAX($A$1:INDIRECT(CONCATENATE(\"$A$\",ROW()-1)))+1,\"\")","v":13},{"$f":"IF(A35<>\"\",$A$3&A35,\"\")","v":"ME4.13"},"PS 9.10","Discharge manifold isolation valve restrained flange adaptor","No",1," "]
[{"$f":"IF($E36<>\"\",MAX($A$1:INDIRECT(CONCATENATE(\"$A$\",ROW()-1)))+1,\"\")","v":""},""]
[{"$f":"IF($E37<>\"\",MAX($A$1:INDIRECT(CONCATENATE(\"$A$\",ROW()-1)))+1,\"\")","v":14},"ME4.14","PS 9.9","DN100 flanged stubs forming part of above pipework for pressure gauges, and pressure transmitter connections, insertion magnetic flow meter and drain fittings.","Sum","-","-"]
[]
[]
[null,null,null," Carried forward / …"]
[null,null,null," Brought forward / …"]
[]
[]
[{"$f":"IF($E44<>\"\",MAX($A$1:INDIRECT(CONCATENATE(\"$A$\",ROW()-1)))+1,\"\")","v":15},{"$f":"IF(A44<>\"\",$A$3&A44,\"\")","v":"ME4.15"},"PS 9.9","DN100 flanged stubs forming part of above pipework for insertion magnetic flow meter","Sum","-","-"]
[]
[{"$f":"IF($E46<>\"\",MAX($A$1:INDIRECT(CONCATENATE(\"$A$\",ROW()-1)))+1,\"\")","v":16},{"$f":"IF(A46<>\"\",$A$3&A46,\"\")","v":"ME4.16"},"PS 9.9","DN100 flanged stubs at low point of pump discharge line for scouring of pump line","Sum","-","-"]
[]
[{"$f":"IF($E48<>\"\",MAX($A$1:INDIRECT(CONCATENATE(\"$A$\",ROW()-1)))+1,\"\")","v":""},"",null,"Allow for all the costs and expenses in connection with the delivery, offloading and storage of the following:"]
[{"$f":"IF($E49<>\"\",MAX($A$1:INDIRECT(CONCATENATE(\"$A$\",ROW()-1)))+1,\"\")","v":""},""]
[{"$f":"IF($E50<>\"\",MAX($A$1:INDIRECT(CONCATENATE(\"$A$\",ROW()-1)))+1,\"\")","v":17},"ME4.17",null,{"$f":"\"All materials and equipment summarized in \"&$D$3&\" complete\"","v":"All materials and equipment summarized in SECTION ME4. complete"},"Sum","-","-"]
[{"$f":"IF($E51<>\"\",MAX($A$1:INDIRECT(CONCATENATE(\"$A$\",ROW()-1)))+1,\"\")","v":""},""]
[{"$f":"IF($E52<>\"\",MAX($A$1:INDIRECT(CONCATENATE(\"$A$\",ROW()-1)))+1,\"\")","v":""},"",null,"Allow for all costs and expenses in connection with the Site installation of the following:-"]
[{"$f":"IF($E53<>\"\",MAX($A$1:INDIRECT(CONCATENATE(\"$A$\",ROW()-1)))+1,\"\")","v":""},""]
[{"$f":"IF($E54<>\"\",MAX($A$1:INDIRECT(CONCATENATE(\"$A$\",ROW()-1)))+1,\"\")","v":18},"ME4.18",null,{"$f":"\"All materials and equipment summarized in \"&$D$3&\" complete\"","v":"All materials and equipment summarized in SECTION ME4. complete"},"Sum","-","-"]
[{"$f":"IF($E55<>\"\",MAX($A$1:INDIRECT(CONCATENATE(\"$A$\",ROW()-1)))+1,\"\")","v":""},""]
[{"$f":"IF($E56<>\"\",MAX($A$1:INDIRECT(CONCATENATE(\"$A$\",ROW()-1)))+1,\"\")","v":""},"",null,"Other:-"]
[{"$f":"IF($E57<>\"\",MAX($A$1:INDIRECT(CONCATENATE(\"$A$\",ROW()-1)))+1,\"\")","v":""},""]
[{"$f":"IF($E58<>\"\",MAX($A$1:INDIRECT(CONCATENATE(\"$A$\",ROW()-1)))+1,\"\")","v":19},"ME4.19",null,"All other items not included above but which are nevertheless necessary to meet the Scope of Work and/or are required for the proper, safe and effective operation of the plant (Specify)","Sum","-","-"]
[{"$f":"IF($E59<>\"\",MAX($A$1:INDIRECT(CONCATENATE(\"$A$\",ROW()-1)))+1,\"\")","v":""},"",null,"……………………………………………….."]
[{"$f":"IF($E60<>\"\",MAX($A$1:INDIRECT(CONCATENATE(\"$A$\",ROW()-1)))+1,\"\")","v":""},"",null,"……………………………………………….."]
[null,null,null,"……………………………………………….."]
[null,null,null,"……………………………………………….."]
[null,null,null,"……………………………………………….."]
[]
[]
[]
[]
[]
[]
[]
[]
[]
[]
[]
[]
[]
[]
[]
[]
[]
[{"$f":"IF($E81<>\"\",MAX($A$1:INDIRECT(CONCATENATE(\"$A$\",ROW()-1)))+1,\"\")","v":""},""]
[null,null,null,{"$f":"\" TOTAL SECTION \"&$A$3&\":\n Carried to Summary\"","v":" TOTAL SECTION ME4.:\n Carried to Summary"},null,null,"R"]

{"sheet":"ME5","index":16,"n_rows":41,"n_cols":8,"rows_kept":41,"cut":false,"hidden":false,"merged":[]}
["Item No","Item No","Chief Reference","Short Description","Unit","Quantity","Rate","Amount\n R             c"]
[]
["ME5.",null,null,{"$f":"\"SECTION \"&A3","v":"SECTION ME5."}]
[null,null,null,"M&E WORKS - PUMP STATION"]
[null,null,null,"VENTILATION"]
[]
[null,null,null,"Allow for all the costs and expenses in connection with the design, manufacture, painting, factory testing and supplying of the following materials and equipment:"]
[]
[{"$f":"IF($E9<>\"\",MAX($A$1:INDIRECT(CONCATENATE(\"$A$\",ROW()-1)))+1,\"\")","v":1},{"$f":"IF(A9<>\"\",$A$3&A9,\"\")","v":"ME5.1"},"PS 9.14","Pump Room Ventilation Fan","No",2]
[{"$f":"IF($E10<>\"\",MAX($A$1:INDIRECT(CONCATENATE(\"$A$\",ROW()-1)))+1,\"\")","v":""},{"$f":"IF(A10<>\"\",$A$3&A10,\"\")","v":""}]
[{"$f":"IF($E11<>\"\",MAX($A$1:INDIRECT(CONCATENATE(\"$A$\",ROW()-1)))+1,\"\")","v":2},"ME5.2","PS 9.14","Accoustic attenuators with dampers","No",4]
[{"$f":"IF($E12<>\"\",MAX($A$1:INDIRECT(CONCATENATE(\"$A$\",ROW()-1)))+1,\"\")","v":""},""]
[{"$f":"IF($E13<>\"\",MAX($A$1:INDIRECT(CONCATENATE(\"$A$\",ROW()-1)))+1,\"\")","v":3},{"$f":"IF(A13<>\"\",$A$3&A13,\"\")","v":"ME5.3"},"PS 9.14","Filter Bank with spare set of filters","No",1]
[{"$f":"IF($E14<>\"\",MAX($A$1:INDIRECT(CONCATENATE(\"$A$\",ROW()-1)))+1,\"\")","v":""},{"$f":"IF(A14<>\"\",$A$3&A14,\"\")","v":""}]
[{"$f":"IF($E15<>\"\",MAX($A$1:INDIRECT(CONCATENATE(\"$A$\",ROW()-1)))+1,\"\")","v":4},{"$f":"IF(A15<>\"\",$A$3&A15,\"\")","v":"ME5.4"},"PS 9.14","Ducting, complete with diffuser for each pump motor, ducting supports and stainless steel screens for inlets","Sum","-","-"]
[{"$f":"IF($E16<>\"\",MAX($A$1:INDIRECT(CONCATENATE(\"$A$\",ROW()-1)))+1,\"\")","v":""},""]
[{"$f":"IF($E17<>\"\",MAX($A$1:INDIRECT(CONCATENATE(\"$A$\",ROW()-1)))+1,\"\")","v":5},{"$f":"IF(A17<>\"\",$A$3&A17,\"\")","v":"ME5.5"},"PS 9.14","MV switchgear room louvre with fan","No",2]
[{"$f":"IF($E18<>\"\",MAX($A$1:INDIRECT(CONCATENATE(\"$A$\",ROW()-1)))+1,\"\")","v":""},{"$f":"IF(A18<>\"\",$A$3&A18,\"\")","v":""}]
[{"$f":"IF($E19<>\"\",MAX($A$1:INDIRECT(CONCATENATE(\"$A$\",ROW()-1)))+1,\"\")","v":6},{"$f":"IF(A19<>\"\",$A$3&A19,\"\")","v":"ME5.6"},"PS 9.14","Cable gallery inlet louvre with fan","No",1]
[{"$f":"IF($E20<>\"\",MAX($A$1:INDIRECT(CONCATENATE(\"$A$\",ROW()-1)))+1,\"\")","v":""},{"$f":"IF(A20<>\"\",$A$3&A20,\"\")","v":""}]
[{"$f":"IF($E21<>\"\",MAX($A$1:INDIRECT(CONCATENATE(\"$A$\",ROW()-1)))+1,\"\")","v":7},{"$f":"IF(A21<>\"\",$A$3&A21,\"\")","v":"ME5.7"},"PS 9.14","Cable gallery outlet louvre","No",1]
[{"$f":"IF($E22<>\"\",MAX($A$1:INDIRECT(CONCATENATE(\"$A$\",ROW()-1)))+1,\"\")","v":""},{"$f":"IF(A22<>\"\",$A$3&A22,\"\")","v":""}]
[{"$f":"IF($E23<>\"\",MAX($A$1:INDIRECT(CONCATENATE(\"$A$\",ROW()-1)))+1,\"\")","v":""},"",null,"Allow for all the costs and expenses in connection with the delivery, offloading and storage of the following:"]
[{"$f":"IF($E24<>\"\",MAX($A$1:INDIRECT(CONCATENATE(\"$A$\",ROW()-1)))+1,\"\")","v":""},""]
[{"$f":"IF($E25<>\"\",MAX($A$1:INDIRECT(CONCATENATE(\"$A$\",ROW()-1)))+1,\"\")","v":8},"ME5.8","PS 9.14",{"$f":"\"All materials and equipment summarized in \"&$D$3&\" complete\"","v":"All materials and equipment summarized in SECTION ME5. complete"},"Sum","-","-"]
[{"$f":"IF($E26<>\"\",MAX($A$1:INDIRECT(CONCATENATE(\"$A$\",ROW()-1)))+1,\"\")","v":""},""]
[{"$f":"IF($E27<>\"\",MAX($A$1:INDIRECT(CONCATENATE(\"$A$\",ROW()-1)))+1,\"\")","v":""},"",null,"Allow for all costs and expenses in connection with the Site installation of the following:-"]
[{"$f":"IF($E28<>\"\",MAX($A$1:INDIRECT(CONCATENATE(\"$A$\",ROW()-1)))+1,\"\")","v":""},""]
[{"$f":"IF($E29<>\"\",MAX($A$1:INDIRECT(CONCATENATE(\"$A$\",ROW()-1)))+1,\"\")","v":9},"ME5.9","PS 9.14",{"$f":"\"All materials and equipment summarized in \"&$D$3&\" complete\"","v":"All materials and equipment summarized in SECTION ME5. complete"},"Sum","-","-"]
[{"$f":"IF($E30<>\"\",MAX($A$1:INDIRECT(CONCATENATE(\"$A$\",ROW()-1)))+1,\"\")","v":""},""]
[{"$f":"IF($E31<>\"\",MAX($A$1:INDIRECT(CONCATENATE(\"$A$\",ROW()-1)))+1,\"\")","v":""},"",null,"Other:-"]
[{"$f":"IF($E32<>\"\",MAX($A$1:INDIRECT(CONCATENATE(\"$A$\",ROW()-1)))+1,\"\")","v":""},""]
[{"$f":"IF($E33<>\"\",MAX($A$1:INDIRECT(CONCATENATE(\"$A$\",ROW()-1)))+1,\"\")","v":10},"ME5.10",null,"All other items not included above but which are nevertheless necessary to meet the Scope of Work and/or are required for the proper, safe and effective operation of the plant (Specify)","Sum","-","-"]
[{"$f":"IF($E34<>\"\",MAX($A$1:INDIRECT(CONCATENATE(\"$A$\",ROW()-1)))+1,\"\")","v":""},"",null,"……………………………………………….."]
[null,null,null,"……………………………………………….."]
[null,null,null,"……………………………………………….."]
[null,null,null,"……………………………………………….."]
[]
[]
[{"$f":"IF($E40<>\"\",MAX($A$1:INDIRECT(CONCATENATE(\"$A$\",ROW()-1)))+1,\"\")","v":""},""]
[null,null,null,{"$f":"\" TOTAL SECTION \"&$A$3&\":\n Carried to Summary\"","v":" TOTAL SECTION ME5.:\n Carried to Summary"},null,null,"R"]

{"sheet":"ME6","index":17,"n_rows":143,"n_cols":8,"rows_kept":143,"cut":false,"hidden":false,"merged":[]}
["Item No","Item No","Chief Reference","Short Description","Unit","Quantity","Rate","Amount\n R             c"]
[]
["ME6.",null,null,{"$f":"\"SECTION \"&A3","v":"SECTION ME6."}]
[null,null,null,"M&E WORKS - PUMP STATION"]
[null,null,"PS 19.18\n","MV CABLE INSTALLATION"]
[]
[null,null,null,"Allow for all costs and expenses in connnection with the following items:"]
[]
[{"$f":"IF($E9<>\"\",MAX($A$1:INDIRECT(CONCATENATE(\"$A$\",ROW()-1)))+1,\"\")","v":1},{"$f":"IF(A9<>\"\",$A$3&A9,\"\")","v":"ME6.1"},null,"Liaison with Supply Authority for powering pump station","Sum","-"]
[]
[{"$f":"IF($E11<>\"\",MAX($A$1:INDIRECT(CONCATENATE(\"$A$\",ROW()-1)))+1,\"\")","v":""},{"$f":"IF(A11<>\"\",$A$3&A11,\"\")","v":""},null,"Allow for all the costs and expenses in connection with the design, manufacture, routine testing, factory testing, supply, delivery, offloading and storage of the following materials and equipment:"]
[{"$f":"IF($E12<>\"\",MAX($A$1:INDIRECT(CONCATENATE(\"$A$\",ROW()-1)))+1,\"\")","v":""},""]
[{"$f":"IF($E13<>\"\",MAX($A$1:INDIRECT(CONCATENATE(\"$A$\",ROW()-1)))+1,\"\")","v":""},"",null,"XLPE insulated 6,35/11 kV screened copper conductor cable"]
[{"$f":"IF($E14<>\"\",MAX($A$1:INDIRECT(CONCATENATE(\"$A$\",ROW()-1)))+1,\"\")","v":""},""]
[{"$f":"IF($E15<>\"\",MAX($A$1:INDIRECT(CONCATENATE(\"$A$\",ROW()-1)))+1,\"\")","v":2},"ME6.2",null,"95mm² x 3 core","m",500]
[{"$f":"IF($E16<>\"\",MAX($A$1:INDIRECT(CONCATENATE(\"$A$\",ROW()-1)))+1,\"\")","v":""},""]
[{"$f":"IF($E17<>\"\",MAX($A$1:INDIRECT(CONCATENATE(\"$A$\",ROW()-1)))+1,\"\")","v":3},"ME6.3",null,"35mm² x 3 core","m",200]
[{"$f":"IF($E18<>\"\",MAX($A$1:INDIRECT(CONCATENATE(\"$A$\",ROW()-1)))+1,\"\")","v":""},""]
[{"$f":"IF($E19<>\"\",MAX($A$1:INDIRECT(CONCATENATE(\"$A$\",ROW()-1)))+1,\"\")","v":""},"",null,"XLPE insulated 6,35/11 kV screened copper conductor cable joints"]
[{"$f":"IF($E20<>\"\",MAX($A$1:INDIRECT(CONCATENATE(\"$A$\",ROW()-1)))+1,\"\")","v":""},""]
[{"$f":"IF($E21<>\"\",MAX($A$1:INDIRECT(CONCATENATE(\"$A$\",ROW()-1)))+1,\"\")","v":4},"ME6.4",null,"95mm² x 3 core","No.",2]
[{"$f":"IF($E22<>\"\",MAX($A$1:INDIRECT(CONCATENATE(\"$A$\",ROW()-1)))+1,\"\")","v":""},""]
[{"$f":"IF($E23<>\"\",MAX($A$1:INDIRECT(CONCATENATE(\"$A$\",ROW()-1)))+1,\"\")","v":5},"ME6.5",null,"35mm² x 3 core","No.",10]
[{"$f":"IF($E24<>\"\",MAX($A$1:INDIRECT(CONCATENATE(\"$A$\",ROW()-1)))+1,\"\")","v":""},""]
[{"$f":"IF($E25<>\"\",MAX($A$1:INDIRECT(CONCATENATE(\"$A$\",ROW()-1)))+1,\"\")","v":""},"",null,"XLPE insulated 6,35/11 kV screened copper conductor terminations"]
[{"$f":"IF($E26<>\"\",MAX($A$1:INDIRECT(CONCATENATE(\"$A$\",ROW()-1)))+1,\"\")","v":""},""]
[{"$f":"IF($E27<>\"\",MAX($A$1:INDIRECT(CONCATENATE(\"$A$\",ROW()-1)))+1,\"\")","v":6},"ME6.6",null,"95mm² x 3 core","No.",4]
[{"$f":"IF($E28<>\"\",MAX($A$1:INDIRECT(CONCATENATE(\"$A$\",ROW()-1)))+1,\"\")","v":""},""]
[{"$f":"IF($E29<>\"\",MAX($A$1:INDIRECT(CONCATENATE(\"$A$\",ROW()-1)))+1,\"\")","v":7},"ME6.7",null,"35mm² x 3 core","No.",18]
[{"$f":"IF($E30<>\"\",MAX($A$1:INDIRECT(CONCATENATE(\"$A$\",ROW()-1)))+1,\"\")","v":""},""]
[{"$f":"IF($E31<>\"\",MAX($A$1:INDIRECT(CONCATENATE(\"$A$\",ROW()-1)))+1,\"\")","v":""},{"$f":"IF(A31<>\"\",$A$3&A31,\"\")","v":""},null,"Earthing and bonding"]
[{"$f":"IF($E32<>\"\",MAX($A$1:INDIRECT(CONCATENATE(\"$A$\",ROW()-1)))+1,\"\")","v":""},{"$f":"IF(A32<>\"\",$A$3&A32,\"\")","v":""}]
[{"$f":"IF($E33<>\"\",MAX($A$1:INDIRECT(CONCATENATE(\"$A$\",ROW()-1)))+1,\"\")","v":""},{"$f":"IF(A33<>\"\",$A$3&A33,\"\")","v":""},null,"Bare copper earth conductor"]
[{"$f":"IF($E34<>\"\",MAX($A$1:INDIRECT(CONCATENATE(\"$A$\",ROW()-1)))+1,\"\")","v":""},{"$f":"IF(A34<>\"\",$A$3&A34,\"\")","v":""}]
[{"$f":"IF($E35<>\"\",MAX($A$1:INDIRECT(CONCATENATE(\"$A$\",ROW()-1)))+1,\"\")","v":8},{"$f":"IF(A35<>\"\",$A$3&A35,\"\")","v":"ME6.8"},null,"70mm² ","m",1000]
[]
[{"$f":"IF($E37<>\"\",MAX($A$1:INDIRECT(CONCATENATE(\"$A$\",ROW()-1)))+1,\"\")","v":9},{"$f":"IF(A37<>\"\",$A$3&A37,\"\")","v":"ME6.9"},null,"95mm² ","m",200]
[]
[{"$f":"IF($E39<>\"\",MAX($A$1:INDIRECT(CONCATENATE(\"$A$\",ROW()-1)))+1,\"\")","v":10},{"$f":"IF(A39<>\"\",$A$3&A39,\"\")","v":"ME6.10"},null,"Terminations to earthing bar","Sum","-"]
[{"$f":"IF($E40<>\"\",MAX($A$1:INDIRECT(CONCATENATE(\"$A$\",ROW()-1)))+1,\"\")","v":""},{"$f":"IF(A40<>\"\",$A$3&A40,\"\")","v":""}]
[{"$f":"IF($E41<>\"\",MAX($A$1:INDIRECT(CONCATENATE(\"$A$\",ROW()-1)))+1,\"\")","v":""},{"$f":"IF(A41<>\"\",$A$3&A41,\"\")","v":""},null,"Cable trench excavations, including backfilling, compaction and disposal of excess material"]
[{"$f":"IF($E42<>\"\",MAX($A$1:INDIRECT(CONCATENATE(\"$A$\",ROW()-1)))+1,\"\")","v":""},""]
[{"$f":"IF($E43<>\"\",MAX($A$1:INDIRECT(CONCATENATE(\"$A$\",ROW()-1)))+1,\"\")","v":11},"ME6.11",null,"Backfill material imported from off-site source (provisional)","mᶾ",200]
[]
[]
[null,null,null," Carried forward / …"]
[null,null,null," Brought forward / …"]
[]
[{"$f":"IF($E49<>\"\",MAX($A$1:INDIRECT(CONCATENATE(\"$A$\",ROW()-1)))+1,\"\")","v":""},"",null,"Underground cable ancillaries"]
[{"$f":"IF($E50<>\"\",MAX($A$1:INDIRECT(CONCATENATE(\"$A$\",ROW()-1)))+1,\"\")","v":""},""]
[{"$f":"IF($E51<>\"\",MAX($A$1:INDIRECT(CONCATENATE(\"$A$\",ROW()-1)))+1,\"\")","v":12},"ME6.12",null,"Cable warning/danger tape","m",600]
[{"$f":"IF($E52<>\"\",MAX($A$1:INDIRECT(CONCATENATE(\"$A$\",ROW()-1)))+1,\"\")","v":""},""]
[{"$f":"IF($E53<>\"\",MAX($A$1:INDIRECT(CONCATENATE(\"$A$\",ROW()-1)))+1,\"\")","v":13},"ME6.13",null,"Concrete pyramid cable markers","No.",20]
[{"$f":"IF($E54<>\"\",MAX($A$1:INDIRECT(CONCATENATE(\"$A$\",ROW()-1)))+1,\"\")","v":""},""]
[{"$f":"IF($E55<>\"\",MAX($A$1:INDIRECT(CONCATENATE(\"$A$\",ROW()-1)))+1,\"\")","v":14},"ME6.14",null,"Concrete protective slabs","m",400]
[{"$f":"IF($E56<>\"\",MAX($A$1:INDIRECT(CONCATENATE(\"$A$\",ROW()-1)))+1,\"\")","v":""},""]
[{"$f":"IF($E57<>\"\",MAX($A$1:INDIRECT(CONCATENATE(\"$A$\",ROW()-1)))+1,\"\")","v":""},"",null,"Allow for all costs and expenses in connection with the Site installation of the following:"]
[{"$f":"IF($E58<>\"\",MAX($A$1:INDIRECT(CONCATENATE(\"$A$\",ROW()-1)))+1,\"\")","v":""},""]
[{"$f":"IF($E59<>\"\",MAX($A$1:INDIRECT(CONCATENATE(\"$A$\",ROW()-1)))+1,\"\")","v":""},"",null,"XLPE insulated 6,35/11 kV screened copper conductor cable"]
[{"$f":"IF($E60<>\"\",MAX($A$1:INDIRECT(CONCATENATE(\"$A$\",ROW()-1)))+1,\"\")","v":""},""]
[{"$f":"IF($E61<>\"\",MAX($A$1:INDIRECT(CONCATENATE(\"$A$\",ROW()-1)))+1,\"\")","v":15},"ME6.15",null,"95mm² x 3 core","m",{"$f":"F15","v":500}]
[{"$f":"IF($E62<>\"\",MAX($A$1:INDIRECT(CONCATENATE(\"$A$\",ROW()-1)))+1,\"\")","v":""},""]
[{"$f":"IF($E63<>\"\",MAX($A$1:INDIRECT(CONCATENATE(\"$A$\",ROW()-1)))+1,\"\")","v":16},"ME6.16",null,"35mm² x 3 core","m",{"$f":"F17","v":200}]
[{"$f":"IF($E64<>\"\",MAX($A$1:INDIRECT(CONCATENATE(\"$A$\",ROW()-1)))+1,\"\")","v":""},""]
[{"$f":"IF($E65<>\"\",MAX($A$1:INDIRECT(CONCATENATE(\"$A$\",ROW()-1)))+1,\"\")","v":""},"",null,"XLPE insulated 6,35/11 kV screened copper conductor cable joints"]
[{"$f":"IF($E66<>\"\",MAX($A$1:INDIRECT(CONCATENATE(\"$A$\",ROW()-1)))+1,\"\")","v":""},""]
[{"$f":"IF($E67<>\"\",MAX($A$1:INDIRECT(CONCATENATE(\"$A$\",ROW()-1)))+1,\"\")","v":17},"ME6.17",null,"95mm² x 3 core","No.",{"$f":"F21","v":2}]
[{"$f":"IF($E68<>\"\",MAX($A$1:INDIRECT(CONCATENATE(\"$A$\",ROW()-1)))+1,\"\")","v":""},""]
[{"$f":"IF($E69<>\"\",MAX($A$1:INDIRECT(CONCATENATE(\"$A$\",ROW()-1)))+1,\"\")","v":18},"ME6.18",null,"35mm² x 3 core","No.",{"$f":"F23","v":10}]
[{"$f":"IF($E70<>\"\",MAX($A$1:INDIRECT(CONCATENATE(\"$A$\",ROW()-1)))+1,\"\")","v":""},""]
[{"$f":"IF($E71<>\"\",MAX($A$1:INDIRECT(CONCATENATE(\"$A$\",ROW()-1)))+1,\"\")","v":""},"",null,"XLPE insulated 6,35/11 kV screened copper conductor terminations"]
[{"$f":"IF($E72<>\"\",MAX($A$1:INDIRECT(CONCATENATE(\"$A$\",ROW()-1)))+1,\"\")","v":""},""]
[{"$f":"IF($E73<>\"\",MAX($A$1:INDIRECT(CONCATENATE(\"$A$\",ROW()-1)))+1,\"\")","v":19},"ME6.19",null,"95mm² x 3 core","No.",{"$f":"F27","v":4}]
[{"$f":"IF($E74<>\"\",MAX($A$1:INDIRECT(CONCATENATE(\"$A$\",ROW()-1)))+1,\"\")","v":""},""]
[{"$f":"IF($E75<>\"\",MAX($A$1:INDIRECT(CONCATENATE(\"$A$\",ROW()-1)))+1,\"\")","v":20},"ME6.20",null,"35mm² x 3 core","No.",{"$f":"F29","v":18}]
[{"$f":"IF($E76<>\"\",MAX($A$1:INDIRECT(CONCATENATE(\"$A$\",ROW()-1)))+1,\"\")","v":""},""]
[{"$f":"IF($E77<>\"\",MAX($A$1:INDIRECT(CONCATENATE(\"$A$\",ROW()-1)))+1,\"\")","v":""},"",null,"Earthing and bonding"]
[{"$f":"IF($E78<>\"\",MAX($A$1:INDIRECT(CONCATENATE(\"$A$\",ROW()-1)))+1,\"\")","v":""},""]
[{"$f":"IF($E79<>\"\",MAX($A$1:INDIRECT(CONCATENATE(\"$A$\",ROW()-1)))+1,\"\")","v":""},"",null,"Bare copper earth conductor"]
[{"$f":"IF($E80<>\"\",MAX($A$1:INDIRECT(CONCATENATE(\"$A$\",ROW()-1)))+1,\"\")","v":""},{"$f":"IF(A80<>\"\",$A$3&A80,\"\")","v":""}]
[{"$f":"IF($E81<>\"\",MAX($A$1:INDIRECT(CONCATENATE(\"$A$\",ROW()-1)))+1,\"\")","v":21},{"$f":"IF(A81<>\"\",$A$3&A81,\"\")","v":"ME6.21"},null,"70mm² ","m",{"$f":"F35","v":1000}]
[{"$f":"IF($E82<>\"\",MAX($A$1:INDIRECT(CONCATENATE(\"$A$\",ROW()-1)))+1,\"\")","v":""},""]
[{"$f":"IF($E83<>\"\",MAX($A$1:INDIRECT(CONCATENATE(\"$A$\",ROW()-1)))+1,\"\")","v":22},"ME6.22",null,"95mm² ","m",{"$f":"F37","v":200}]
[{"$f":"IF($E84<>\"\",MAX($A$1:INDIRECT(CONCATENATE(\"$A$\",ROW()-1)))+1,\"\")","v":""},""]
[{"$f":"IF($E85<>\"\",MAX($A$1:INDIRECT(CONCATENATE(\"$A$\",ROW()-1)))+1,\"\")","v":23},"ME6.23",null,"Terminations to earthing bars and transformer","No.",{"$f":"F39","v":"-"}]
[{"$f":"IF($E86<>\"\",MAX($A$1:INDIRECT(CONCATENATE(\"$A$\",ROW()-1)))+1,\"\")","v":""},""]
[{"$f":"IF($E87<>\"\",MAX($A$1:INDIRECT(CONCATENATE(\"$A$\",ROW()-1)))+1,\"\")","v":""},"",null,"Cable trench excavations, including backfilling, compaction and disposal of excess material"]
[{"$f":"IF($E88<>\"\",MAX($A$1:INDIRECT(CONCATENATE(\"$A$\",ROW()-1)))+1,\"\")","v":""},""]
[{"$f":"IF($E89<>\"\",MAX($A$1:INDIRECT(CONCATENATE(\"$A$\",ROW()-1)))+1,\"\")","v":24},"ME6.24",null,"Extra-over for earth material","mᶾ",300]
[{"$f":"IF($E90<>\"\",MAX($A$1:INDIRECT(CONCATENATE(\"$A$\",ROW()-1)))+1,\"\")","v":""},""]
[{"$f":"IF($E91<>\"\",MAX($A$1:INDIRECT(CONCATENATE(\"$A$\",ROW()-1)))+1,\"\")","v":25},"ME6.25",null,"Extra-over for intermediate material (soft rock)","mᶾ",50]
[]
[null,null,null," Carried forward / …"]
[null,null,null," Brought forward / …"]
[]
[{"$f":"IF($E96<>\"\",MAX($A$1:INDIRECT(CONCATENATE(\"$A$\",ROW()-1)))+1,\"\")","v":26},"ME6.26",null,"Extra-over for in hard rock","mᶾ",20]
[{"$f":"IF($E97<>\"\",MAX($A$1:INDIRECT(CONCATENATE(\"$A$\",ROW()-1)))+1,\"\")","v":""},""]
[{"$f":"IF($E98<>\"\",MAX($A$1:INDIRECT(CONCATENATE(\"$A$\",ROW()-1)))+1,\"\")","v":27},"ME6.27",null,"Backfill material imported from off-site source (provisional)","mᶾ",200]
[{"$f":"IF($E99<>\"\",MAX($A$1:INDIRECT(CONCATENATE(\"$A$\",ROW()-1)))+1,\"\")","v":""},""]
[{"$f":"IF($E100<>\"\",MAX($A$1:INDIRECT(CONCATENATE(\"$A$\",ROW()-1)))+1,\"\")","v":""},"",null,"Underground cable ancillaries"]
[{"$f":"IF($E101<>\"\",MAX($A$1:INDIRECT(CONCATENATE(\"$A$\",ROW()-1)))+1,\"\")","v":""},""]
[{"$f":"IF($E102<>\"\",MAX($A$1:INDIRECT(CONCATENATE(\"$A$\",ROW()-1)))+1,\"\")","v":28},"ME6.28",null,"Cable warning/danger tape","m",{"$f":"F51","v":600}]
[{"$f":"IF($E103<>\"\",MAX($A$1:INDIRECT(CONCATENATE(\"$A$\",ROW()-1)))+1,\"\")","v":""},""]
[{"$f":"IF($E104<>\"\",MAX($A$1:INDIRECT(CONCATENATE(\"$A$\",ROW()-1)))+1,\"\")","v":29},"ME6.29",null,"Concrete pyramid cable markers","No.",{"$f":"F53","v":20}]
[{"$f":"IF($E105<>\"\",MAX($A$1:INDIRECT(CONCATENATE(\"$A$\",ROW()-1)))+1,\"\")","v":""},{"$f":"IF(A105<>\"\",$A$3&A105,\"\")","v":""}]
[{"$f":"IF($E106<>\"\",MAX($A$1:INDIRECT(CONCATENATE(\"$A$\",ROW()-1)))+1,\"\")","v":30},"ME6.30",null,"Concrete protective slabs","m",{"$f":"F55","v":400}]
[{"$f":"IF($E107<>\"\",MAX($A$1:INDIRECT(CONCATENATE(\"$A$\",ROW()-1)))+1,\"\")","v":""},""]
[{"$f":"IF($E108<>\"\",MAX($A$1:INDIRECT(CONCATENATE(\"$A$\",ROW()-1)))+1,\"\")","v":""},"",null,"Other:-"]
[{"$f":"IF($E109<>\"\",MAX($A$1:INDIRECT(CONCATENATE(\"$A$\",ROW()-1)))+1,\"\")","v":""},""]
[{"$f":"IF($E110<>\"\",MAX($A$1:INDIRECT(CONCATENATE(\"$A$\",ROW()-1)))+1,\"\")","v":31},"ME6.31",null,"All other items not included above but which are nevertheless necessary to meet the Scope of Work and/or are required for the proper, safe and effective operation of the plant (Specify)","Sum","-"]
[{"$f":"IF($E111<>\"\",MAX($A$1:INDIRECT(CONCATENATE(\"$A$\",ROW()-1)))+1,\"\")","v":""},"",null,"……………………………………………….."]
[{"$f":"IF($E112<>\"\",MAX($A$1:INDIRECT(CONCATENATE(\"$A$\",ROW()-1)))+1,\"\")","v":""},"",null,"……………………………………………….."]
[{"$f":"IF($E113<>\"\",MAX($A$1:INDIRECT(CONCATENATE(\"$A$\",ROW()-1)))+1,\"\")","v":""},"",null,"……………………………………………….."]
[null,null,null,"……………………………………………….."]
[]
[]
[]
[]
[]
[]
[]
[]
[]
[]
[]
[]
[]
[]
[]
[]
[]
[]
[]
[]
[]
[]
[]
[]
[]
[]
[]
[{"$f":"IF($E142<>\"\",MAX($A$1:INDIRECT(CONCATENATE(\"$A$\",ROW()-1)))+1,\"\")","v":""},{"$f":"IF(A142<>\"\",$A$3&A142,\"\")","v":""}]
[null,null,null,{"$f":"\" TOTAL SECTION \"&$A$3&\":\n Carried to Summary\"","v":" TOTAL SECTION ME6.:\n Carried to Summary"},null,null,"R"]

{"sheet":"ME7","index":18,"n_rows":225,"n_cols":8,"rows_kept":225,"cut":false,"hidden":false,"merged":[]}
["Item No","Item No","Chief Reference","Short Description","Unit","Quantity","Rate","Amount\n R             c"]
[]
["ME7.",null,null,"SECTION ME7."]
[null,null,null,"M&E WORKS - PUMP STATION"]
[null,null,"PS 9.19","11 kV OVERHEAD LINE"]
[]
[null,null,null,"Allow for all the costs and expenses in connection with the design, manufacture, routine testing, factory testing, supply, delivery, offloading and storage of the following materials and equipment:"]
[]
[{"$f":"IF($E9<>\"\",MAX($A$1:INDIRECT(CONCATENATE(\"$A$\",ROW()-1)))+1,\"\")","v":""},{"$f":"IF(A9<>\"\",$A$3&A9,\"\")","v":""},null,"Wooden Poles"]
[]
[{"$f":"IF($E11<>\"\",MAX($A$1:INDIRECT(CONCATENATE(\"$A$\",ROW()-1)))+1,\"\")","v":1},{"$f":"IF(A11<>\"\",$A$3&A11,\"\")","v":"ME7.1"},"D-DT-0051\n","Pole, Wood 11,0 m x 180-199 Top Dia.","No.",2]
[{"$f":"IF($E12<>\"\",MAX($A$1:INDIRECT(CONCATENATE(\"$A$\",ROW()-1)))+1,\"\")","v":""},""]
[{"$f":"IF($E13<>\"\",MAX($A$1:INDIRECT(CONCATENATE(\"$A$\",ROW()-1)))+1,\"\")","v":2},"ME7.2","D-DT-0053\n","Pole, Wood 12,0 m x 180-199 Top Dia.","No.",4]
[{"$f":"IF($E14<>\"\",MAX($A$1:INDIRECT(CONCATENATE(\"$A$\",ROW()-1)))+1,\"\")","v":""},""]
[{"$f":"IF($E15<>\"\",MAX($A$1:INDIRECT(CONCATENATE(\"$A$\",ROW()-1)))+1,\"\")","v":""},"",null,"MV Links"]
[{"$f":"IF($E16<>\"\",MAX($A$1:INDIRECT(CONCATENATE(\"$A$\",ROW()-1)))+1,\"\")","v":""},""]
[{"$f":"IF($E17<>\"\",MAX($A$1:INDIRECT(CONCATENATE(\"$A$\",ROW()-1)))+1,\"\")","v":3},"ME7.3","D-DT-3086\n","11 kV MV Cut-out or Link Unit (900 mm Creepage)","No.",6]
[{"$f":"IF($E18<>\"\",MAX($A$1:INDIRECT(CONCATENATE(\"$A$\",ROW()-1)))+1,\"\")","v":""},""]
[{"$f":"IF($E19<>\"\",MAX($A$1:INDIRECT(CONCATENATE(\"$A$\",ROW()-1)))+1,\"\")","v":4},"ME7.4","D-DT-3086\n","Solid Insert","No.",6]
[{"$f":"IF($E20<>\"\",MAX($A$1:INDIRECT(CONCATENATE(\"$A$\",ROW()-1)))+1,\"\")","v":""},""]
[{"$f":"IF($E21<>\"\",MAX($A$1:INDIRECT(CONCATENATE(\"$A$\",ROW()-1)))+1,\"\")","v":""},"",null,"MV Link Assembly"]
[{"$f":"IF($E22<>\"\",MAX($A$1:INDIRECT(CONCATENATE(\"$A$\",ROW()-1)))+1,\"\")","v":""},""]
[{"$f":"IF($E23<>\"\",MAX($A$1:INDIRECT(CONCATENATE(\"$A$\",ROW()-1)))+1,\"\")","v":5},"ME7.5","D-DT-1851\n","Cable Termination Links - Cut-outs - 4,5 m Wood X-arm / H-pole - 63 mm² Conductor","No.",1]
[{"$f":"IF($E24<>\"\",MAX($A$1:INDIRECT(CONCATENATE(\"$A$\",ROW()-1)))+1,\"\")","v":""},""]
[{"$f":"IF($E25<>\"\",MAX($A$1:INDIRECT(CONCATENATE(\"$A$\",ROW()-1)))+1,\"\")","v":6},"ME7.6","D-DT-1851\n","Cable Termination Links - Cut-outs - 2,5 m Wood X-arm / Single - 63 mm² Conductor","No.",1]
[{"$f":"IF($E26<>\"\",MAX($A$1:INDIRECT(CONCATENATE(\"$A$\",ROW()-1)))+1,\"\")","v":""},""]
[{"$f":"IF($E27<>\"\",MAX($A$1:INDIRECT(CONCATENATE(\"$A$\",ROW()-1)))+1,\"\")","v":""},"",null,"MV Miscellaneous"]
[{"$f":"IF($E28<>\"\",MAX($A$1:INDIRECT(CONCATENATE(\"$A$\",ROW()-1)))+1,\"\")","v":""},""]
[{"$f":"IF($E29<>\"\",MAX($A$1:INDIRECT(CONCATENATE(\"$A$\",ROW()-1)))+1,\"\")","v":7},"ME7.7","D-DT-3175\n","Vibration Damper - 63 mm² Conductor","No.",6]
[{"$f":"IF($E30<>\"\",MAX($A$1:INDIRECT(CONCATENATE(\"$A$\",ROW()-1)))+1,\"\")","v":""},""]
[{"$f":"IF($E31<>\"\",MAX($A$1:INDIRECT(CONCATENATE(\"$A$\",ROW()-1)))+1,\"\")","v":""},{"$f":"IF(A31<>\"\",$A$3&A31,\"\")","v":""},null,"MV Structures (Including cross-arms and Crimping)"]
[{"$f":"IF($E32<>\"\",MAX($A$1:INDIRECT(CONCATENATE(\"$A$\",ROW()-1)))+1,\"\")","v":""},{"$f":"IF(A32<>\"\",$A$3&A32,\"\")","v":""}]
[{"$f":"IF($E33<>\"\",MAX($A$1:INDIRECT(CONCATENATE(\"$A$\",ROW()-1)))+1,\"\")","v":8},{"$f":"IF(A33<>\"\",$A$3&A33,\"\")","v":"ME7.8"},"D-DT-1748\n","Delta / 2 x 2,5 m Wood X-arm - Strain - Medium(1°-60°) Deviation - 63 mm² Conductor","No.",1]
[{"$f":"IF($E34<>\"\",MAX($A$1:INDIRECT(CONCATENATE(\"$A$\",ROW()-1)))+1,\"\")","v":""},{"$f":"IF(A34<>\"\",$A$3&A34,\"\")","v":""}]
[{"$f":"IF($E35<>\"\",MAX($A$1:INDIRECT(CONCATENATE(\"$A$\",ROW()-1)))+1,\"\")","v":9},{"$f":"IF(A35<>\"\",$A$3&A35,\"\")","v":"ME7.9"},"D-DT-1749\n","Delta / 2 x 2,5 m Wood X-arm - Strain - Terminal - 63 mm² Conductor","No.",1]
[]
[{"$f":"IF($E37<>\"\",MAX($A$1:INDIRECT(CONCATENATE(\"$A$\",ROW()-1)))+1,\"\")","v":10},{"$f":"IF(A37<>\"\",$A$3&A37,\"\")","v":"ME7.10"},"D-DT-1778\n","2 x 4,5m Wood X-arm - Strain - Medium(1°-60°) Deviation - 63 mm² Conductor","No.",1]
[{"$f":"IF($E38<>\"\",MAX($A$1:INDIRECT(CONCATENATE(\"$A$\",ROW()-1)))+1,\"\")","v":""},{"$f":"IF(A38<>\"\",$A$3&A38,\"\")","v":""}]
[{"$f":"IF($E39<>\"\",MAX($A$1:INDIRECT(CONCATENATE(\"$A$\",ROW()-1)))+1,\"\")","v":11},"ME7.11","D-DT-1779\n","2 x 4,5m Wood X-arm - Terminal - 63 mm² Conductor","No.",1]
[]
[]
[null,null,null," Carried forward / …"]
[null,null,null," Brought forward / …"]
[]
[null,null,null,"MV Cable Termination Structures (Station Class Surge Arrestors to be used)"]
[]
[{"$f":"IF($E47<>\"\",MAX($A$1:INDIRECT(CONCATENATE(\"$A$\",ROW()-1)))+1,\"\")","v":12},{"$f":"IF(A47<>\"\",$A$3&A47,\"\")","v":"ME7.12"},"D-DT-0851\n","11kV Overhead line to 11kV cable T-off","No.",2]
[]
[null,null,null,"MV Anchors (Including labels & barbed wire for anti-climb. BIL stay insulator option is applicable)"]
[{"$f":"IF($E50<>\"\",MAX($A$1:INDIRECT(CONCATENATE(\"$A$\",ROW()-1)))+1,\"\")","v":""},""]
[{"$f":"IF($E51<>\"\",MAX($A$1:INDIRECT(CONCATENATE(\"$A$\",ROW()-1)))+1,\"\")","v":13},"ME7.13","D-DT-0341\n","Conventional Anchor (M20)","No.",13]
[{"$f":"IF($E52<>\"\",MAX($A$1:INDIRECT(CONCATENATE(\"$A$\",ROW()-1)))+1,\"\")","v":""},""]
[{"$f":"IF($E53<>\"\",MAX($A$1:INDIRECT(CONCATENATE(\"$A$\",ROW()-1)))+1,\"\")","v":""},"",null,"MV Conductor"]
[{"$f":"IF($E54<>\"\",MAX($A$1:INDIRECT(CONCATENATE(\"$A$\",ROW()-1)))+1,\"\")","v":""},""]
[{"$f":"IF($E55<>\"\",MAX($A$1:INDIRECT(CONCATENATE(\"$A$\",ROW()-1)))+1,\"\")","v":14},"ME7.14","D-DT-3136\n","ACSR (Aluminium Conductor Steel Reinforced) - Mink 63mm² Bare Conductor (10.98 Dia)","m",1890]
[{"$f":"IF($E56<>\"\",MAX($A$1:INDIRECT(CONCATENATE(\"$A$\",ROW()-1)))+1,\"\")","v":""},""]
[{"$f":"IF($E57<>\"\",MAX($A$1:INDIRECT(CONCATENATE(\"$A$\",ROW()-1)))+1,\"\")","v":""},"",null,"Armoured MV Cable"]
[{"$f":"IF($E58<>\"\",MAX($A$1:INDIRECT(CONCATENATE(\"$A$\",ROW()-1)))+1,\"\")","v":""},""]
[{"$f":"IF($E59<>\"\",MAX($A$1:INDIRECT(CONCATENATE(\"$A$\",ROW()-1)))+1,\"\")","v":15},"ME7.15","D-DT-8000\n","Cable 11kV 3C 35mm² Cu XLPE, including cable warning tape","m",300]
[{"$f":"IF($E60<>\"\",MAX($A$1:INDIRECT(CONCATENATE(\"$A$\",ROW()-1)))+1,\"\")","v":""},""]
[{"$f":"IF($E61<>\"\",MAX($A$1:INDIRECT(CONCATENATE(\"$A$\",ROW()-1)))+1,\"\")","v":""},"",null,"Cable Terminations"]
[{"$f":"IF($E62<>\"\",MAX($A$1:INDIRECT(CONCATENATE(\"$A$\",ROW()-1)))+1,\"\")","v":""},""]
[{"$f":"IF($E63<>\"\",MAX($A$1:INDIRECT(CONCATENATE(\"$A$\",ROW()-1)))+1,\"\")","v":16},"ME7.16","D-DT-0851\n","Cable 11kV 3C 35mm² Cu XLPE to Overhead Line termination (Station Class Surge Arrestors included)","No.",2]
[{"$f":"IF($E64<>\"\",MAX($A$1:INDIRECT(CONCATENATE(\"$A$\",ROW()-1)))+1,\"\")","v":""},""]
[{"$f":"IF($E65<>\"\",MAX($A$1:INDIRECT(CONCATENATE(\"$A$\",ROW()-1)))+1,\"\")","v":17},"ME7.17","D-DT-8005\n","Cable 11kV 3C 35mm² Cu XLPE to Indoor Switchgear","No.",1]
[{"$f":"IF($E66<>\"\",MAX($A$1:INDIRECT(CONCATENATE(\"$A$\",ROW()-1)))+1,\"\")","v":""},""]
[{"$f":"IF($E67<>\"\",MAX($A$1:INDIRECT(CONCATENATE(\"$A$\",ROW()-1)))+1,\"\")","v":18},"ME7.18","D-DT-8005\n","Cable 11kV 3C 35mm² Cu XLPE to Minisub MV Cubicle","No.",1]
[{"$f":"IF($E68<>\"\",MAX($A$1:INDIRECT(CONCATENATE(\"$A$\",ROW()-1)))+1,\"\")","v":""},""]
[{"$f":"IF($E69<>\"\",MAX($A$1:INDIRECT(CONCATENATE(\"$A$\",ROW()-1)))+1,\"\")","v":""},"",null,"MV Earthing"]
[{"$f":"IF($E70<>\"\",MAX($A$1:INDIRECT(CONCATENATE(\"$A$\",ROW()-1)))+1,\"\")","v":""},""]
[{"$f":"IF($E71<>\"\",MAX($A$1:INDIRECT(CONCATENATE(\"$A$\",ROW()-1)))+1,\"\")","v":19},"ME7.19","D-DT-0862\n","Trench Electrode, MV Earth electrode system, complete","No.",2]
[{"$f":"IF($E72<>\"\",MAX($A$1:INDIRECT(CONCATENATE(\"$A$\",ROW()-1)))+1,\"\")","v":""},""]
[{"$f":"IF($E73<>\"\",MAX($A$1:INDIRECT(CONCATENATE(\"$A$\",ROW()-1)))+1,\"\")","v":""},"",null,"Labelling"]
[{"$f":"IF($E74<>\"\",MAX($A$1:INDIRECT(CONCATENATE(\"$A$\",ROW()-1)))+1,\"\")","v":""},""]
[{"$f":"IF($E75<>\"\",MAX($A$1:INDIRECT(CONCATENATE(\"$A$\",ROW()-1)))+1,\"\")","v":20},"ME7.20",null,"Pole Labels","No.",4]
[{"$f":"IF($E76<>\"\",MAX($A$1:INDIRECT(CONCATENATE(\"$A$\",ROW()-1)))+1,\"\")","v":""},""]
[{"$f":"IF($E77<>\"\",MAX($A$1:INDIRECT(CONCATENATE(\"$A$\",ROW()-1)))+1,\"\")","v":21},{"$f":"IF(A77<>\"\",$A$3&A77,\"\")","v":"ME7.21"},null,"MV Link Labels","No.",2]
[{"$f":"IF($E78<>\"\",MAX($A$1:INDIRECT(CONCATENATE(\"$A$\",ROW()-1)))+1,\"\")","v":""},{"$f":"IF(A78<>\"\",$A$3&A78,\"\")","v":""}]
[{"$f":"IF($E79<>\"\",MAX($A$1:INDIRECT(CONCATENATE(\"$A$\",ROW()-1)))+1,\"\")","v":""},"",null,"Allow for all costs and expenses in connection with the Site installation, testing and commissioning of the following:-"]
[{"$f":"IF($E80<>\"\",MAX($A$1:INDIRECT(CONCATENATE(\"$A$\",ROW()-1)))+1,\"\")","v":""},""]
[{"$f":"IF($E81<>\"\",MAX($A$1:INDIRECT(CONCATENATE(\"$A$\",ROW()-1)))+1,\"\")","v":""},"",null,"Wooden Poles"]
[{"$f":"IF($E82<>\"\",MAX($A$1:INDIRECT(CONCATENATE(\"$A$\",ROW()-1)))+1,\"\")","v":""},""]
[{"$f":"IF($E83<>\"\",MAX($A$1:INDIRECT(CONCATENATE(\"$A$\",ROW()-1)))+1,\"\")","v":22},"ME7.22","D-DT-0051\n","Pole, Wood 11,0 m x 180-199 Top Dia.","No.",2]
[]
[{"$f":"IF($E85<>\"\",MAX($A$1:INDIRECT(CONCATENATE(\"$A$\",ROW()-1)))+1,\"\")","v":23},"ME7.23","D-DT-0053\n","Pole, Wood 12,0 m x 180-199 Top Dia.","No.",4]
[]
[null,null,null," Carried forward / …"]
[null,null,null," Brought forward / …"]
[]
[{"$f":"IF($E90<>\"\",MAX($A$1:INDIRECT(CONCATENATE(\"$A$\",ROW()-1)))+1,\"\")","v":""},"",null,"MV Links"]
[{"$f":"IF($E91<>\"\",MAX($A$1:INDIRECT(CONCATENATE(\"$A$\",ROW()-1)))+1,\"\")","v":""},""]
[{"$f":"IF($E92<>\"\",MAX($A$1:INDIRECT(CONCATENATE(\"$A$\",ROW()-1)))+1,\"\")","v":24},"ME7.24","D-DT-3086\n","11 kV MV Cut-out or Link Unit (900 mm Creepage)","No.",6]
[]
[{"$f":"IF($E94<>\"\",MAX($A$1:INDIRECT(CONCATENATE(\"$A$\",ROW()-1)))+1,\"\")","v":25},{"$f":"IF(A94<>\"\",$A$3&A94,\"\")","v":"ME7.25"},"D-DT-3086\n","Solid Insert","No.",6]
[]
[{"$f":"IF($E96<>\"\",MAX($A$1:INDIRECT(CONCATENATE(\"$A$\",ROW()-1)))+1,\"\")","v":""},"",null,"MV Link Assembly"]
[{"$f":"IF($E97<>\"\",MAX($A$1:INDIRECT(CONCATENATE(\"$A$\",ROW()-1)))+1,\"\")","v":""},""]
[{"$f":"IF($E98<>\"\",MAX($A$1:INDIRECT(CONCATENATE(\"$A$\",ROW()-1)))+1,\"\")","v":26},"ME7.26","D-DT-1851\n","Cable Termination Links - Cut-outs - 4,5 m Wood X-arm / H-pole - 63 mm² Conductor","No.",1]
[{"$f":"IF($E99<>\"\",MAX($A$1:INDIRECT(CONCATENATE(\"$A$\",ROW()-1)))+1,\"\")","v":""},""]
[{"$f":"IF($E100<>\"\",MAX($A$1:INDIRECT(CONCATENATE(\"$A$\",ROW()-1)))+1,\"\")","v":27},"ME7.27","D-DT-1851\n","Cable Termination Links - Cut-outs - 2,5 m Wood X-arm / Single - 63 mm² Conductor","No.",1]
[{"$f":"IF($E101<>\"\",MAX($A$1:INDIRECT(CONCATENATE(\"$A$\",ROW()-1)))+1,\"\")","v":""},""]
[{"$f":"IF($E102<>\"\",MAX($A$1:INDIRECT(CONCATENATE(\"$A$\",ROW()-1)))+1,\"\")","v":""},"",null,"MV Miscellaneous"]
[{"$f":"IF($E103<>\"\",MAX($A$1:INDIRECT(CONCATENATE(\"$A$\",ROW()-1)))+1,\"\")","v":""},""]
[{"$f":"IF($E104<>\"\",MAX($A$1:INDIRECT(CONCATENATE(\"$A$\",ROW()-1)))+1,\"\")","v":28},"ME7.28","D-DT-3175\n","Vibration Damper - 63 mm² Conductor","No.",6]
[{"$f":"IF($E105<>\"\",MAX($A$1:INDIRECT(CONCATENATE(\"$A$\",ROW()-1)))+1,\"\")","v":""},{"$f":"IF(A105<>\"\",$A$3&A105,\"\")","v":""}]
[{"$f":"IF($E106<>\"\",MAX($A$1:INDIRECT(CONCATENATE(\"$A$\",ROW()-1)))+1,\"\")","v":""},"",null,"MV Structures (Including cross-arms and Crimping)"]
[{"$f":"IF($E107<>\"\",MAX($A$1:INDIRECT(CONCATENATE(\"$A$\",ROW()-1)))+1,\"\")","v":""},""]
[{"$f":"IF($E108<>\"\",MAX($A$1:INDIRECT(CONCATENATE(\"$A$\",ROW()-1)))+1,\"\")","v":29},"ME7.29","D-DT-1748\n","Delta / 2 x 2,5 m Wood X-arm - Strain - Medium(1°-60°) Deviation - 63 mm² Conductor","No.",1]
[{"$f":"IF($E109<>\"\",MAX($A$1:INDIRECT(CONCATENATE(\"$A$\",ROW()-1)))+1,\"\")","v":""},""]
[{"$f":"IF($E110<>\"\",MAX($A$1:INDIRECT(CONCATENATE(\"$A$\",ROW()-1)))+1,\"\")","v":30},"ME7.30","D-DT-1749\n","Delta / 2 x 2,5 m Wood X-arm - Strain - Terminal - 63 mm² Conductor","No.",1]
[{"$f":"IF($E111<>\"\",MAX($A$1:INDIRECT(CONCATENATE(\"$A$\",ROW()-1)))+1,\"\")","v":""},""]
[{"$f":"IF($E112<>\"\",MAX($A$1:INDIRECT(CONCATENATE(\"$A$\",ROW()-1)))+1,\"\")","v":31},"ME7.31","D-DT-1778\n","2 x 4,5m Wood X-arm - Strain - Medium(1°-60°) Deviation - 63 mm² Conductor","No.",1]
[{"$f":"IF($E113<>\"\",MAX($A$1:INDIRECT(CONCATENATE(\"$A$\",ROW()-1)))+1,\"\")","v":""},""]
[{"$f":"IF($E114<>\"\",MAX($A$1:INDIRECT(CONCATENATE(\"$A$\",ROW()-1)))+1,\"\")","v":32},"ME7.32","D-DT-1779\n","2 x 4,5m Wood X-arm - Terminal - 63 mm² Conductor","No.",1]
[{"$f":"IF($E115<>\"\",MAX($A$1:INDIRECT(CONCATENATE(\"$A$\",ROW()-1)))+1,\"\")","v":""},""]
[{"$f":"IF($E116<>\"\",MAX($A$1:INDIRECT(CONCATENATE(\"$A$\",ROW()-1)))+1,\"\")","v":""},"",null,"MV Cable Termination Structures (Station Class Surge Arrestors to be used)"]
[{"$f":"IF($E117<>\"\",MAX($A$1:INDIRECT(CONCATENATE(\"$A$\",ROW()-1)))+1,\"\")","v":""},""]
[{"$f":"IF($E118<>\"\",MAX($A$1:INDIRECT(CONCATENATE(\"$A$\",ROW()-1)))+1,\"\")","v":33},"ME7.33","D-DT-0851\n","11kV Overhead line to 11kV cable T-off","No.",2]
[{"$f":"IF($E119<>\"\",MAX($A$1:INDIRECT(CONCATENATE(\"$A$\",ROW()-1)))+1,\"\")","v":""},""]
[{"$f":"IF($E120<>\"\",MAX($A$1:INDIRECT(CONCATENATE(\"$A$\",ROW()-1)))+1,\"\")","v":""},"",null,"MV Anchors (Including labels & barbed wire for anti-climb. BIL stay insulator option is applicable)"]
[{"$f":"IF($E121<>\"\",MAX($A$1:INDIRECT(CONCATENATE(\"$A$\",ROW()-1)))+1,\"\")","v":""},""]
[{"$f":"IF($E122<>\"\",MAX($A$1:INDIRECT(CONCATENATE(\"$A$\",ROW()-1)))+1,\"\")","v":34},"ME7.34","D-DT-0341\n","Conventional Anchor (M20)","No.",13]
[{"$f":"IF($E123<>\"\",MAX($A$1:INDIRECT(CONCATENATE(\"$A$\",ROW()-1)))+1,\"\")","v":""},""]
[{"$f":"IF($E124<>\"\",MAX($A$1:INDIRECT(CONCATENATE(\"$A$\",ROW()-1)))+1,\"\")","v":""},"",null,"MV Conductor"]
[{"$f":"IF($E125<>\"\",MAX($A$1:INDIRECT(CONCATENATE(\"$A$\",ROW()-1)))+1,\"\")","v":""},""]
[{"$f":"IF($E126<>\"\",MAX($A$1:INDIRECT(CONCATENATE(\"$A$\",ROW()-1)))+1,\"\")","v":35},{"$f":"IF(A126<>\"\",$A$3&A126,\"\")","v":"ME7.35"},"D-DT-3136\n","ACSR (Aluminium Conductor Steel Reinforced) - Mink 63mm² Bare Conductor (10.98 Dia)","m",1890]
[]
[null,null,null," Carried forward / …"]
[null,null,null," Brought forward / …"]
[]
[{"$f":"IF($E131<>\"\",MAX($A$1:INDIRECT(CONCATENATE(\"$A$\",ROW()-1)))+1,\"\")","v":""},"",null,"Armoured MV Cable"]
[{"$f":"IF($E132<>\"\",MAX($A$1:INDIRECT(CONCATENATE(\"$A$\",ROW()-1)))+1,\"\")","v":""},""]
[{"$f":"IF($E133<>\"\",MAX($A$1:INDIRECT(CONCATENATE(\"$A$\",ROW()-1)))+1,\"\")","v":36},"ME7.36","D-DT-8000\n","Cable 11kV 3C 35mm² Cu XLPE, including cable warning tape","m",300]
[{"$f":"IF($E134<>\"\",MAX($A$1:INDIRECT(CONCATENATE(\"$A$\",ROW()-1)))+1,\"\")","v":""},""]
[{"$f":"IF($E135<>\"\",MAX($A$1:INDIRECT(CONCATENATE(\"$A$\",ROW()-1)))+1,\"\")","v":""},"",null,"Cable Terminations"]
[{"$f":"IF($E136<>\"\",MAX($A$1:INDIRECT(CONCATENATE(\"$A$\",ROW()-1)))+1,\"\")","v":""},""]
[{"$f":"IF($E137<>\"\",MAX($A$1:INDIRECT(CONCATENATE(\"$A$\",ROW()-1)))+1,\"\")","v":37},"ME7.37","D-DT-0851\n","Cable 11kV 3C 35mm² Cu XLPE to Overhead Line termination (Station Class Surge Arrestors included)","No.",2]
[{"$f":"IF($E138<>\"\",MAX($A$1:INDIRECT(CONCATENATE(\"$A$\",ROW()-1)))+1,\"\")","v":""},""]
[{"$f":"IF($E139<>\"\",MAX($A$1:INDIRECT(CONCATENATE(\"$A$\",ROW()-1)))+1,\"\")","v":38},"ME7.38","D-DT-8005\n","Cable 11kV 3C 35mm² Cu XLPE to Indoor Switchgear","No.",1]
[{"$f":"IF($E140<>\"\",MAX($A$1:INDIRECT(CONCATENATE(\"$A$\",ROW()-1)))+1,\"\")","v":""},""]
[{"$f":"IF($E141<>\"\",MAX($A$1:INDIRECT(CONCATENATE(\"$A$\",ROW()-1)))+1,\"\")","v":39},"ME7.39","D-DT-8005\n","Cable 11kV 3C 35mm² Cu XLPE to Minisub MV Cubicle","No.",1]
[{"$f":"IF($E142<>\"\",MAX($A$1:INDIRECT(CONCATENATE(\"$A$\",ROW()-1)))+1,\"\")","v":""},""]
[{"$f":"IF($E143<>\"\",MAX($A$1:INDIRECT(CONCATENATE(\"$A$\",ROW()-1)))+1,\"\")","v":""},"",null,"MV Earthing"]
[{"$f":"IF($E144<>\"\",MAX($A$1:INDIRECT(CONCATENATE(\"$A$\",ROW()-1)))+1,\"\")","v":""},""]
[{"$f":"IF($E145<>\"\",MAX($A$1:INDIRECT(CONCATENATE(\"$A$\",ROW()-1)))+1,\"\")","v":40},"ME7.40","D-DT-0862\n","Trench Electrode, MV Earth electrode system, complete","No.",2]
[{"$f":"IF($E146<>\"\",MAX($A$1:INDIRECT(CONCATENATE(\"$A$\",ROW()-1)))+1,\"\")","v":""},""]
[{"$f":"IF($E147<>\"\",MAX($A$1:INDIRECT(CONCATENATE(\"$A$\",ROW()-1)))+1,\"\")","v":""},"",null,"Labelling"]
[{"$f":"IF($E148<>\"\",MAX($A$1:INDIRECT(CONCATENATE(\"$A$\",ROW()-1)))+1,\"\")","v":""},""]
[{"$f":"IF($E149<>\"\",MAX($A$1:INDIRECT(CONCATENATE(\"$A$\",ROW()-1)))+1,\"\")","v":41},"ME7.41",null,"Pole Labels","No.",4]
[{"$f":"IF($E150<>\"\",MAX($A$1:INDIRECT(CONCATENATE(\"$A$\",ROW()-1)))+1,\"\")","v":""},""]
[{"$f":"IF($E151<>\"\",MAX($A$1:INDIRECT(CONCATENATE(\"$A$\",ROW()-1)))+1,\"\")","v":42},"ME7.42",null,"MV Link Labels","No.",2]
[{"$f":"IF($E152<>\"\",MAX($A$1:INDIRECT(CONCATENATE(\"$A$\",ROW()-1)))+1,\"\")","v":""},""]
[{"$f":"IF($E153<>\"\",MAX($A$1:INDIRECT(CONCATENATE(\"$A$\",ROW()-1)))+1,\"\")","v":""},"",null,"Excavation (Drill Rig / Hand) for new pole installations. (Anchor holes are to be slotted if drilled by machine)"]
[{"$f":"IF($E154<>\"\",MAX($A$1:INDIRECT(CONCATENATE(\"$A$\",ROW()-1)))+1,\"\")","v":""},""]
[{"$f":"IF($E155<>\"\",MAX($A$1:INDIRECT(CONCATENATE(\"$A$\",ROW()-1)))+1,\"\")","v":43},"ME7.43",null,"1,8 m depth for pole - Hard rock","No.",2]
[{"$f":"IF($E156<>\"\",MAX($A$1:INDIRECT(CONCATENATE(\"$A$\",ROW()-1)))+1,\"\")","v":""},""]
[{"$f":"IF($E157<>\"\",MAX($A$1:INDIRECT(CONCATENATE(\"$A$\",ROW()-1)))+1,\"\")","v":44},"ME7.44",null,"2,0 m depth for pole - Hard rock","No.",4]
[{"$f":"IF($E158<>\"\",MAX($A$1:INDIRECT(CONCATENATE(\"$A$\",ROW()-1)))+1,\"\")","v":""},""]
[{"$f":"IF($E159<>\"\",MAX($A$1:INDIRECT(CONCATENATE(\"$A$\",ROW()-1)))+1,\"\")","v":45},"ME7.45",null,"1,8 m depth for MV stay - Hard rock","No.",13]
[{"$f":"IF($E160<>\"\",MAX($A$1:INDIRECT(CONCATENATE(\"$A$\",ROW()-1)))+1,\"\")","v":""},""]
[{"$f":"IF($E161<>\"\",MAX($A$1:INDIRECT(CONCATENATE(\"$A$\",ROW()-1)))+1,\"\")","v":""},"",null,"Excavation - Trenching"]
[{"$f":"IF($E162<>\"\",MAX($A$1:INDIRECT(CONCATENATE(\"$A$\",ROW()-1)))+1,\"\")","v":""},""]
[{"$f":"IF($E163<>\"\",MAX($A$1:INDIRECT(CONCATENATE(\"$A$\",ROW()-1)))+1,\"\")","v":46},"ME7.46",null,"MV Cable Trench Excavations (1000 mm Deep X 600 mm Wide) - Hard Rock","m³",180]
[{"$f":"IF($E164<>\"\",MAX($A$1:INDIRECT(CONCATENATE(\"$A$\",ROW()-1)))+1,\"\")","v":""},""]
[{"$f":"IF($E165<>\"\",MAX($A$1:INDIRECT(CONCATENATE(\"$A$\",ROW()-1)))+1,\"\")","v":""},"",null,"Bush Clearing.  Bush clearing to take place in accordance with the Environmental Management Programme"]
[{"$f":"IF($E166<>\"\",MAX($A$1:INDIRECT(CONCATENATE(\"$A$\",ROW()-1)))+1,\"\")","v":""},""]
[{"$f":"IF($E167<>\"\",MAX($A$1:INDIRECT(CONCATENATE(\"$A$\",ROW()-1)))+1,\"\")","v":47},"ME7.47",null,"Bush clearing - Thick. Allow for the clearing of bush for a 1 m wide strip under the line route","m",200]
[]
[]
[]
[]
[null,null,null," Carried forward / …"]
[null,null,null," Brought forward / …"]
[]
[{"$f":"IF($E175<>\"\",MAX($A$1:INDIRECT(CONCATENATE(\"$A$\",ROW()-1)))+1,\"\")","v":""},{"$f":"IF(A175<>\"\",$A$3&A175,\"\")","v":""},null,"Other:-"]
[{"$f":"IF($E176<>\"\",MAX($A$1:INDIRECT(CONCATENATE(\"$A$\",ROW()-1)))+1,\"\")","v":""},""]
[{"$f":"IF($E177<>\"\",MAX($A$1:INDIRECT(CONCATENATE(\"$A$\",ROW()-1)))+1,\"\")","v":""},"",null,"Testing & Commissioning (Test equipment, perform tests and supply test certificates"]
[{"$f":"IF($E178<>\"\",MAX($A$1:INDIRECT(CONCATENATE(\"$A$\",ROW()-1)))+1,\"\")","v":""},""]
[{"$f":"IF($E179<>\"\",MAX($A$1:INDIRECT(CONCATENATE(\"$A$\",ROW()-1)))+1,\"\")","v":48},"ME7.48",null,"11 kV Cable Pressure Test","No",2]
[{"$f":"IF($E180<>\"\",MAX($A$1:INDIRECT(CONCATENATE(\"$A$\",ROW()-1)))+1,\"\")","v":""},""]
[{"$f":"IF($E181<>\"\",MAX($A$1:INDIRECT(CONCATENATE(\"$A$\",ROW()-1)))+1,\"\")","v":49},"ME7.49",null,"MV Earth Resistance Test","No",2]
[{"$f":"IF($E182<>\"\",MAX($A$1:INDIRECT(CONCATENATE(\"$A$\",ROW()-1)))+1,\"\")","v":""},""]
[{"$f":"IF($E183<>\"\",MAX($A$1:INDIRECT(CONCATENATE(\"$A$\",ROW()-1)))+1,\"\")","v":50},"ME7.50",null,"MV Earth Continuity Test","No",2]
[{"$f":"IF($E184<>\"\",MAX($A$1:INDIRECT(CONCATENATE(\"$A$\",ROW()-1)))+1,\"\")","v":""},""]
[{"$f":"IF($E185<>\"\",MAX($A$1:INDIRECT(CONCATENATE(\"$A$\",ROW()-1)))+1,\"\")","v":51},"ME7.51",null,"Phase Rotation Tests","No",2]
[{"$f":"IF($E186<>\"\",MAX($A$1:INDIRECT(CONCATENATE(\"$A$\",ROW()-1)))+1,\"\")","v":""},""]
[{"$f":"IF($E187<>\"\",MAX($A$1:INDIRECT(CONCATENATE(\"$A$\",ROW()-1)))+1,\"\")","v":52},"ME7.52",null,"Voltage level measurements","No",4]
[{"$f":"IF($E188<>\"\",MAX($A$1:INDIRECT(CONCATENATE(\"$A$\",ROW()-1)))+1,\"\")","v":""},""]
[{"$f":"IF($E189<>\"\",MAX($A$1:INDIRECT(CONCATENATE(\"$A$\",ROW()-1)))+1,\"\")","v":53},"ME7.53",null,"All other items not included above but which are nevertheless necessary to meet the Scope of Work and/or are required for the proper, safe and effective operation of the plant (Specify)","Sum","-"]
[{"$f":"IF($E190<>\"\",MAX($A$1:INDIRECT(CONCATENATE(\"$A$\",ROW()-1)))+1,\"\")","v":""},"",null,"……………………………………………….."]
[{"$f":"IF($E191<>\"\",MAX($A$1:INDIRECT(CONCATENATE(\"$A$\",ROW()-1)))+1,\"\")","v":""},"",null,"……………………………………………….."]
[{"$f":"IF($E192<>\"\",MAX($A$1:INDIRECT(CONCATENATE(\"$A$\",ROW()-1)))+1,\"\")","v":""},"",null,"……………………………………………….."]
[{"$f":"IF($E193<>\"\",MAX($A$1:INDIRECT(CONCATENATE(\"$A$\",ROW()-1)))+1,\"\")","v":""},"",null,"……………………………………………….."]
[{"$f":"IF($E194<>\"\",MAX($A$1:INDIRECT(CONCATENATE(\"$A$\",ROW()-1)))+1,\"\")","v":""},"",null,"……………………………………………….."]
[{"$f":"IF($E195<>\"\",MAX($A$1:INDIRECT(CONCATENATE(\"$A$\",ROW()-1)))+1,\"\")","v":""},""]
[{"$f":"IF($E196<>\"\",MAX($A$1:INDIRECT(CONCATENATE(\"$A$\",ROW()-1)))+1,\"\")","v":""},""]
[{"$f":"IF($E197<>\"\",MAX($A$1:INDIRECT(CONCATENATE(\"$A$\",ROW()-1)))+1,\"\")","v":""},""]
[{"$f":"IF($E198<>\"\",MAX($A$1:INDIRECT(CONCATENATE(\"$A$\",ROW()-1)))+1,\"\")","v":""},""]
[{"$f":"IF($E199<>\"\",MAX($A$1:INDIRECT(CONCATENATE(\"$A$\",ROW()-1)))+1,\"\")","v":""},""]
[{"$f":"IF($E200<>\"\",MAX($A$1:INDIRECT(CONCATENATE(\"$A$\",ROW()-1)))+1,\"\")","v":""},""]
[{"$f":"IF($E201<>\"\",MAX($A$1:INDIRECT(CONCATENATE(\"$A$\",ROW()-1)))+1,\"\")","v":""},""]
[{"$f":"IF($E202<>\"\",MAX($A$1:INDIRECT(CONCATENATE(\"$A$\",ROW()-1)))+1,\"\")","v":""},""]
[]
[]
[]
[]
[]
[]
[]
[]
[]
[]
[]
[]
[{"$f":"IF($E215<>\"\",MAX($A$1:INDIRECT(CONCATENATE(\"$A$\",ROW()-1)))+1,\"\")","v":""},""]
[{"$f":"IF($E216<>\"\",MAX($A$1:INDIRECT(CONCATENATE(\"$A$\",ROW()-1)))+1,\"\")","v":""},""]
[{"$f":"IF($E217<>\"\",MAX($A$1:INDIRECT(CONCATENATE(\"$A$\",ROW()-1)))+1,\"\")","v":""},""]
[{"$f":"IF($E218<>\"\",MAX($A$1:INDIRECT(CONCATENATE(\"$A$\",ROW()-1)))+1,\"\")","v":""},""]
[{"$f":"IF($E219<>\"\",MAX($A$1:INDIRECT(CONCATENATE(\"$A$\",ROW()-1)))+1,\"\")","v":""},""]
[{"$f":"IF($E220<>\"\",MAX($A$1:INDIRECT(CONCATENATE(\"$A$\",ROW()-1)))+1,\"\")","v":""},""]
[{"$f":"IF($E221<>\"\",MAX($A$1:INDIRECT(CONCATENATE(\"$A$\",ROW()-1)))+1,\"\")","v":""},"",null," TOTAL SECTION ME7.:\n Carried to Summary",null,null,"R"]
[{"$f":"IF($E222<>\"\",MAX($A$1:INDIRECT(CONCATENATE(\"$A$\",ROW()-1)))+1,\"\")","v":""},""]
[{"$f":"IF($E223<>\"\",MAX($A$1:INDIRECT(CONCATENATE(\"$A$\",ROW()-1)))+1,\"\")","v":""},""]
[{"$f":"IF($E224<>\"\",MAX($A$1:INDIRECT(CONCATENATE(\"$A$\",ROW()-1)))+1,\"\")","v":""},""]
[{"$f":"IF($E225<>\"\",MAX($A$1:INDIRECT(CONCATENATE(\"$A$\",ROW()-1)))+1,\"\")","v":""},""]

{"sheet":"ME8","index":19,"n_rows":89,"n_cols":8,"rows_kept":89,"cut":false,"hidden":false,"merged":[]}
["Item No","Item No","Chief Reference","Short Description","Unit","Quantity","Rate","Amount\n R             c"]
[]
["ME8.",null,null,{"$f":"\"SECTION \"&A3","v":"SECTION ME8."}]
[null,null,null,"M&E WORKS - PUMP STATION"]
[null,null,"PS 9.20, PS 9.21","MV SWITCHGEAR"]
[]
[{"$f":"IF($E7<>\"\",MAX($A$1:INDIRECT(CONCATENATE(\"$A$\",ROW()-1)))+1,\"\")","v":""},{"$f":"IF(A7<>\"\",$A$3&A7,\"\")","v":""},null,"Allow for all the costs and expenses in connection with the design, manufacture, routine testing, factory testing, supply, delivery, offloading and storage of the following materials and equipment:"]
[{"$f":"IF($E8<>\"\",MAX($A$1:INDIRECT(CONCATENATE(\"$A$\",ROW()-1)))+1,\"\")","v":""},""]
[{"$f":"IF($E9<>\"\",MAX($A$1:INDIRECT(CONCATENATE(\"$A$\",ROW()-1)))+1,\"\")","v":1},"ME8.1",null,"Extensible 11kV switchboard ","Sum","-"]
[{"$f":"IF($E10<>\"\",MAX($A$1:INDIRECT(CONCATENATE(\"$A$\",ROW()-1)))+1,\"\")","v":""},""]
[{"$f":"IF($E11<>\"\",MAX($A$1:INDIRECT(CONCATENATE(\"$A$\",ROW()-1)))+1,\"\")","v":2},"ME8.2",null,"MV control panel for 11 kV switchgear","Sum","-"]
[{"$f":"IF($E12<>\"\",MAX($A$1:INDIRECT(CONCATENATE(\"$A$\",ROW()-1)))+1,\"\")","v":""},""]
[{"$f":"IF($E13<>\"\",MAX($A$1:INDIRECT(CONCATENATE(\"$A$\",ROW()-1)))+1,\"\")","v":3},"ME8.3",null,"Battery Tripping Unit  (incl 110V DB) complete ","No.",1]
[{"$f":"IF($E14<>\"\",MAX($A$1:INDIRECT(CONCATENATE(\"$A$\",ROW()-1)))+1,\"\")","v":""},""]
[{"$f":"IF($E15<>\"\",MAX($A$1:INDIRECT(CONCATENATE(\"$A$\",ROW()-1)))+1,\"\")","v":4},"ME8.4",null,"Power Factor Correction Units for MV Motor Starters, complete with wiring, output to SCADA, and all necessary items to complete installaton","No.",4]
[{"$f":"IF($E16<>\"\",MAX($A$1:INDIRECT(CONCATENATE(\"$A$\",ROW()-1)))+1,\"\")","v":""},""]
[{"$f":"IF($E17<>\"\",MAX($A$1:INDIRECT(CONCATENATE(\"$A$\",ROW()-1)))+1,\"\")","v":5},"ME8.5",null,"Zorc Type Surge Protection for MV Motors, complete with wiring,  and all necessary items to complete installaton","No.",4]
[{"$f":"IF($E18<>\"\",MAX($A$1:INDIRECT(CONCATENATE(\"$A$\",ROW()-1)))+1,\"\")","v":""},""]
[{"$f":"IF($E19<>\"\",MAX($A$1:INDIRECT(CONCATENATE(\"$A$\",ROW()-1)))+1,\"\")","v":""},"",null,"Allow for all costs and expenses in connection with the Site installation, testing and commissioning of the following:-"]
[{"$f":"IF($E20<>\"\",MAX($A$1:INDIRECT(CONCATENATE(\"$A$\",ROW()-1)))+1,\"\")","v":""},""]
[{"$f":"IF($E21<>\"\",MAX($A$1:INDIRECT(CONCATENATE(\"$A$\",ROW()-1)))+1,\"\")","v":6},"ME8.6",null,"Extensible switchpanel, 11 kV ","Sum",{"$f":"F9","v":"-"}]
[{"$f":"IF($E22<>\"\",MAX($A$1:INDIRECT(CONCATENATE(\"$A$\",ROW()-1)))+1,\"\")","v":""},""]
[{"$f":"IF($E23<>\"\",MAX($A$1:INDIRECT(CONCATENATE(\"$A$\",ROW()-1)))+1,\"\")","v":7},"ME8.7",null,"MV control panel for 11 kV switchgear","Sum",{"$f":"F11","v":"-"}]
[{"$f":"IF($E24<>\"\",MAX($A$1:INDIRECT(CONCATENATE(\"$A$\",ROW()-1)))+1,\"\")","v":""},""]
[{"$f":"IF($E25<>\"\",MAX($A$1:INDIRECT(CONCATENATE(\"$A$\",ROW()-1)))+1,\"\")","v":8},"ME8.8",null,"Battery Tripping Unit   (incl 110V DB) complete ","No.",{"$f":"F13","v":1}]
[{"$f":"IF($E26<>\"\",MAX($A$1:INDIRECT(CONCATENATE(\"$A$\",ROW()-1)))+1,\"\")","v":""},""]
[{"$f":"IF($E27<>\"\",MAX($A$1:INDIRECT(CONCATENATE(\"$A$\",ROW()-1)))+1,\"\")","v":9},"ME8.9",null,"Protection coordination by Specialist for MV Switchgear commissioning","Sum","-"]
[{"$f":"IF($E28<>\"\",MAX($A$1:INDIRECT(CONCATENATE(\"$A$\",ROW()-1)))+1,\"\")","v":""},""]
[{"$f":"IF($E29<>\"\",MAX($A$1:INDIRECT(CONCATENATE(\"$A$\",ROW()-1)))+1,\"\")","v":10},"ME8.10",null,"Power Factor Correction Units for MV Motor Starters, complete with wiring, output to SCADA, and all necessary items to complete installaton","No.",{"$f":"F15","v":4}]
[{"$f":"IF($E30<>\"\",MAX($A$1:INDIRECT(CONCATENATE(\"$A$\",ROW()-1)))+1,\"\")","v":""},""]
[{"$f":"IF($E31<>\"\",MAX($A$1:INDIRECT(CONCATENATE(\"$A$\",ROW()-1)))+1,\"\")","v":11},"ME8.11",null,"Zorc Type Surge Protection for MV Motors, complete with wiring,  and all necessary items to complete installaton","No.",{"$f":"F17","v":4}]
[]
[]
[]
[]
[]
[null,null,null," Carried forward / …"]
[null,null,null," Brought forward / …"]
[]
[{"$f":"IF($E40<>\"\",MAX($A$1:INDIRECT(CONCATENATE(\"$A$\",ROW()-1)))+1,\"\")","v":""},{"$f":"IF(A40<>\"\",$A$3&A40,\"\")","v":""},null,"Other:-"]
[]
[{"$f":"IF($E42<>\"\",MAX($A$1:INDIRECT(CONCATENATE(\"$A$\",ROW()-1)))+1,\"\")","v":12},"ME8.12",null,"Interim storage of equipment as ordered by the Engineer including insurances","Month",12]
[{"$f":"IF($E43<>\"\",MAX($A$1:INDIRECT(CONCATENATE(\"$A$\",ROW()-1)))+1,\"\")","v":""},""]
[{"$f":"IF($E44<>\"\",MAX($A$1:INDIRECT(CONCATENATE(\"$A$\",ROW()-1)))+1,\"\")","v":13},"ME8.13",null,"All other items not included above but which are nevertheless necessary to meet the Scope of Work and/or are required for the proper, safe and effective operation of the plant (Specify)","Sum","-"]
[{"$f":"IF($E45<>\"\",MAX($A$1:INDIRECT(CONCATENATE(\"$A$\",ROW()-1)))+1,\"\")","v":""},"",null,"……………………………………………….."]
[{"$f":"IF($E46<>\"\",MAX($A$1:INDIRECT(CONCATENATE(\"$A$\",ROW()-1)))+1,\"\")","v":""},"",null,"……………………………………………….."]
[{"$f":"IF($E47<>\"\",MAX($A$1:INDIRECT(CONCATENATE(\"$A$\",ROW()-1)))+1,\"\")","v":""},"",null,"……………………………………………….."]
[{"$f":"IF($E48<>\"\",MAX($A$1:INDIRECT(CONCATENATE(\"$A$\",ROW()-1)))+1,\"\")","v":""},"",null,"……………………………………………….."]
[{"$f":"IF($E49<>\"\",MAX($A$1:INDIRECT(CONCATENATE(\"$A$\",ROW()-1)))+1,\"\")","v":""},"",null,"……………………………………………….."]
[{"$f":"IF($E50<>\"\",MAX($A$1:INDIRECT(CONCATENATE(\"$A$\",ROW()-1)))+1,\"\")","v":""},""]
[{"$f":"IF($E51<>\"\",MAX($A$1:INDIRECT(CONCATENATE(\"$A$\",ROW()-1)))+1,\"\")","v":""},""]
[{"$f":"IF($E52<>\"\",MAX($A$1:INDIRECT(CONCATENATE(\"$A$\",ROW()-1)))+1,\"\")","v":""},""]
[{"$f":"IF($E53<>\"\",MAX($A$1:INDIRECT(CONCATENATE(\"$A$\",ROW()-1)))+1,\"\")","v":""},""]
[{"$f":"IF($E54<>\"\",MAX($A$1:INDIRECT(CONCATENATE(\"$A$\",ROW()-1)))+1,\"\")","v":""},""]
[{"$f":"IF($E55<>\"\",MAX($A$1:INDIRECT(CONCATENATE(\"$A$\",ROW()-1)))+1,\"\")","v":""},""]
[{"$f":"IF($E56<>\"\",MAX($A$1:INDIRECT(CONCATENATE(\"$A$\",ROW()-1)))+1,\"\")","v":""},""]
[{"$f":"IF($E57<>\"\",MAX($A$1:INDIRECT(CONCATENATE(\"$A$\",ROW()-1)))+1,\"\")","v":""},""]
[{"$f":"IF($E58<>\"\",MAX($A$1:INDIRECT(CONCATENATE(\"$A$\",ROW()-1)))+1,\"\")","v":""},""]
[{"$f":"IF($E59<>\"\",MAX($A$1:INDIRECT(CONCATENATE(\"$A$\",ROW()-1)))+1,\"\")","v":""},""]
[{"$f":"IF($E60<>\"\",MAX($A$1:INDIRECT(CONCATENATE(\"$A$\",ROW()-1)))+1,\"\")","v":""},""]
[{"$f":"IF($E61<>\"\",MAX($A$1:INDIRECT(CONCATENATE(\"$A$\",ROW()-1)))+1,\"\")","v":""},""]
[{"$f":"IF($E62<>\"\",MAX($A$1:INDIRECT(CONCATENATE(\"$A$\",ROW()-1)))+1,\"\")","v":""},""]
[{"$f":"IF($E63<>\"\",MAX($A$1:INDIRECT(CONCATENATE(\"$A$\",ROW()-1)))+1,\"\")","v":""},""]
[{"$f":"IF($E64<>\"\",MAX($A$1:INDIRECT(CONCATENATE(\"$A$\",ROW()-1)))+1,\"\")","v":""},""]
[{"$f":"IF($E65<>\"\",MAX($A$1:INDIRECT(CONCATENATE(\"$A$\",ROW()-1)))+1,\"\")","v":""},""]
[{"$f":"IF($E66<>\"\",MAX($A$1:INDIRECT(CONCATENATE(\"$A$\",ROW()-1)))+1,\"\")","v":""},""]
[{"$f":"IF($E67<>\"\",MAX($A$1:INDIRECT(CONCATENATE(\"$A$\",ROW()-1)))+1,\"\")","v":""},""]
[{"$f":"IF($E68<>\"\",MAX($A$1:INDIRECT(CONCATENATE(\"$A$\",ROW()-1)))+1,\"\")","v":""},""]
[{"$f":"IF($E69<>\"\",MAX($A$1:INDIRECT(CONCATENATE(\"$A$\",ROW()-1)))+1,\"\")","v":""},""]
[{"$f":"IF($E70<>\"\",MAX($A$1:INDIRECT(CONCATENATE(\"$A$\",ROW()-1)))+1,\"\")","v":""},""]
[{"$f":"IF($E71<>\"\",MAX($A$1:INDIRECT(CONCATENATE(\"$A$\",ROW()-1)))+1,\"\")","v":""},{"$f":"IF(A71<>\"\",$A$3&A71,\"\")","v":""}]
[{"$f":"IF($E72<>\"\",MAX($A$1:INDIRECT(CONCATENATE(\"$A$\",ROW()-1)))+1,\"\")","v":""},""]
[{"$f":"IF($E73<>\"\",MAX($A$1:INDIRECT(CONCATENATE(\"$A$\",ROW()-1)))+1,\"\")","v":""},""]
[{"$f":"IF($E74<>\"\",MAX($A$1:INDIRECT(CONCATENATE(\"$A$\",ROW()-1)))+1,\"\")","v":""},""]
[{"$f":"IF($E75<>\"\",MAX($A$1:INDIRECT(CONCATENATE(\"$A$\",ROW()-1)))+1,\"\")","v":""},""]
[{"$f":"IF($E76<>\"\",MAX($A$1:INDIRECT(CONCATENATE(\"$A$\",ROW()-1)))+1,\"\")","v":""},""]
[{"$f":"IF($E77<>\"\",MAX($A$1:INDIRECT(CONCATENATE(\"$A$\",ROW()-1)))+1,\"\")","v":""},""]
[{"$f":"IF($E78<>\"\",MAX($A$1:INDIRECT(CONCATENATE(\"$A$\",ROW()-1)))+1,\"\")","v":""},""]
[]
[]
[]
[]
[{"$f":"IF($E83<>\"\",MAX($A$1:INDIRECT(CONCATENATE(\"$A$\",ROW()-1)))+1,\"\")","v":""},""]
[{"$f":"IF($E84<>\"\",MAX($A$1:INDIRECT(CONCATENATE(\"$A$\",ROW()-1)))+1,\"\")","v":""},""]
[{"$f":"IF($E85<>\"\",MAX($A$1:INDIRECT(CONCATENATE(\"$A$\",ROW()-1)))+1,\"\")","v":""},""]
[{"$f":"IF($E86<>\"\",MAX($A$1:INDIRECT(CONCATENATE(\"$A$\",ROW()-1)))+1,\"\")","v":""},""]
[null,null,null,{"$f":"\" TOTAL SECTION \"&$A$3&\":\n Carried to Summary\"","v":" TOTAL SECTION ME8.:\n Carried to Summary"},null,null,"R"]
[]
[null,null,null,null,"`"]

{"sheet":"ME9","index":20,"n_rows":41,"n_cols":8,"rows_kept":41,"cut":false,"hidden":false,"merged":[]}
["Item No","Item No","Chief Reference","Short Description","Unit","Quantity","Rate","Amount\n R             c"]
[]
["ME9.",null,null,{"$f":"\"SECTION \"&A3","v":"SECTION ME9."}]
[null,null,null,"M&E WORKS - PUMP STATION"]
[null,null,"PS 9.22","DISTRIBUTION TRANSFORMERS"]
[{"$f":"IF($E6<>\"\",MAX($A$1:INDIRECT(CONCATENATE(\"$A$\",ROW()-1)))+1,\"\")","v":""},{"$f":"IF(A6<>\"\",$A$3&A6,\"\")","v":""}]
[{"$f":"IF($E7<>\"\",MAX($A$1:INDIRECT(CONCATENATE(\"$A$\",ROW()-1)))+1,\"\")","v":""},"",null,"Allow for all the costs and expenses in connection with the design, manufacture, routine testing, factory testing and supply of the following materials and equipment:"]
[{"$f":"IF($E8<>\"\",MAX($A$1:INDIRECT(CONCATENATE(\"$A$\",ROW()-1)))+1,\"\")","v":""},""]
[{"$f":"IF($E9<>\"\",MAX($A$1:INDIRECT(CONCATENATE(\"$A$\",ROW()-1)))+1,\"\")","v":""},"",null,"ONAN Type Transformer "]
[{"$f":"IF($E10<>\"\",MAX($A$1:INDIRECT(CONCATENATE(\"$A$\",ROW()-1)))+1,\"\")","v":""},""]
[{"$f":"IF($E11<>\"\",MAX($A$1:INDIRECT(CONCATENATE(\"$A$\",ROW()-1)))+1,\"\")","v":1},"ME9.1",null,"Transformer 1 & 2 100kVA, 11/0.42kV","No.",2]
[{"$f":"IF($E12<>\"\",MAX($A$1:INDIRECT(CONCATENATE(\"$A$\",ROW()-1)))+1,\"\")","v":""},""]
[{"$f":"IF($E13<>\"\",MAX($A$1:INDIRECT(CONCATENATE(\"$A$\",ROW()-1)))+1,\"\")","v":2},"ME9.2",null,"Transformer 1000kVA, 11/0.42kV at WTW","Prov sum","-",null,600000]
[{"$f":"IF($E14<>\"\",MAX($A$1:INDIRECT(CONCATENATE(\"$A$\",ROW()-1)))+1,\"\")","v":""},""]
[{"$f":"IF($E15<>\"\",MAX($A$1:INDIRECT(CONCATENATE(\"$A$\",ROW()-1)))+1,\"\")","v":3},"ME9.3",null,"Charges and profit on Transformer 1000kVA, 11/0.42kV at WTW (expressed as a percentage of the provisional sum amount)","%",{"$f":"H13","v":600000}]
[{"$f":"IF($E16<>\"\",MAX($A$1:INDIRECT(CONCATENATE(\"$A$\",ROW()-1)))+1,\"\")","v":""},""]
[{"$f":"IF($E17<>\"\",MAX($A$1:INDIRECT(CONCATENATE(\"$A$\",ROW()-1)))+1,\"\")","v":""},"",null,"Allow for all costs and expenses in connection with the Site installation, testing and commissioning of the following:-"]
[{"$f":"IF($E18<>\"\",MAX($A$1:INDIRECT(CONCATENATE(\"$A$\",ROW()-1)))+1,\"\")","v":""},""]
[{"$f":"IF($E19<>\"\",MAX($A$1:INDIRECT(CONCATENATE(\"$A$\",ROW()-1)))+1,\"\")","v":4},"ME9.4",null,{"$f":"\"All materials and equipment summarized in Section \"&$A$3&\" complete\"","v":"All materials and equipment summarized in Section ME9. complete"},"Sum","-"]
[{"$f":"IF($E20<>\"\",MAX($A$1:INDIRECT(CONCATENATE(\"$A$\",ROW()-1)))+1,\"\")","v":""},""]
[{"$f":"IF($E21<>\"\",MAX($A$1:INDIRECT(CONCATENATE(\"$A$\",ROW()-1)))+1,\"\")","v":""},"",null,"Other:-"]
[{"$f":"IF($E22<>\"\",MAX($A$1:INDIRECT(CONCATENATE(\"$A$\",ROW()-1)))+1,\"\")","v":""},""]
[{"$f":"IF($E23<>\"\",MAX($A$1:INDIRECT(CONCATENATE(\"$A$\",ROW()-1)))+1,\"\")","v":5},"ME9.5",null,"All other items not included above but which are nevertheless necessary to meet the Scope of Work and/or are required for the proper, safe and effective operation of the plant (Specify)","Sum","-"]
[{"$f":"IF($E24<>\"\",MAX($A$1:INDIRECT(CONCATENATE(\"$A$\",ROW()-1)))+1,\"\")","v":""},"",null,"……………………………………………….."]
[{"$f":"IF($E25<>\"\",MAX($A$1:INDIRECT(CONCATENATE(\"$A$\",ROW()-1)))+1,\"\")","v":""},"",null,"……………………………………………….."]
[{"$f":"IF($E26<>\"\",MAX($A$1:INDIRECT(CONCATENATE(\"$A$\",ROW()-1)))+1,\"\")","v":""},"",null,"……………………………………………….."]
[{"$f":"IF($E27<>\"\",MAX($A$1:INDIRECT(CONCATENATE(\"$A$\",ROW()-1)))+1,\"\")","v":""},"",null,"……………………………………………….."]
[{"$f":"IF($E28<>\"\",MAX($A$1:INDIRECT(CONCATENATE(\"$A$\",ROW()-1)))+1,\"\")","v":""},"",null,"……………………………………………….."]
[{"$f":"IF($E29<>\"\",MAX($A$1:INDIRECT(CONCATENATE(\"$A$\",ROW()-1)))+1,\"\")","v":""},""]
[{"$f":"IF($E30<>\"\",MAX($A$1:INDIRECT(CONCATENATE(\"$A$\",ROW()-1)))+1,\"\")","v":""},""]
[{"$f":"IF($E31<>\"\",MAX($A$1:INDIRECT(CONCATENATE(\"$A$\",ROW()-1)))+1,\"\")","v":""},""]
[{"$f":"IF($E32<>\"\",MAX($A$1:INDIRECT(CONCATENATE(\"$A$\",ROW()-1)))+1,\"\")","v":""},""]
[]
[{"$f":"IF($E34<>\"\",MAX($A$1:INDIRECT(CONCATENATE(\"$A$\",ROW()-1)))+1,\"\")","v":""},""]
[{"$f":"IF($E35<>\"\",MAX($A$1:INDIRECT(CONCATENATE(\"$A$\",ROW()-1)))+1,\"\")","v":""},""]
[{"$f":"IF($E36<>\"\",MAX($A$1:INDIRECT(CONCATENATE(\"$A$\",ROW()-1)))+1,\"\")","v":""},""]
[{"$f":"IF($E37<>\"\",MAX($A$1:INDIRECT(CONCATENATE(\"$A$\",ROW()-1)))+1,\"\")","v":""},""]
[{"$f":"IF($E38<>\"\",MAX($A$1:INDIRECT(CONCATENATE(\"$A$\",ROW()-1)))+1,\"\")","v":""},""]
[{"$f":"IF($E39<>\"\",MAX($A$1:INDIRECT(CONCATENATE(\"$A$\",ROW()-1)))+1,\"\")","v":""},""]
[{"$f":"IF($E40<>\"\",MAX($A$1:INDIRECT(CONCATENATE(\"$A$\",ROW()-1)))+1,\"\")","v":""},""]
[null,null,null,{"$f":"\" TOTAL SECTION \"&$A$3&\":\n Carried to Summary\"","v":" TOTAL SECTION ME9.:\n Carried to Summary"},null,null,"R"]

{"sheet":"ME10","index":21,"n_rows":145,"n_cols":8,"rows_kept":145,"cut":false,"hidden":false,"merged":[]}
["Item No","Item No","Chief Reference","Short Description","Unit","Quantity","Rate","Amount\n R             c"]
[]
["ME10.",null,null,{"$f":"\"SECTION \"&A3","v":"SECTION ME10."}]
[null,null,null,"M&E WORKS - PUMP STATION"]
[null,null,"PS 9.24","LOW VOLTAGE CABLES"]
[]
[{"$f":"IF($E7<>\"\",MAX($A$1:INDIRECT(CONCATENATE(\"$A$\",ROW()-1)))+1,\"\")","v":""},{"$f":"IF(A7<>\"\",$A$3&A7,\"\")","v":""},null,"Allow for all the costs and expenses in connection with the design, manufacture, routine testing, factory testing, supply, delivery, offloading and storage of the following materials and equipment:"]
[{"$f":"IF($E8<>\"\",MAX($A$1:INDIRECT(CONCATENATE(\"$A$\",ROW()-1)))+1,\"\")","v":""},""]
[{"$f":"IF($E9<>\"\",MAX($A$1:INDIRECT(CONCATENATE(\"$A$\",ROW()-1)))+1,\"\")","v":""},"",null,"Cu/PVC/PVC/SWA/PVC 600/1000V multicore cable"]
[{"$f":"IF($E10<>\"\",MAX($A$1:INDIRECT(CONCATENATE(\"$A$\",ROW()-1)))+1,\"\")","v":""},""]
[{"$f":"IF($E11<>\"\",MAX($A$1:INDIRECT(CONCATENATE(\"$A$\",ROW()-1)))+1,\"\")","v":1},"ME10.1",null,"2.5mm² x 4 core","m",300]
[{"$f":"IF($E12<>\"\",MAX($A$1:INDIRECT(CONCATENATE(\"$A$\",ROW()-1)))+1,\"\")","v":""},""]
[{"$f":"IF($E13<>\"\",MAX($A$1:INDIRECT(CONCATENATE(\"$A$\",ROW()-1)))+1,\"\")","v":2},"ME10.2",null,"4.0mm² x 4 core","m",300]
[{"$f":"IF($E14<>\"\",MAX($A$1:INDIRECT(CONCATENATE(\"$A$\",ROW()-1)))+1,\"\")","v":""},""]
[{"$f":"IF($E15<>\"\",MAX($A$1:INDIRECT(CONCATENATE(\"$A$\",ROW()-1)))+1,\"\")","v":3},"ME10.3",null,"6mm² x 4 core","m",400]
[{"$f":"IF($E16<>\"\",MAX($A$1:INDIRECT(CONCATENATE(\"$A$\",ROW()-1)))+1,\"\")","v":""},""]
[{"$f":"IF($E17<>\"\",MAX($A$1:INDIRECT(CONCATENATE(\"$A$\",ROW()-1)))+1,\"\")","v":4},"ME10.4",null,"50mm² x 4 core","m",100]
[{"$f":"IF($E18<>\"\",MAX($A$1:INDIRECT(CONCATENATE(\"$A$\",ROW()-1)))+1,\"\")","v":""},""]
[{"$f":"IF($E19<>\"\",MAX($A$1:INDIRECT(CONCATENATE(\"$A$\",ROW()-1)))+1,\"\")","v":""},"",null,"Cable Terminations for Cu/PVC/PVC/SWA/PVC 600/1000V multicore cable"]
[{"$f":"IF($E20<>\"\",MAX($A$1:INDIRECT(CONCATENATE(\"$A$\",ROW()-1)))+1,\"\")","v":""},""]
[{"$f":"IF($E21<>\"\",MAX($A$1:INDIRECT(CONCATENATE(\"$A$\",ROW()-1)))+1,\"\")","v":5},"ME10.5",null,"2.5mm² x 4 core","No.",12]
[{"$f":"IF($E22<>\"\",MAX($A$1:INDIRECT(CONCATENATE(\"$A$\",ROW()-1)))+1,\"\")","v":""},""]
[{"$f":"IF($E23<>\"\",MAX($A$1:INDIRECT(CONCATENATE(\"$A$\",ROW()-1)))+1,\"\")","v":6},"ME10.6",null,"4.0mm² x 4 core","No.",10]
[{"$f":"IF($E24<>\"\",MAX($A$1:INDIRECT(CONCATENATE(\"$A$\",ROW()-1)))+1,\"\")","v":""},""]
[{"$f":"IF($E25<>\"\",MAX($A$1:INDIRECT(CONCATENATE(\"$A$\",ROW()-1)))+1,\"\")","v":7},"ME10.7",null,"6mm² x 4 core","No.",10]
[{"$f":"IF($E26<>\"\",MAX($A$1:INDIRECT(CONCATENATE(\"$A$\",ROW()-1)))+1,\"\")","v":""},""]
[{"$f":"IF($E27<>\"\",MAX($A$1:INDIRECT(CONCATENATE(\"$A$\",ROW()-1)))+1,\"\")","v":8},"ME10.8",null,"50mm² x 4 core","No.",4]
[{"$f":"IF($E28<>\"\",MAX($A$1:INDIRECT(CONCATENATE(\"$A$\",ROW()-1)))+1,\"\")","v":""},""]
[{"$f":"IF($E29<>\"\",MAX($A$1:INDIRECT(CONCATENATE(\"$A$\",ROW()-1)))+1,\"\")","v":""},"",null,"Bare Copper Earth Conductor (BCEC) with stranded conductors"]
[{"$f":"IF($E30<>\"\",MAX($A$1:INDIRECT(CONCATENATE(\"$A$\",ROW()-1)))+1,\"\")","v":""},""]
[{"$f":"IF($E31<>\"\",MAX($A$1:INDIRECT(CONCATENATE(\"$A$\",ROW()-1)))+1,\"\")","v":9},"ME10.9",null,"4mm²","m",100]
[{"$f":"IF($E32<>\"\",MAX($A$1:INDIRECT(CONCATENATE(\"$A$\",ROW()-1)))+1,\"\")","v":""},""]
[{"$f":"IF($E33<>\"\",MAX($A$1:INDIRECT(CONCATENATE(\"$A$\",ROW()-1)))+1,\"\")","v":10},"ME10.10",null,"6mm² ","m",100]
[{"$f":"IF($E34<>\"\",MAX($A$1:INDIRECT(CONCATENATE(\"$A$\",ROW()-1)))+1,\"\")","v":""},""]
[{"$f":"IF($E35<>\"\",MAX($A$1:INDIRECT(CONCATENATE(\"$A$\",ROW()-1)))+1,\"\")","v":11},"ME10.11",null,"25mm² ","m",100]
[{"$f":"IF($E36<>\"\",MAX($A$1:INDIRECT(CONCATENATE(\"$A$\",ROW()-1)))+1,\"\")","v":""},""]
[{"$f":"IF($E37<>\"\",MAX($A$1:INDIRECT(CONCATENATE(\"$A$\",ROW()-1)))+1,\"\")","v":12},"ME10.12",null,"70mm²","m",300]
[{"$f":"IF($E38<>\"\",MAX($A$1:INDIRECT(CONCATENATE(\"$A$\",ROW()-1)))+1,\"\")","v":""},""]
[{"$f":"IF($E39<>\"\",MAX($A$1:INDIRECT(CONCATENATE(\"$A$\",ROW()-1)))+1,\"\")","v":""},"",null,"Terminations for Bare Copper Earth Conductor (BCEC) with stranded conductors"]
[{"$f":"IF($E40<>\"\",MAX($A$1:INDIRECT(CONCATENATE(\"$A$\",ROW()-1)))+1,\"\")","v":""},""]
[{"$f":"IF($E41<>\"\",MAX($A$1:INDIRECT(CONCATENATE(\"$A$\",ROW()-1)))+1,\"\")","v":13},"ME10.13",null,"4mm²","No.",20]
[{"$f":"IF($E42<>\"\",MAX($A$1:INDIRECT(CONCATENATE(\"$A$\",ROW()-1)))+1,\"\")","v":""},""]
[{"$f":"IF($E43<>\"\",MAX($A$1:INDIRECT(CONCATENATE(\"$A$\",ROW()-1)))+1,\"\")","v":14},"ME10.14",null,"6mm² ","No.",20]
[]
[]
[]
[null,null,null," Carried forward / …"]
[null,null,null," Brought forward / …"]
[]
[{"$f":"IF($E50<>\"\",MAX($A$1:INDIRECT(CONCATENATE(\"$A$\",ROW()-1)))+1,\"\")","v":15},{"$f":"IF(A50<>\"\",$A$3&A50,\"\")","v":"ME10.15"},null,"25mm² ","No.",20]
[{"$f":"IF($E51<>\"\",MAX($A$1:INDIRECT(CONCATENATE(\"$A$\",ROW()-1)))+1,\"\")","v":""},""]
[{"$f":"IF($E52<>\"\",MAX($A$1:INDIRECT(CONCATENATE(\"$A$\",ROW()-1)))+1,\"\")","v":16},"ME10.16",null,"70mm²","No.",20]
[{"$f":"IF($E53<>\"\",MAX($A$1:INDIRECT(CONCATENATE(\"$A$\",ROW()-1)))+1,\"\")","v":""},""]
[{"$f":"IF($E54<>\"\",MAX($A$1:INDIRECT(CONCATENATE(\"$A$\",ROW()-1)))+1,\"\")","v":""},"",null,"Underground cable ancillaries"]
[{"$f":"IF($E55<>\"\",MAX($A$1:INDIRECT(CONCATENATE(\"$A$\",ROW()-1)))+1,\"\")","v":""},""]
[{"$f":"IF($E56<>\"\",MAX($A$1:INDIRECT(CONCATENATE(\"$A$\",ROW()-1)))+1,\"\")","v":17},"ME10.17",null,"Cable warning/danger tape","m",500]
[{"$f":"IF($E57<>\"\",MAX($A$1:INDIRECT(CONCATENATE(\"$A$\",ROW()-1)))+1,\"\")","v":""},""]
[{"$f":"IF($E58<>\"\",MAX($A$1:INDIRECT(CONCATENATE(\"$A$\",ROW()-1)))+1,\"\")","v":""},"",null,"Allow for all costs and expenses in connection with the Site installation, testing and commissioning of the following:"]
[{"$f":"IF($E59<>\"\",MAX($A$1:INDIRECT(CONCATENATE(\"$A$\",ROW()-1)))+1,\"\")","v":""},""]
[{"$f":"IF($E60<>\"\",MAX($A$1:INDIRECT(CONCATENATE(\"$A$\",ROW()-1)))+1,\"\")","v":""},"",null,"Cu/PVC/PVC/SWA/PVC 600/1000V multicore cable"]
[{"$f":"IF($E61<>\"\",MAX($A$1:INDIRECT(CONCATENATE(\"$A$\",ROW()-1)))+1,\"\")","v":""},""]
[{"$f":"IF($E62<>\"\",MAX($A$1:INDIRECT(CONCATENATE(\"$A$\",ROW()-1)))+1,\"\")","v":18},"ME10.18",null,"2.5mm² x 4 core","m",{"$f":"F11","v":300}]
[{"$f":"IF($E63<>\"\",MAX($A$1:INDIRECT(CONCATENATE(\"$A$\",ROW()-1)))+1,\"\")","v":""},""]
[{"$f":"IF($E64<>\"\",MAX($A$1:INDIRECT(CONCATENATE(\"$A$\",ROW()-1)))+1,\"\")","v":19},"ME10.19",null,"4.0mm² x 4 core","m",{"$f":"F13","v":300}]
[{"$f":"IF($E65<>\"\",MAX($A$1:INDIRECT(CONCATENATE(\"$A$\",ROW()-1)))+1,\"\")","v":""},""]
[{"$f":"IF($E66<>\"\",MAX($A$1:INDIRECT(CONCATENATE(\"$A$\",ROW()-1)))+1,\"\")","v":20},"ME10.20",null,"6mm² x 4 core","m",{"$f":"F15","v":400}]
[{"$f":"IF($E67<>\"\",MAX($A$1:INDIRECT(CONCATENATE(\"$A$\",ROW()-1)))+1,\"\")","v":""},""]
[{"$f":"IF($E68<>\"\",MAX($A$1:INDIRECT(CONCATENATE(\"$A$\",ROW()-1)))+1,\"\")","v":21},"ME10.21",null,"50mm² x 4 core","m",{"$f":"F17","v":100}]
[{"$f":"IF($E69<>\"\",MAX($A$1:INDIRECT(CONCATENATE(\"$A$\",ROW()-1)))+1,\"\")","v":""},""]
[{"$f":"IF($E70<>\"\",MAX($A$1:INDIRECT(CONCATENATE(\"$A$\",ROW()-1)))+1,\"\")","v":""},"",null,"Cable Terminations for Cu/PVC/PVC/SWA/PVC 600/1000V multicore cable"]
[{"$f":"IF($E71<>\"\",MAX($A$1:INDIRECT(CONCATENATE(\"$A$\",ROW()-1)))+1,\"\")","v":""},""]
[{"$f":"IF($E72<>\"\",MAX($A$1:INDIRECT(CONCATENATE(\"$A$\",ROW()-1)))+1,\"\")","v":22},"ME10.22",null,"2.5mm² x 4 core","No.",{"$f":"F21","v":12}]
[{"$f":"IF($E73<>\"\",MAX($A$1:INDIRECT(CONCATENATE(\"$A$\",ROW()-1)))+1,\"\")","v":""},""]
[{"$f":"IF($E74<>\"\",MAX($A$1:INDIRECT(CONCATENATE(\"$A$\",ROW()-1)))+1,\"\")","v":23},"ME10.23",null,"4.0mm² x 4 core","No.",{"$f":"F23","v":10}]
[{"$f":"IF($E75<>\"\",MAX($A$1:INDIRECT(CONCATENATE(\"$A$\",ROW()-1)))+1,\"\")","v":""},""]
[{"$f":"IF($E76<>\"\",MAX($A$1:INDIRECT(CONCATENATE(\"$A$\",ROW()-1)))+1,\"\")","v":24},"ME10.24",null,"6mm² x 4 core","No.",{"$f":"F25","v":10}]
[{"$f":"IF($E77<>\"\",MAX($A$1:INDIRECT(CONCATENATE(\"$A$\",ROW()-1)))+1,\"\")","v":""},""]
[{"$f":"IF($E78<>\"\",MAX($A$1:INDIRECT(CONCATENATE(\"$A$\",ROW()-1)))+1,\"\")","v":25},"ME10.25",null,"50mm² x 4 core","No.",{"$f":"F27","v":4}]
[{"$f":"IF($E79<>\"\",MAX($A$1:INDIRECT(CONCATENATE(\"$A$\",ROW()-1)))+1,\"\")","v":""},""]
[{"$f":"IF($E80<>\"\",MAX($A$1:INDIRECT(CONCATENATE(\"$A$\",ROW()-1)))+1,\"\")","v":""},"",null,"Bare Copper Earth Conductor (BCEC) with stranded conductors"]
[{"$f":"IF($E81<>\"\",MAX($A$1:INDIRECT(CONCATENATE(\"$A$\",ROW()-1)))+1,\"\")","v":""},{"$f":"IF(A81<>\"\",$A$3&A81,\"\")","v":""}]
[{"$f":"IF($E82<>\"\",MAX($A$1:INDIRECT(CONCATENATE(\"$A$\",ROW()-1)))+1,\"\")","v":26},"ME10.26",null,"4mm²","m",{"$f":"F31","v":100}]
[{"$f":"IF($E83<>\"\",MAX($A$1:INDIRECT(CONCATENATE(\"$A$\",ROW()-1)))+1,\"\")","v":""},""]
[{"$f":"IF($E84<>\"\",MAX($A$1:INDIRECT(CONCATENATE(\"$A$\",ROW()-1)))+1,\"\")","v":27},"ME10.27",null,"6mm² ","m",{"$f":"F33","v":100}]
[{"$f":"IF($E85<>\"\",MAX($A$1:INDIRECT(CONCATENATE(\"$A$\",ROW()-1)))+1,\"\")","v":""},""]
[{"$f":"IF($E86<>\"\",MAX($A$1:INDIRECT(CONCATENATE(\"$A$\",ROW()-1)))+1,\"\")","v":28},"ME10.28",null,"25mm² ","m",{"$f":"F35","v":100}]
[{"$f":"IF($E87<>\"\",MAX($A$1:INDIRECT(CONCATENATE(\"$A$\",ROW()-1)))+1,\"\")","v":""},""]
[{"$f":"IF($E88<>\"\",MAX($A$1:INDIRECT(CONCATENATE(\"$A$\",ROW()-1)))+1,\"\")","v":29},"ME10.29",null,"70mm²","m",{"$f":"F37","v":300}]
[]
[{"$f":"IF($E90<>\"\",MAX($A$1:INDIRECT(CONCATENATE(\"$A$\",ROW()-1)))+1,\"\")","v":""},{"$f":"IF(A90<>\"\",$A$3&A90,\"\")","v":""},null,"Terminations for Bare Copper Earth Conductor (BCEC) with stranded conductors"]
[{"$f":"IF($E91<>\"\",MAX($A$1:INDIRECT(CONCATENATE(\"$A$\",ROW()-1)))+1,\"\")","v":""},""]
[{"$f":"IF($E92<>\"\",MAX($A$1:INDIRECT(CONCATENATE(\"$A$\",ROW()-1)))+1,\"\")","v":30},"ME10.30",null,"4mm²","No.",{"$f":"F41","v":20}]
[]
[]
[null,null,null," Carried forward / …"]
[null,null,null," Brought forward / …"]
[]
[{"$f":"IF($E98<>\"\",MAX($A$1:INDIRECT(CONCATENATE(\"$A$\",ROW()-1)))+1,\"\")","v":31},"ME10.31",null,"6mm² ","No.",{"$f":"F43","v":20}]
[{"$f":"IF($E99<>\"\",MAX($A$1:INDIRECT(CONCATENATE(\"$A$\",ROW()-1)))+1,\"\")","v":""},""]
[{"$f":"IF($E100<>\"\",MAX($A$1:INDIRECT(CONCATENATE(\"$A$\",ROW()-1)))+1,\"\")","v":32},"ME10.32",null,"25mm² ","No.",{"$f":"F50","v":20}]
[{"$f":"IF($E101<>\"\",MAX($A$1:INDIRECT(CONCATENATE(\"$A$\",ROW()-1)))+1,\"\")","v":""},""]
[{"$f":"IF($E102<>\"\",MAX($A$1:INDIRECT(CONCATENATE(\"$A$\",ROW()-1)))+1,\"\")","v":33},"ME10.33",null,"70mm²","No.",{"$f":"F52","v":20}]
[{"$f":"IF($E103<>\"\",MAX($A$1:INDIRECT(CONCATENATE(\"$A$\",ROW()-1)))+1,\"\")","v":""},""]
[{"$f":"IF($E104<>\"\",MAX($A$1:INDIRECT(CONCATENATE(\"$A$\",ROW()-1)))+1,\"\")","v":""},"",null,"Underground cable ancillaries"]
[{"$f":"IF($E105<>\"\",MAX($A$1:INDIRECT(CONCATENATE(\"$A$\",ROW()-1)))+1,\"\")","v":""},""]
[{"$f":"IF($E106<>\"\",MAX($A$1:INDIRECT(CONCATENATE(\"$A$\",ROW()-1)))+1,\"\")","v":34},"ME10.34",null,"Cable warning/danger tape","No.",{"$f":"F56","v":500}]
[]
[{"$f":"IF($E108<>\"\",MAX($A$1:INDIRECT(CONCATENATE(\"$A$\",ROW()-1)))+1,\"\")","v":""},{"$f":"IF(A108<>\"\",$A$3&A108,\"\")","v":""},null,"Other:-"]
[]
[{"$f":"IF($E110<>\"\",MAX($A$1:INDIRECT(CONCATENATE(\"$A$\",ROW()-1)))+1,\"\")","v":35},{"$f":"IF(A110<>\"\",$A$3&A110,\"\")","v":"ME10.35"},null,"Bonding of entire installation including MV cable supports","Sum","-"]
[{"$f":"IF($E111<>\"\",MAX($A$1:INDIRECT(CONCATENATE(\"$A$\",ROW()-1)))+1,\"\")","v":""},""]
[{"$f":"IF($E112<>\"\",MAX($A$1:INDIRECT(CONCATENATE(\"$A$\",ROW()-1)))+1,\"\")","v":36},"ME10.36",null,"All other items not included above but which are nevertheless necessary to meet the Scope of Work and/or are required for the proper, safe and effective operation of the plant (Specify)","Sum","-"]
[{"$f":"IF($E113<>\"\",MAX($A$1:INDIRECT(CONCATENATE(\"$A$\",ROW()-1)))+1,\"\")","v":""},"",null,"……………………………………………….."]
[{"$f":"IF($E114<>\"\",MAX($A$1:INDIRECT(CONCATENATE(\"$A$\",ROW()-1)))+1,\"\")","v":""},"",null,"……………………………………………….."]
[{"$f":"IF($E115<>\"\",MAX($A$1:INDIRECT(CONCATENATE(\"$A$\",ROW()-1)))+1,\"\")","v":""},"",null,"……………………………………………….."]
[{"$f":"IF($E116<>\"\",MAX($A$1:INDIRECT(CONCATENATE(\"$A$\",ROW()-1)))+1,\"\")","v":""},"",null,"……………………………………………….."]
[{"$f":"IF($E117<>\"\",MAX($A$1:INDIRECT(CONCATENATE(\"$A$\",ROW()-1)))+1,\"\")","v":""},"",null,"……………………………………………….."]
[]
[]
[]
[]
[]
[]
[]
[]
[]
[]
[]
[]
[]
[]
[]
[]
[]
[]
[]
[]
[]
[]
[]
[]
[]
[]
[{"$f":"IF($E144<>\"\",MAX($A$1:INDIRECT(CONCATENATE(\"$A$\",ROW()-1)))+1,\"\")","v":""},""]
[null,null,null,{"$f":"\" TOTAL SECTION \"&$A$3&\":\n Carried to Summary\"","v":" TOTAL SECTION ME10.:\n Carried to Summary"},null,null,"R"]

{"sheet":"ME11","index":22,"n_rows":146,"n_cols":8,"rows_kept":146,"cut":false,"hidden":false,"merged":[]}
["Item No","Item No","Chief Reference","Short Description","Unit","Quantity","Rate","Amount\n R             c"]
[]
["ME11.",null,null,{"$f":"\"SECTION \"&A3","v":"SECTION ME11."}]
[null,null,null,"M&E WORKS - PUMP STATION"]
[null,null,"PS 9.24","CABLE SUPPORTS"]
[]
[{"$f":"IF($E7<>\"\",MAX($A$1:INDIRECT(CONCATENATE(\"$A$\",ROW()-1)))+1,\"\")","v":""},{"$f":"IF(A7<>\"\",$A$3&A7,\"\")","v":""},null,"Allow for all the costs and expenses in connection with the design, manufacture, routine testing, factory testing, supply, delivery, offloading and storage of the following materials and equipment:"]
[{"$f":"IF($E8<>\"\",MAX($A$1:INDIRECT(CONCATENATE(\"$A$\",ROW()-1)))+1,\"\")","v":""},""]
[{"$f":"IF($E9<>\"\",MAX($A$1:INDIRECT(CONCATENATE(\"$A$\",ROW()-1)))+1,\"\")","v":""},"",null,"Heavy Duty Hot Dipped Galvanised Mild Steel Cable ladder"]
[{"$f":"IF($E10<>\"\",MAX($A$1:INDIRECT(CONCATENATE(\"$A$\",ROW()-1)))+1,\"\")","v":""},""]
[{"$f":"IF($E11<>\"\",MAX($A$1:INDIRECT(CONCATENATE(\"$A$\",ROW()-1)))+1,\"\")","v":1},"ME11.1",null,"100 x 100mm (W x H)","m",40]
[{"$f":"IF($E12<>\"\",MAX($A$1:INDIRECT(CONCATENATE(\"$A$\",ROW()-1)))+1,\"\")","v":""},""]
[{"$f":"IF($E13<>\"\",MAX($A$1:INDIRECT(CONCATENATE(\"$A$\",ROW()-1)))+1,\"\")","v":2},"ME11.2",null,"200 x 100mm (W x H)","m",40]
[{"$f":"IF($E14<>\"\",MAX($A$1:INDIRECT(CONCATENATE(\"$A$\",ROW()-1)))+1,\"\")","v":""},""]
[{"$f":"IF($E15<>\"\",MAX($A$1:INDIRECT(CONCATENATE(\"$A$\",ROW()-1)))+1,\"\")","v":3},"ME11.3",null,"400 x 100mm (W x H)","m",40]
[{"$f":"IF($E16<>\"\",MAX($A$1:INDIRECT(CONCATENATE(\"$A$\",ROW()-1)))+1,\"\")","v":""},""]
[{"$f":"IF($E17<>\"\",MAX($A$1:INDIRECT(CONCATENATE(\"$A$\",ROW()-1)))+1,\"\")","v":4},"ME11.4",null,"600 x 100mm (W x H)","m",80]
[{"$f":"IF($E18<>\"\",MAX($A$1:INDIRECT(CONCATENATE(\"$A$\",ROW()-1)))+1,\"\")","v":""},""]
[{"$f":"IF($E19<>\"\",MAX($A$1:INDIRECT(CONCATENATE(\"$A$\",ROW()-1)))+1,\"\")","v":5},"ME11.5",null,"800 x 100mm (W x H)","m",60]
[{"$f":"IF($E20<>\"\",MAX($A$1:INDIRECT(CONCATENATE(\"$A$\",ROW()-1)))+1,\"\")","v":""},""]
[{"$f":"IF($E21<>\"\",MAX($A$1:INDIRECT(CONCATENATE(\"$A$\",ROW()-1)))+1,\"\")","v":""},"",null,"Heavy Duty Hot Dipped Galvanised Mild Steel Cable ladder Tee off / 90 deg horizontal elbow / internal Riser / dropper pieces."]
[{"$f":"IF($E22<>\"\",MAX($A$1:INDIRECT(CONCATENATE(\"$A$\",ROW()-1)))+1,\"\")","v":""},""]
[{"$f":"IF($E23<>\"\",MAX($A$1:INDIRECT(CONCATENATE(\"$A$\",ROW()-1)))+1,\"\")","v":6},"ME11.6",null,"100 x 100mm (W x H)","No.",20]
[{"$f":"IF($E24<>\"\",MAX($A$1:INDIRECT(CONCATENATE(\"$A$\",ROW()-1)))+1,\"\")","v":""},""]
[{"$f":"IF($E25<>\"\",MAX($A$1:INDIRECT(CONCATENATE(\"$A$\",ROW()-1)))+1,\"\")","v":7},"ME11.7",null,"200 x 100mm (W x H)","No.",20]
[{"$f":"IF($E26<>\"\",MAX($A$1:INDIRECT(CONCATENATE(\"$A$\",ROW()-1)))+1,\"\")","v":""},""]
[{"$f":"IF($E27<>\"\",MAX($A$1:INDIRECT(CONCATENATE(\"$A$\",ROW()-1)))+1,\"\")","v":8},"ME11.8",null,"400 x 100mm (W x H)","No.",20]
[{"$f":"IF($E28<>\"\",MAX($A$1:INDIRECT(CONCATENATE(\"$A$\",ROW()-1)))+1,\"\")","v":""},""]
[{"$f":"IF($E29<>\"\",MAX($A$1:INDIRECT(CONCATENATE(\"$A$\",ROW()-1)))+1,\"\")","v":9},"ME11.9",null,"600 x 100mm (W x H)","No.",25]
[{"$f":"IF($E30<>\"\",MAX($A$1:INDIRECT(CONCATENATE(\"$A$\",ROW()-1)))+1,\"\")","v":""},""]
[{"$f":"IF($E31<>\"\",MAX($A$1:INDIRECT(CONCATENATE(\"$A$\",ROW()-1)))+1,\"\")","v":10},"ME11.10",null,"800 x 100mm (W x H)","No.",25]
[{"$f":"IF($E32<>\"\",MAX($A$1:INDIRECT(CONCATENATE(\"$A$\",ROW()-1)))+1,\"\")","v":""},""]
[{"$f":"IF($E33<>\"\",MAX($A$1:INDIRECT(CONCATENATE(\"$A$\",ROW()-1)))+1,\"\")","v":""},"",null,"Hot Dipped Galvanised Wire Mesh Cable Tray"]
[{"$f":"IF($E34<>\"\",MAX($A$1:INDIRECT(CONCATENATE(\"$A$\",ROW()-1)))+1,\"\")","v":""},""]
[{"$f":"IF($E35<>\"\",MAX($A$1:INDIRECT(CONCATENATE(\"$A$\",ROW()-1)))+1,\"\")","v":11},"ME11.11",null,"100 x 50mm (W x H), Ø 4mm Wire","m",60]
[{"$f":"IF($E36<>\"\",MAX($A$1:INDIRECT(CONCATENATE(\"$A$\",ROW()-1)))+1,\"\")","v":""},""]
[{"$f":"IF($E37<>\"\",MAX($A$1:INDIRECT(CONCATENATE(\"$A$\",ROW()-1)))+1,\"\")","v":12},"ME11.12",null,"200 x 50mm (W x H), Ø 4mm Wire","m",60]
[]
[{"$f":"IF($E39<>\"\",MAX($A$1:INDIRECT(CONCATENATE(\"$A$\",ROW()-1)))+1,\"\")","v":13},"ME11.13",null,"400 x 50mm (W x H), Ø 4mm Wire","m",60]
[]
[]
[]
[]
[]
[]
[{"$f":"IF($E46<>\"\",MAX($A$1:INDIRECT(CONCATENATE(\"$A$\",ROW()-1)))+1,\"\")","v":""},""]
[]
[null,null,null," Carried forward / …"]
[null,null,null," Brought forward / …"]
[{"$f":"IF($E50<>\"\",MAX($A$1:INDIRECT(CONCATENATE(\"$A$\",ROW()-1)))+1,\"\")","v":""},""]
[{"$f":"IF($E51<>\"\",MAX($A$1:INDIRECT(CONCATENATE(\"$A$\",ROW()-1)))+1,\"\")","v":""},"",null,"Allow for all costs and expenses in connection with the Site installation, testing and commissioning of the following:"]
[{"$f":"IF($E52<>\"\",MAX($A$1:INDIRECT(CONCATENATE(\"$A$\",ROW()-1)))+1,\"\")","v":""},""]
[{"$f":"IF($E53<>\"\",MAX($A$1:INDIRECT(CONCATENATE(\"$A$\",ROW()-1)))+1,\"\")","v":""},"",null,"Heavy Duty Hot Dipped Galvanised Mild Steel Cable ladder"]
[{"$f":"IF($E54<>\"\",MAX($A$1:INDIRECT(CONCATENATE(\"$A$\",ROW()-1)))+1,\"\")","v":""},""]
[{"$f":"IF($E55<>\"\",MAX($A$1:INDIRECT(CONCATENATE(\"$A$\",ROW()-1)))+1,\"\")","v":14},"ME11.14",null,"100 x 100mm (W x H)","m",{"$f":"F11","v":40}]
[{"$f":"IF($E56<>\"\",MAX($A$1:INDIRECT(CONCATENATE(\"$A$\",ROW()-1)))+1,\"\")","v":""},""]
[{"$f":"IF($E57<>\"\",MAX($A$1:INDIRECT(CONCATENATE(\"$A$\",ROW()-1)))+1,\"\")","v":15},"ME11.15",null,"200 x 100mm (W x H)","m",{"$f":"F13","v":40}]
[{"$f":"IF($E58<>\"\",MAX($A$1:INDIRECT(CONCATENATE(\"$A$\",ROW()-1)))+1,\"\")","v":""},""]
[{"$f":"IF($E59<>\"\",MAX($A$1:INDIRECT(CONCATENATE(\"$A$\",ROW()-1)))+1,\"\")","v":16},"ME11.16",null,"400 x 100mm (W x H)","m",{"$f":"F15","v":40}]
[{"$f":"IF($E60<>\"\",MAX($A$1:INDIRECT(CONCATENATE(\"$A$\",ROW()-1)))+1,\"\")","v":""},""]
[{"$f":"IF($E61<>\"\",MAX($A$1:INDIRECT(CONCATENATE(\"$A$\",ROW()-1)))+1,\"\")","v":17},"ME11.17",null,"600 x 100mm (W x H)","m",{"$f":"F17","v":80}]
[{"$f":"IF($E62<>\"\",MAX($A$1:INDIRECT(CONCATENATE(\"$A$\",ROW()-1)))+1,\"\")","v":""},""]
[{"$f":"IF($E63<>\"\",MAX($A$1:INDIRECT(CONCATENATE(\"$A$\",ROW()-1)))+1,\"\")","v":18},"ME11.18",null,"800 x 100mm (W x H)","m",{"$f":"F19","v":60}]
[{"$f":"IF($E64<>\"\",MAX($A$1:INDIRECT(CONCATENATE(\"$A$\",ROW()-1)))+1,\"\")","v":""},""]
[{"$f":"IF($E65<>\"\",MAX($A$1:INDIRECT(CONCATENATE(\"$A$\",ROW()-1)))+1,\"\")","v":""},"",null,"Heavy Duty Hot Dipped Galvanised Mild Steel Cable ladder Tee off / 90 deg horizontal elbow / internal Riser / dropper pieces."]
[{"$f":"IF($E66<>\"\",MAX($A$1:INDIRECT(CONCATENATE(\"$A$\",ROW()-1)))+1,\"\")","v":""},""]
[{"$f":"IF($E67<>\"\",MAX($A$1:INDIRECT(CONCATENATE(\"$A$\",ROW()-1)))+1,\"\")","v":19},"ME11.19",null,"100 x 100mm (W x H)","No.",{"$f":"F23","v":20}]
[]
[{"$f":"IF($E69<>\"\",MAX($A$1:INDIRECT(CONCATENATE(\"$A$\",ROW()-1)))+1,\"\")","v":20},{"$f":"IF(A69<>\"\",$A$3&A69,\"\")","v":"ME11.20"},null,"200 x 100mm (W x H)","No.",{"$f":"F25","v":20}]
[{"$f":"IF($E70<>\"\",MAX($A$1:INDIRECT(CONCATENATE(\"$A$\",ROW()-1)))+1,\"\")","v":""},""]
[{"$f":"IF($E71<>\"\",MAX($A$1:INDIRECT(CONCATENATE(\"$A$\",ROW()-1)))+1,\"\")","v":21},"ME11.21",null,"400 x 100mm (W x H)","No.",{"$f":"F27","v":20}]
[{"$f":"IF($E72<>\"\",MAX($A$1:INDIRECT(CONCATENATE(\"$A$\",ROW()-1)))+1,\"\")","v":""},""]
[{"$f":"IF($E73<>\"\",MAX($A$1:INDIRECT(CONCATENATE(\"$A$\",ROW()-1)))+1,\"\")","v":22},"ME11.22",null,"600 x 100mm (W x H)","No.",{"$f":"F29","v":25}]
[{"$f":"IF($E74<>\"\",MAX($A$1:INDIRECT(CONCATENATE(\"$A$\",ROW()-1)))+1,\"\")","v":""},{"$f":"IF(A74<>\"\",$A$3&A74,\"\")","v":""}]
[{"$f":"IF($E75<>\"\",MAX($A$1:INDIRECT(CONCATENATE(\"$A$\",ROW()-1)))+1,\"\")","v":23},"ME11.23",null,"800 x 100mm (W x H)","No.",{"$f":"F31","v":25}]
[{"$f":"IF($E76<>\"\",MAX($A$1:INDIRECT(CONCATENATE(\"$A$\",ROW()-1)))+1,\"\")","v":""},""]
[{"$f":"IF($E77<>\"\",MAX($A$1:INDIRECT(CONCATENATE(\"$A$\",ROW()-1)))+1,\"\")","v":""},"",null,"Hot Dipped Galvanised Wire Mesh Cable Tray"]
[{"$f":"IF($E78<>\"\",MAX($A$1:INDIRECT(CONCATENATE(\"$A$\",ROW()-1)))+1,\"\")","v":""},""]
[{"$f":"IF($E79<>\"\",MAX($A$1:INDIRECT(CONCATENATE(\"$A$\",ROW()-1)))+1,\"\")","v":24},"ME11.24",null,"100 x 50mm (W x H), Ø 4mm Wire","m",{"$f":"F35","v":60}]
[{"$f":"IF($E80<>\"\",MAX($A$1:INDIRECT(CONCATENATE(\"$A$\",ROW()-1)))+1,\"\")","v":""},""]
[{"$f":"IF($E81<>\"\",MAX($A$1:INDIRECT(CONCATENATE(\"$A$\",ROW()-1)))+1,\"\")","v":25},"ME11.25",null,"200 x 50mm (W x H), Ø 4mm Wire","m",{"$f":"F37","v":60}]
[{"$f":"IF($E82<>\"\",MAX($A$1:INDIRECT(CONCATENATE(\"$A$\",ROW()-1)))+1,\"\")","v":""},""]
[{"$f":"IF($E83<>\"\",MAX($A$1:INDIRECT(CONCATENATE(\"$A$\",ROW()-1)))+1,\"\")","v":26},"ME11.26",null,"400 x 50mm (W x H), Ø 4mm Wire","m",{"$f":"F39","v":60}]
[{"$f":"IF($E84<>\"\",MAX($A$1:INDIRECT(CONCATENATE(\"$A$\",ROW()-1)))+1,\"\")","v":""},""]
[{"$f":"IF($E85<>\"\",MAX($A$1:INDIRECT(CONCATENATE(\"$A$\",ROW()-1)))+1,\"\")","v":27},"ME11.27",null,"600 x 50mm (W x H), Ø 4mm Wire","m",{"$f":"F87","v":"-"}]
[{"$f":"IF($E86<>\"\",MAX($A$1:INDIRECT(CONCATENATE(\"$A$\",ROW()-1)))+1,\"\")","v":""},""]
[{"$f":"IF($E87<>\"\",MAX($A$1:INDIRECT(CONCATENATE(\"$A$\",ROW()-1)))+1,\"\")","v":28},"ME11.28",null,"Labeling of Cables and Equipment","Sum","-"]
[]
[{"$f":"IF($E89<>\"\",MAX($A$1:INDIRECT(CONCATENATE(\"$A$\",ROW()-1)))+1,\"\")","v":29},{"$f":"IF(A89<>\"\",$A$3&A89,\"\")","v":"ME11.29"},null,"Bonding of all extraneous conductive parts","Sum","-"]
[]
[]
[]
[]
[]
[null,null,null," Carried forward / …"]
[null,null,null," Brought forward / …"]
[]
[{"$f":"IF($E98<>\"\",MAX($A$1:INDIRECT(CONCATENATE(\"$A$\",ROW()-1)))+1,\"\")","v":""},{"$f":"IF(A98<>\"\",$A$3&A98,\"\")","v":""},null,"Other:-"]
[{"$f":"IF($E99<>\"\",MAX($A$1:INDIRECT(CONCATENATE(\"$A$\",ROW()-1)))+1,\"\")","v":""},""]
[{"$f":"IF($E100<>\"\",MAX($A$1:INDIRECT(CONCATENATE(\"$A$\",ROW()-1)))+1,\"\")","v":30},"ME11.30",null,"All other items not included above but which are nevertheless necessary to meet the Scope of Work and/or are required for the proper, safe and effective operation of the plant (Specify)","Sum","-"]
[{"$f":"IF($E101<>\"\",MAX($A$1:INDIRECT(CONCATENATE(\"$A$\",ROW()-1)))+1,\"\")","v":""},"",null,"……………………………………………….."]
[{"$f":"IF($E102<>\"\",MAX($A$1:INDIRECT(CONCATENATE(\"$A$\",ROW()-1)))+1,\"\")","v":""},"",null,"……………………………………………….."]
[{"$f":"IF($E103<>\"\",MAX($A$1:INDIRECT(CONCATENATE(\"$A$\",ROW()-1)))+1,\"\")","v":""},"",null,"……………………………………………….."]
[null,null,null,"……………………………………………….."]
[]
[]
[]
[]
[]
[]
[]
[]
[]
[]
[]
[]
[]
[]
[]
[]
[]
[]
[]
[]
[]
[]
[]
[]
[]
[]
[]
[]
[]
[]
[]
[]
[]
[]
[]
[]
[]
[]
[]
[{"$f":"IF($E144<>\"\",MAX($A$1:INDIRECT(CONCATENATE(\"$A$\",ROW()-1)))+1,\"\")","v":""},""]
[{"$f":"IF($E145<>\"\",MAX($A$1:INDIRECT(CONCATENATE(\"$A$\",ROW()-1)))+1,\"\")","v":""},""]
[null,null,null,{"$f":"\" TOTAL SECTION \"&$A$3&\":\n Carried to Summary\"","v":" TOTAL SECTION ME11.:\n Carried to Summary"},null,null,"R"]

{"sheet":"ME12","index":23,"n_rows":61,"n_cols":9,"rows_kept":61,"cut":false,"hidden":false,"merged":[]}
["Item No","Item No","Chief Reference","Short Description","Unit","Quantity","Rate","Amount\n R             c"]
[]
["ME12.",null,null,{"$f":"\"SECTION \"&A3","v":"SECTION ME12."}]
[null,null,null,"M&E WORKS - PUMP STATION"]
[null,null,"PS 9.26","LV SWITCHGEAR AND CONTROLGEAR ASSEMBLIES"]
[{"$f":"IF($E6<>\"\",MAX($A$1:INDIRECT(CONCATENATE(\"$A$\",ROW()-1)))+1,\"\")","v":""},{"$f":"IF(A6<>\"\",$A$3&A6,\"\")","v":""}]
[{"$f":"IF($E7<>\"\",MAX($A$1:INDIRECT(CONCATENATE(\"$A$\",ROW()-1)))+1,\"\")","v":""},"",null,"Allow for all the costs and expenses in connection with the design, manufacture, routine testing, factory testing, supply, delivery, offloading and storage of the following materials and equipment:"]
[{"$f":"IF($E8<>\"\",MAX($A$1:INDIRECT(CONCATENATE(\"$A$\",ROW()-1)))+1,\"\")","v":""},""]
[{"$f":"IF($E9<>\"\",MAX($A$1:INDIRECT(CONCATENATE(\"$A$\",ROW()-1)))+1,\"\")","v":1},"ME12.1",null,"Pump station MCC (MCC-PS) complete","No.",1]
[{"$f":"IF($E10<>\"\",MAX($A$1:INDIRECT(CONCATENATE(\"$A$\",ROW()-1)))+1,\"\")","v":""},""]
[{"$f":"IF($E11<>\"\",MAX($A$1:INDIRECT(CONCATENATE(\"$A$\",ROW()-1)))+1,\"\")","v":2},"ME12.2",null,"Field Control Station for motor (start/E-stop)","No.",16]
[{"$f":"IF($E12<>\"\",MAX($A$1:INDIRECT(CONCATENATE(\"$A$\",ROW()-1)))+1,\"\")","v":""},""]
[{"$f":"IF($E13<>\"\",MAX($A$1:INDIRECT(CONCATENATE(\"$A$\",ROW()-1)))+1,\"\")","v":3},"ME12.3",null,"Field Switch Disconnector for actuated valve","No.",12]
[{"$f":"IF($E14<>\"\",MAX($A$1:INDIRECT(CONCATENATE(\"$A$\",ROW()-1)))+1,\"\")","v":""},""]
[{"$f":"IF($E15<>\"\",MAX($A$1:INDIRECT(CONCATENATE(\"$A$\",ROW()-1)))+1,\"\")","v":4},"ME12.4",null,"Field Switch Disconnector for crane","No.",1]
[{"$f":"IF($E16<>\"\",MAX($A$1:INDIRECT(CONCATENATE(\"$A$\",ROW()-1)))+1,\"\")","v":""},""]
[{"$f":"IF($E17<>\"\",MAX($A$1:INDIRECT(CONCATENATE(\"$A$\",ROW()-1)))+1,\"\")","v":""},"",null,"Allow for all costs and expenses in connection with the Site installation, testing and commissioning of the following:"]
[{"$f":"IF($E18<>\"\",MAX($A$1:INDIRECT(CONCATENATE(\"$A$\",ROW()-1)))+1,\"\")","v":""},""]
[{"$f":"IF($E19<>\"\",MAX($A$1:INDIRECT(CONCATENATE(\"$A$\",ROW()-1)))+1,\"\")","v":5},"ME12.5",null,{"$f":"\"All materials and equipment summarized in Section \"&$A$3&\" complete\"","v":"All materials and equipment summarized in Section ME12. complete"},"Sum","-"]
[]
[{"$f":"IF($E21<>\"\",MAX($A$1:INDIRECT(CONCATENATE(\"$A$\",ROW()-1)))+1,\"\")","v":""},{"$f":"IF(A21<>\"\",$A$3&A21,\"\")","v":""},null,"Other:-"]
[{"$f":"IF($E22<>\"\",MAX($A$1:INDIRECT(CONCATENATE(\"$A$\",ROW()-1)))+1,\"\")","v":""},""]
[{"$f":"IF($E23<>\"\",MAX($A$1:INDIRECT(CONCATENATE(\"$A$\",ROW()-1)))+1,\"\")","v":6},"ME12.6",null,"All other items not included above but which are nevertheless necessary to meet the Scope of Work and/or are required for the proper, safe and effective operation of the plant (Specify)","Sum","-"]
[{"$f":"IF($E24<>\"\",MAX($A$1:INDIRECT(CONCATENATE(\"$A$\",ROW()-1)))+1,\"\")","v":""},"",null,"……………………………………………….."]
[{"$f":"IF($E25<>\"\",MAX($A$1:INDIRECT(CONCATENATE(\"$A$\",ROW()-1)))+1,\"\")","v":""},"",null,"……………………………………………….."]
[{"$f":"IF($E26<>\"\",MAX($A$1:INDIRECT(CONCATENATE(\"$A$\",ROW()-1)))+1,\"\")","v":""},"",null,"……………………………………………….."]
[{"$f":"IF($E27<>\"\",MAX($A$1:INDIRECT(CONCATENATE(\"$A$\",ROW()-1)))+1,\"\")","v":""},"",null,"……………………………………………….."]
[{"$f":"IF($E28<>\"\",MAX($A$1:INDIRECT(CONCATENATE(\"$A$\",ROW()-1)))+1,\"\")","v":""},"",null,"……………………………………………….."]
[]
[]
[{"$f":"IF($E31<>\"\",MAX($A$1:INDIRECT(CONCATENATE(\"$A$\",ROW()-1)))+1,\"\")","v":""},{"$f":"IF(A31<>\"\",$A$3&A31,\"\")","v":""}]
[]
[]
[]
[]
[]
[{"$f":"IF($E37<>\"\",MAX($A$1:INDIRECT(CONCATENATE(\"$A$\",ROW()-1)))+1,\"\")","v":""},""]
[{"$f":"IF($E38<>\"\",MAX($A$1:INDIRECT(CONCATENATE(\"$A$\",ROW()-1)))+1,\"\")","v":""},""]
[{"$f":"IF($E39<>\"\",MAX($A$1:INDIRECT(CONCATENATE(\"$A$\",ROW()-1)))+1,\"\")","v":""},""]
[{"$f":"IF($E40<>\"\",MAX($A$1:INDIRECT(CONCATENATE(\"$A$\",ROW()-1)))+1,\"\")","v":""},""]
[null,null,null,{"$f":"\" TOTAL SECTION \"&$A$3&\":\n Carried to Summary\"","v":" TOTAL SECTION ME12.:\n Carried to Summary"},null,null,"R"]
[]
[]
[]
[]
[]
[]
[]
[]
[]
[]
[]
[]
[]
[]
[]
[]
[]
[]
[]
[null,null,null,null,null,null,null,null," "]

{"sheet":"ME13","index":24,"n_rows":84,"n_cols":8,"rows_kept":84,"cut":false,"hidden":false,"merged":[]}
["Item No","Item No","Chief Reference","Short Description","Unit","Quantity","Rate","Amount\n R             c"]
[]
["ME13.",null,null,{"$f":"\"SECTION \"&A3","v":"SECTION ME13."}]
[null,null,null,"M&E WORKS - PUMP STATION"]
[null,null,"PS 9.28, PS 9.29 & DWS1810 clause 10.5","EARTHING AND LIGHTNING PROTECTION"]
[{"$f":"IF($E6<>\"\",MAX($A$1:INDIRECT(CONCATENATE(\"$A$\",ROW()-1)))+1,\"\")","v":""},{"$f":"IF(A6<>\"\",$A$3&A6,\"\")","v":""}]
[{"$f":"IF($E7<>\"\",MAX($A$1:INDIRECT(CONCATENATE(\"$A$\",ROW()-1)))+1,\"\")","v":""},"",null,"Allow for all the costs and expenses in connection with the design, manufacture, routine testing, factory testing, supply, delivery, offloading and storage of the following materials and equipment:"]
[{"$f":"IF($E8<>\"\",MAX($A$1:INDIRECT(CONCATENATE(\"$A$\",ROW()-1)))+1,\"\")","v":""},""]
[{"$f":"IF($E9<>\"\",MAX($A$1:INDIRECT(CONCATENATE(\"$A$\",ROW()-1)))+1,\"\")","v":""},"",null,"Lightning protection of structures"]
[{"$f":"IF($E10<>\"\",MAX($A$1:INDIRECT(CONCATENATE(\"$A$\",ROW()-1)))+1,\"\")","v":""},""]
[{"$f":"IF($E11<>\"\",MAX($A$1:INDIRECT(CONCATENATE(\"$A$\",ROW()-1)))+1,\"\")","v":1},"ME13.1",null,"Earthing and lightning protection for the 5 ML reservoir in accordance with drawing 106777-0502-DRG-ST-0406","Sum","-"]
[{"$f":"IF($E12<>\"\",MAX($A$1:INDIRECT(CONCATENATE(\"$A$\",ROW()-1)))+1,\"\")","v":""},""]
[{"$f":"IF($E13<>\"\",MAX($A$1:INDIRECT(CONCATENATE(\"$A$\",ROW()-1)))+1,\"\")","v":2},"ME13.2",null,"Earthing and lightning protection for the Pump Station Building, in accordance with drawing 106777-0504-DRG-EE-0560","Sum","-"]
[{"$f":"IF($E14<>\"\",MAX($A$1:INDIRECT(CONCATENATE(\"$A$\",ROW()-1)))+1,\"\")","v":""},""]
[{"$f":"IF($E15<>\"\",MAX($A$1:INDIRECT(CONCATENATE(\"$A$\",ROW()-1)))+1,\"\")","v":""},"",null,"Allow for all costs and expenses in connection with the Site installation, testing and commissioning of the following:"]
[{"$f":"IF($E16<>\"\",MAX($A$1:INDIRECT(CONCATENATE(\"$A$\",ROW()-1)))+1,\"\")","v":""},""]
[{"$f":"IF($E17<>\"\",MAX($A$1:INDIRECT(CONCATENATE(\"$A$\",ROW()-1)))+1,\"\")","v":""},"",null,"Lightning protection of structures"]
[{"$f":"IF($E18<>\"\",MAX($A$1:INDIRECT(CONCATENATE(\"$A$\",ROW()-1)))+1,\"\")","v":""},""]
[{"$f":"IF($E19<>\"\",MAX($A$1:INDIRECT(CONCATENATE(\"$A$\",ROW()-1)))+1,\"\")","v":3},"ME13.3",null,"Earthing and lightning protection for the 5 ML reservoir in accordance with drawing 106777-0502-DRG-ST-0406","Sum","-"]
[]
[{"$f":"IF($E21<>\"\",MAX($A$1:INDIRECT(CONCATENATE(\"$A$\",ROW()-1)))+1,\"\")","v":4},{"$f":"IF(A21<>\"\",$A$3&A21,\"\")","v":"ME13.4"},null,"Earthing and lightning protection for the Pump Station Building, in accordance with drawing 106777-0504-DRG-EE-0560","Sum","-"]
[{"$f":"IF($E22<>\"\",MAX($A$1:INDIRECT(CONCATENATE(\"$A$\",ROW()-1)))+1,\"\")","v":""},{"$f":"IF(A22<>\"\",$A$3&A22,\"\")","v":""}]
[{"$f":"IF($E23<>\"\",MAX($A$1:INDIRECT(CONCATENATE(\"$A$\",ROW()-1)))+1,\"\")","v":5},{"$f":"IF(A23<>\"\",$A$3&A23,\"\")","v":"ME13.5"},null,"Ground Resistivity Survey for all Buildings' locations on site, by accredited Sub-Contractor","Sum","-"]
[]
[{"$f":"IF($E25<>\"\",MAX($A$1:INDIRECT(CONCATENATE(\"$A$\",ROW()-1)))+1,\"\")","v":6},{"$f":"IF(A25<>\"\",$A$3&A25,\"\")","v":"ME13.6"},null,"Lightning Protection Survey of Pump Station and 5 ML reservoir including design by accredited Sub-Contractor","Sum","-"]
[]
[{"$f":"IF($E27<>\"\",MAX($A$1:INDIRECT(CONCATENATE(\"$A$\",ROW()-1)))+1,\"\")","v":7},{"$f":"IF(A27<>\"\",$A$3&A27,\"\")","v":"ME13.7"},null,"Additional Lightning protection required as required after survey","Sum","-",null,100000]
[{"$f":"IF($E28<>\"\",MAX($A$1:INDIRECT(CONCATENATE(\"$A$\",ROW()-1)))+1,\"\")","v":""},{"$f":"IF(A28<>\"\",$A$3&A28,\"\")","v":""}]
[{"$f":"IF($E29<>\"\",MAX($A$1:INDIRECT(CONCATENATE(\"$A$\",ROW()-1)))+1,\"\")","v":8},{"$f":"IF(A29<>\"\",$A$3&A29,\"\")","v":"ME13.8"},null,"Contractor's markup on Lightning subcontractor's quote","Sum",{"$f":"H27","v":100000}]
[]
[]
[]
[null,null,null," Carried forward / …"]
[null,null,null," Brought forward / …"]
[]
[{"$f":"IF($E36<>\"\",MAX($A$1:INDIRECT(CONCATENATE(\"$A$\",ROW()-1)))+1,\"\")","v":""},{"$f":"IF(A36<>\"\",$A$3&A36,\"\")","v":""},null,"Other:-"]
[{"$f":"IF($E37<>\"\",MAX($A$1:INDIRECT(CONCATENATE(\"$A$\",ROW()-1)))+1,\"\")","v":""},""]
[{"$f":"IF($E38<>\"\",MAX($A$1:INDIRECT(CONCATENATE(\"$A$\",ROW()-1)))+1,\"\")","v":9},"ME13.9",null,"All other items not included above but which are nevertheless necessary to meet the Scope of Work and/or are required for the proper, safe and effective operation of the plant (Specify)","Sum","-"]
[{"$f":"IF($E39<>\"\",MAX($A$1:INDIRECT(CONCATENATE(\"$A$\",ROW()-1)))+1,\"\")","v":""},"",null,"……………………………………………….."]
[{"$f":"IF($E40<>\"\",MAX($A$1:INDIRECT(CONCATENATE(\"$A$\",ROW()-1)))+1,\"\")","v":""},"",null,"……………………………………………….."]
[{"$f":"IF($E41<>\"\",MAX($A$1:INDIRECT(CONCATENATE(\"$A$\",ROW()-1)))+1,\"\")","v":""},"",null,"……………………………………………….."]
[{"$f":"IF($E42<>\"\",MAX($A$1:INDIRECT(CONCATENATE(\"$A$\",ROW()-1)))+1,\"\")","v":""},"",null,"……………………………………………….."]
[]
[]
[]
[]
[]
[]
[]
[]
[]
[]
[]
[]
[]
[]
[]
[]
[]
[]
[]
[]
[]
[]
[]
[]
[]
[]
[]
[]
[]
[]
[]
[]
[]
[]
[]
[]
[]
[]
[]
[{"$f":"IF($E82<>\"\",MAX($A$1:INDIRECT(CONCATENATE(\"$A$\",ROW()-1)))+1,\"\")","v":""},""]
[{"$f":"IF($E83<>\"\",MAX($A$1:INDIRECT(CONCATENATE(\"$A$\",ROW()-1)))+1,\"\")","v":""},""]
[null,null,null,{"$f":"\" TOTAL SECTION \"&$A$3&\":\n Carried to Summary\"","v":" TOTAL SECTION ME13.:\n Carried to Summary"},null,null,"R"]

{"sheet":"ME14","index":25,"n_rows":204,"n_cols":8,"rows_kept":204,"cut":false,"hidden":false,"merged":[]}
["Item No","Item No","Chief Reference","Short Description","Unit","Quantity","Rate","Amount\n R             c"]
[]
["ME14.",null,null,{"$f":"\"SECTION \"&A3","v":"SECTION ME14."}]
[null,null,null,"M&E WORKS - PUMP STATION"]
[null,null,"PS 9.30\n","CONTROL, INSTRUMENTATION DATA CABLING"]
[]
[{"$f":"IF($E7<>\"\",MAX($A$1:INDIRECT(CONCATENATE(\"$A$\",ROW()-1)))+1,\"\")","v":""},{"$f":"IF(A7<>\"\",$A$3&A7,\"\")","v":""},null,"Allow for all the costs and expenses in connection with the design, manufacture, routine testing, factory testing, supply, delivery, offloading and storage of the following materials and equipment:"]
[{"$f":"IF($E8<>\"\",MAX($A$1:INDIRECT(CONCATENATE(\"$A$\",ROW()-1)))+1,\"\")","v":""},""]
[{"$f":"IF($E9<>\"\",MAX($A$1:INDIRECT(CONCATENATE(\"$A$\",ROW()-1)))+1,\"\")","v":""},"",null,"Cu/PVC/PVC/SWA/PVC 600/1000V multicore cable"]
[{"$f":"IF($E10<>\"\",MAX($A$1:INDIRECT(CONCATENATE(\"$A$\",ROW()-1)))+1,\"\")","v":""},""]
[{"$f":"IF($E11<>\"\",MAX($A$1:INDIRECT(CONCATENATE(\"$A$\",ROW()-1)))+1,\"\")","v":1},"ME14.1",null,"1.5mm² x 4 core","m",100]
[{"$f":"IF($E12<>\"\",MAX($A$1:INDIRECT(CONCATENATE(\"$A$\",ROW()-1)))+1,\"\")","v":""},""]
[{"$f":"IF($E13<>\"\",MAX($A$1:INDIRECT(CONCATENATE(\"$A$\",ROW()-1)))+1,\"\")","v":2},"ME14.2",null,"1.5mm² x 12 core","m",200]
[{"$f":"IF($E14<>\"\",MAX($A$1:INDIRECT(CONCATENATE(\"$A$\",ROW()-1)))+1,\"\")","v":""},""]
[{"$f":"IF($E15<>\"\",MAX($A$1:INDIRECT(CONCATENATE(\"$A$\",ROW()-1)))+1,\"\")","v":3},"ME14.3",null,"1.5mm² x 19core","m",100]
[{"$f":"IF($E16<>\"\",MAX($A$1:INDIRECT(CONCATENATE(\"$A$\",ROW()-1)))+1,\"\")","v":""},""]
[{"$f":"IF($E17<>\"\",MAX($A$1:INDIRECT(CONCATENATE(\"$A$\",ROW()-1)))+1,\"\")","v":""},"",null,"Cu/PVC/PVC/SWA/PVC 600/1000V multicore cable terminations"]
[{"$f":"IF($E18<>\"\",MAX($A$1:INDIRECT(CONCATENATE(\"$A$\",ROW()-1)))+1,\"\")","v":""},""]
[{"$f":"IF($E19<>\"\",MAX($A$1:INDIRECT(CONCATENATE(\"$A$\",ROW()-1)))+1,\"\")","v":4},"ME14.4",null,"1.5mm² x 4 core","No.",60]
[{"$f":"IF($E20<>\"\",MAX($A$1:INDIRECT(CONCATENATE(\"$A$\",ROW()-1)))+1,\"\")","v":""},""]
[{"$f":"IF($E21<>\"\",MAX($A$1:INDIRECT(CONCATENATE(\"$A$\",ROW()-1)))+1,\"\")","v":5},"ME14.5",null,"1.5mm² x 12 core","No.",10]
[{"$f":"IF($E22<>\"\",MAX($A$1:INDIRECT(CONCATENATE(\"$A$\",ROW()-1)))+1,\"\")","v":""},""]
[{"$f":"IF($E23<>\"\",MAX($A$1:INDIRECT(CONCATENATE(\"$A$\",ROW()-1)))+1,\"\")","v":6},"ME14.6",null,"1.5mm² x 19core","No.",6]
[{"$f":"IF($E24<>\"\",MAX($A$1:INDIRECT(CONCATENATE(\"$A$\",ROW()-1)))+1,\"\")","v":""},""]
[{"$f":"IF($E25<>\"\",MAX($A$1:INDIRECT(CONCATENATE(\"$A$\",ROW()-1)))+1,\"\")","v":""},"",null,"Instrumentation cable"]
[{"$f":"IF($E26<>\"\",MAX($A$1:INDIRECT(CONCATENATE(\"$A$\",ROW()-1)))+1,\"\")","v":""},""]
[{"$f":"IF($E27<>\"\",MAX($A$1:INDIRECT(CONCATENATE(\"$A$\",ROW()-1)))+1,\"\")","v":7},"ME14.7",null,"1.5mm² 1-pair","m",700]
[{"$f":"IF($E28<>\"\",MAX($A$1:INDIRECT(CONCATENATE(\"$A$\",ROW()-1)))+1,\"\")","v":""},""]
[{"$f":"IF($E29<>\"\",MAX($A$1:INDIRECT(CONCATENATE(\"$A$\",ROW()-1)))+1,\"\")","v":8},"ME14.8",null,"1.5mm² 2-pair","m",100]
[{"$f":"IF($E30<>\"\",MAX($A$1:INDIRECT(CONCATENATE(\"$A$\",ROW()-1)))+1,\"\")","v":""},""]
[{"$f":"IF($E31<>\"\",MAX($A$1:INDIRECT(CONCATENATE(\"$A$\",ROW()-1)))+1,\"\")","v":9},"ME14.9",null,"1.5mm² 12-pair","m",200]
[{"$f":"IF($E32<>\"\",MAX($A$1:INDIRECT(CONCATENATE(\"$A$\",ROW()-1)))+1,\"\")","v":""},""]
[{"$f":"IF($E33<>\"\",MAX($A$1:INDIRECT(CONCATENATE(\"$A$\",ROW()-1)))+1,\"\")","v":10},"ME14.10",null,"1.5mm² 19-pair","m",100]
[{"$f":"IF($E34<>\"\",MAX($A$1:INDIRECT(CONCATENATE(\"$A$\",ROW()-1)))+1,\"\")","v":""},""]
[{"$f":"IF($E35<>\"\",MAX($A$1:INDIRECT(CONCATENATE(\"$A$\",ROW()-1)))+1,\"\")","v":""},"",null,"Terminations for instrumentation cable"]
[{"$f":"IF($E36<>\"\",MAX($A$1:INDIRECT(CONCATENATE(\"$A$\",ROW()-1)))+1,\"\")","v":""},""]
[{"$f":"IF($E37<>\"\",MAX($A$1:INDIRECT(CONCATENATE(\"$A$\",ROW()-1)))+1,\"\")","v":11},"ME14.11",null,"1.5mm² 1-pair","No.",50]
[{"$f":"IF($E38<>\"\",MAX($A$1:INDIRECT(CONCATENATE(\"$A$\",ROW()-1)))+1,\"\")","v":""},""]
[{"$f":"IF($E39<>\"\",MAX($A$1:INDIRECT(CONCATENATE(\"$A$\",ROW()-1)))+1,\"\")","v":12},"ME14.12",null,"1.5mm² 2-pair","No.",50]
[{"$f":"IF($E40<>\"\",MAX($A$1:INDIRECT(CONCATENATE(\"$A$\",ROW()-1)))+1,\"\")","v":""},""]
[{"$f":"IF($E41<>\"\",MAX($A$1:INDIRECT(CONCATENATE(\"$A$\",ROW()-1)))+1,\"\")","v":13},"ME14.13",null,"1.5mm² 12-pair","No.",10]
[{"$f":"IF($E42<>\"\",MAX($A$1:INDIRECT(CONCATENATE(\"$A$\",ROW()-1)))+1,\"\")","v":""},""]
[{"$f":"IF($E43<>\"\",MAX($A$1:INDIRECT(CONCATENATE(\"$A$\",ROW()-1)))+1,\"\")","v":14},"ME14.14",null,"1.5mm² 19-pair","No.",10]
[]
[]
[]
[]
[]
[]
[null,null,null," Carried forward / …"]
[null,null,null," Brought forward / …"]
[]
[{"$f":"IF($E53<>\"\",MAX($A$1:INDIRECT(CONCATENATE(\"$A$\",ROW()-1)))+1,\"\")","v":""},{"$f":"IF(A53<>\"\",$A$3&A53,\"\")","v":""},null,"Instrumentation Power Cable "]
[{"$f":"IF($E54<>\"\",MAX($A$1:INDIRECT(CONCATENATE(\"$A$\",ROW()-1)))+1,\"\")","v":""},""]
[{"$f":"IF($E55<>\"\",MAX($A$1:INDIRECT(CONCATENATE(\"$A$\",ROW()-1)))+1,\"\")","v":15},"ME14.15",null,"2.5mm² x 3 core","m",300]
[{"$f":"IF($E56<>\"\",MAX($A$1:INDIRECT(CONCATENATE(\"$A$\",ROW()-1)))+1,\"\")","v":""},""]
[{"$f":"IF($E57<>\"\",MAX($A$1:INDIRECT(CONCATENATE(\"$A$\",ROW()-1)))+1,\"\")","v":16},"ME14.16",null,"4mm² x 3 core","m",10]
[{"$f":"IF($E58<>\"\",MAX($A$1:INDIRECT(CONCATENATE(\"$A$\",ROW()-1)))+1,\"\")","v":""},""]
[{"$f":"IF($E59<>\"\",MAX($A$1:INDIRECT(CONCATENATE(\"$A$\",ROW()-1)))+1,\"\")","v":""},"",null,"Terminations for Instrumentation power cable"]
[{"$f":"IF($E60<>\"\",MAX($A$1:INDIRECT(CONCATENATE(\"$A$\",ROW()-1)))+1,\"\")","v":""},""]
[{"$f":"IF($E61<>\"\",MAX($A$1:INDIRECT(CONCATENATE(\"$A$\",ROW()-1)))+1,\"\")","v":17},"ME14.17",null,"2.5mm² x 3 core","No.",30]
[{"$f":"IF($E62<>\"\",MAX($A$1:INDIRECT(CONCATENATE(\"$A$\",ROW()-1)))+1,\"\")","v":""},""]
[{"$f":"IF($E63<>\"\",MAX($A$1:INDIRECT(CONCATENATE(\"$A$\",ROW()-1)))+1,\"\")","v":18},"ME14.18",null,"4mm² x 3 core","No.",10]
[{"$f":"IF($E64<>\"\",MAX($A$1:INDIRECT(CONCATENATE(\"$A$\",ROW()-1)))+1,\"\")","v":""},""]
[null,null,null,"Data Cables"]
[]
[{"$f":"IF($E67<>\"\",MAX($A$1:INDIRECT(CONCATENATE(\"$A$\",ROW()-1)))+1,\"\")","v":19},{"$f":"IF(A67<>\"\",$A$3&A67,\"\")","v":"ME14.19"},null,"8 Core Single Mode Fibre Optic cable","m",600]
[{"$f":"IF($E68<>\"\",MAX($A$1:INDIRECT(CONCATENATE(\"$A$\",ROW()-1)))+1,\"\")","v":""},{"$f":"IF(A68<>\"\",$A$3&A68,\"\")","v":""}]
[{"$f":"IF($E69<>\"\",MAX($A$1:INDIRECT(CONCATENATE(\"$A$\",ROW()-1)))+1,\"\")","v":20},{"$f":"IF(A69<>\"\",$A$3&A69,\"\")","v":"ME14.20"},null,"CAT5 Cables","m",200]
[{"$f":"IF($E70<>\"\",MAX($A$1:INDIRECT(CONCATENATE(\"$A$\",ROW()-1)))+1,\"\")","v":""},{"$f":"IF(A70<>\"\",$A$3&A70,\"\")","v":""}]
[null,null,null,"Terminations for Data Cables"]
[]
[{"$f":"IF($E73<>\"\",MAX($A$1:INDIRECT(CONCATENATE(\"$A$\",ROW()-1)))+1,\"\")","v":21},{"$f":"IF(A73<>\"\",$A$3&A73,\"\")","v":"ME14.21"},null,"8 Core Single Mode Fibre Optic cable per core","No.",16]
[{"$f":"IF($E74<>\"\",MAX($A$1:INDIRECT(CONCATENATE(\"$A$\",ROW()-1)))+1,\"\")","v":""},""]
[{"$f":"IF($E75<>\"\",MAX($A$1:INDIRECT(CONCATENATE(\"$A$\",ROW()-1)))+1,\"\")","v":22},"ME14.22",null,"CAT5 Cables","No.",40]
[{"$f":"IF($E76<>\"\",MAX($A$1:INDIRECT(CONCATENATE(\"$A$\",ROW()-1)))+1,\"\")","v":""},""]
[{"$f":"IF($E77<>\"\",MAX($A$1:INDIRECT(CONCATENATE(\"$A$\",ROW()-1)))+1,\"\")","v":""},"",null,"Allow for all costs and expenses in connection with the Site installation, testing and commissioning of the following:"]
[{"$f":"IF($E78<>\"\",MAX($A$1:INDIRECT(CONCATENATE(\"$A$\",ROW()-1)))+1,\"\")","v":""},""]
[{"$f":"IF($E79<>\"\",MAX($A$1:INDIRECT(CONCATENATE(\"$A$\",ROW()-1)))+1,\"\")","v":""},"",null,{"$f":"D9","v":"Cu/PVC/PVC/SWA/PVC 600/1000V multicore cable"}]
[{"$f":"IF($E80<>\"\",MAX($A$1:INDIRECT(CONCATENATE(\"$A$\",ROW()-1)))+1,\"\")","v":""},""]
[{"$f":"IF($E81<>\"\",MAX($A$1:INDIRECT(CONCATENATE(\"$A$\",ROW()-1)))+1,\"\")","v":23},"ME14.23",null,{"$f":"D11","v":"1.5mm² x 4 core"},"m",{"$f":"F11","v":100}]
[{"$f":"IF($E82<>\"\",MAX($A$1:INDIRECT(CONCATENATE(\"$A$\",ROW()-1)))+1,\"\")","v":""},""]
[{"$f":"IF($E83<>\"\",MAX($A$1:INDIRECT(CONCATENATE(\"$A$\",ROW()-1)))+1,\"\")","v":24},"ME14.24",null,{"$f":"D13","v":"1.5mm² x 12 core"},"m",{"$f":"F13","v":200}]
[{"$f":"IF($E84<>\"\",MAX($A$1:INDIRECT(CONCATENATE(\"$A$\",ROW()-1)))+1,\"\")","v":""},""]
[{"$f":"IF($E85<>\"\",MAX($A$1:INDIRECT(CONCATENATE(\"$A$\",ROW()-1)))+1,\"\")","v":25},"ME14.25",null,{"$f":"D15","v":"1.5mm² x 19core"},"m",{"$f":"F15","v":100}]
[{"$f":"IF($E86<>\"\",MAX($A$1:INDIRECT(CONCATENATE(\"$A$\",ROW()-1)))+1,\"\")","v":""},""]
[{"$f":"IF($E87<>\"\",MAX($A$1:INDIRECT(CONCATENATE(\"$A$\",ROW()-1)))+1,\"\")","v":""},"",null,{"$f":"D17","v":"Cu/PVC/PVC/SWA/PVC 600/1000V multicore cable terminations"}]
[{"$f":"IF($E88<>\"\",MAX($A$1:INDIRECT(CONCATENATE(\"$A$\",ROW()-1)))+1,\"\")","v":""},""]
[{"$f":"IF($E89<>\"\",MAX($A$1:INDIRECT(CONCATENATE(\"$A$\",ROW()-1)))+1,\"\")","v":26},"ME14.26",null,{"$f":"D19","v":"1.5mm² x 4 core"},"No.",{"$f":"F19","v":60}]
[{"$f":"IF($E90<>\"\",MAX($A$1:INDIRECT(CONCATENATE(\"$A$\",ROW()-1)))+1,\"\")","v":""},""]
[{"$f":"IF($E91<>\"\",MAX($A$1:INDIRECT(CONCATENATE(\"$A$\",ROW()-1)))+1,\"\")","v":27},"ME14.27",null,{"$f":"D21","v":"1.5mm² x 12 core"},"No.",{"$f":"F21","v":10}]
[{"$f":"IF($E92<>\"\",MAX($A$1:INDIRECT(CONCATENATE(\"$A$\",ROW()-1)))+1,\"\")","v":""},""]
[{"$f":"IF($E93<>\"\",MAX($A$1:INDIRECT(CONCATENATE(\"$A$\",ROW()-1)))+1,\"\")","v":28},"ME14.28",null,{"$f":"D23","v":"1.5mm² x 19core"},"No.",{"$f":"F23","v":6}]
[]
[]
[]
[]
[]
[null,null,null," Carried forward / …"]
[null,null,null," Brought forward / …"]
[]
[{"$f":"IF($E102<>\"\",MAX($A$1:INDIRECT(CONCATENATE(\"$A$\",ROW()-1)))+1,\"\")","v":""},{"$f":"IF(A102<>\"\",$A$3&A102,\"\")","v":""},null,{"$f":"D25","v":"Instrumentation cable"}]
[{"$f":"IF($E103<>\"\",MAX($A$1:INDIRECT(CONCATENATE(\"$A$\",ROW()-1)))+1,\"\")","v":""},""]
[{"$f":"IF($E104<>\"\",MAX($A$1:INDIRECT(CONCATENATE(\"$A$\",ROW()-1)))+1,\"\")","v":29},"ME14.29",null,{"$f":"D27","v":"1.5mm² 1-pair"},"m",{"$f":"F27","v":700}]
[]
[{"$f":"IF($E106<>\"\",MAX($A$1:INDIRECT(CONCATENATE(\"$A$\",ROW()-1)))+1,\"\")","v":30},"ME14.30",null,{"$f":"D29","v":"1.5mm² 2-pair"},"m",{"$f":"F29","v":100}]
[{"$f":"IF($E107<>\"\",MAX($A$1:INDIRECT(CONCATENATE(\"$A$\",ROW()-1)))+1,\"\")","v":""},""]
[{"$f":"IF($E108<>\"\",MAX($A$1:INDIRECT(CONCATENATE(\"$A$\",ROW()-1)))+1,\"\")","v":31},"ME14.31",null,{"$f":"D31","v":"1.5mm² 12-pair"},"m",{"$f":"F31","v":200}]
[{"$f":"IF($E109<>\"\",MAX($A$1:INDIRECT(CONCATENATE(\"$A$\",ROW()-1)))+1,\"\")","v":""},""]
[{"$f":"IF($E110<>\"\",MAX($A$1:INDIRECT(CONCATENATE(\"$A$\",ROW()-1)))+1,\"\")","v":32},"ME14.32",null,{"$f":"D33","v":"1.5mm² 19-pair"},"m",{"$f":"F33","v":100}]
[]
[{"$f":"IF($E112<>\"\",MAX($A$1:INDIRECT(CONCATENATE(\"$A$\",ROW()-1)))+1,\"\")","v":""},{"$f":"IF(A112<>\"\",$A$3&A112,\"\")","v":""},null,{"$f":"D35","v":"Terminations for instrumentation cable"}]
[{"$f":"IF($E113<>\"\",MAX($A$1:INDIRECT(CONCATENATE(\"$A$\",ROW()-1)))+1,\"\")","v":""},""]
[{"$f":"IF($E114<>\"\",MAX($A$1:INDIRECT(CONCATENATE(\"$A$\",ROW()-1)))+1,\"\")","v":33},"ME14.33",null,{"$f":"D37","v":"1.5mm² 1-pair"},"No.",{"$f":"F37","v":50}]
[{"$f":"IF($E115<>\"\",MAX($A$1:INDIRECT(CONCATENATE(\"$A$\",ROW()-1)))+1,\"\")","v":""},""]
[{"$f":"IF($E116<>\"\",MAX($A$1:INDIRECT(CONCATENATE(\"$A$\",ROW()-1)))+1,\"\")","v":34},"ME14.34",null,{"$f":"D39","v":"1.5mm² 2-pair"},"No.",{"$f":"F39","v":50}]
[{"$f":"IF($E117<>\"\",MAX($A$1:INDIRECT(CONCATENATE(\"$A$\",ROW()-1)))+1,\"\")","v":""},""]
[{"$f":"IF($E118<>\"\",MAX($A$1:INDIRECT(CONCATENATE(\"$A$\",ROW()-1)))+1,\"\")","v":35},"ME14.35",null,{"$f":"D41","v":"1.5mm² 12-pair"},"No.",{"$f":"F41","v":10}]
[]
[{"$f":"IF($E120<>\"\",MAX($A$1:INDIRECT(CONCATENATE(\"$A$\",ROW()-1)))+1,\"\")","v":36},{"$f":"IF(A120<>\"\",$A$3&A120,\"\")","v":"ME14.36"},null,{"$f":"D43","v":"1.5mm² 19-pair"},"No.",{"$f":"F43","v":10}]
[]
[{"$f":"IF($E122<>\"\",MAX($A$1:INDIRECT(CONCATENATE(\"$A$\",ROW()-1)))+1,\"\")","v":""},{"$f":"IF(A122<>\"\",$A$3&A122,\"\")","v":""},null,{"$f":"D53","v":"Instrumentation Power Cable "}]
[{"$f":"IF($E123<>\"\",MAX($A$1:INDIRECT(CONCATENATE(\"$A$\",ROW()-1)))+1,\"\")","v":""},{"$f":"IF(A123<>\"\",$A$3&A123,\"\")","v":""}]
[{"$f":"IF($E124<>\"\",MAX($A$1:INDIRECT(CONCATENATE(\"$A$\",ROW()-1)))+1,\"\")","v":37},{"$f":"IF(A124<>\"\",$A$3&A124,\"\")","v":"ME14.37"},null,{"$f":"D55","v":"2.5mm² x 3 core"},"m",{"$f":"F55","v":300}]
[{"$f":"IF($E125<>\"\",MAX($A$1:INDIRECT(CONCATENATE(\"$A$\",ROW()-1)))+1,\"\")","v":""},{"$f":"IF(A125<>\"\",$A$3&A125,\"\")","v":""}]
[{"$f":"IF($E126<>\"\",MAX($A$1:INDIRECT(CONCATENATE(\"$A$\",ROW()-1)))+1,\"\")","v":38},{"$f":"IF(A126<>\"\",$A$3&A126,\"\")","v":"ME14.38"},null,{"$f":"D57","v":"4mm² x 3 core"},"m",{"$f":"F57","v":10}]
[]
[{"$f":"IF($E128<>\"\",MAX($A$1:INDIRECT(CONCATENATE(\"$A$\",ROW()-1)))+1,\"\")","v":""},"",null,{"$f":"D59","v":"Terminations for Instrumentation power cable"}]
[{"$f":"IF($E129<>\"\",MAX($A$1:INDIRECT(CONCATENATE(\"$A$\",ROW()-1)))+1,\"\")","v":""},""]
[{"$f":"IF($E130<>\"\",MAX($A$1:INDIRECT(CONCATENATE(\"$A$\",ROW()-1)))+1,\"\")","v":39},"ME14.39",null,{"$f":"D61","v":"2.5mm² x 3 core"},"No.",{"$f":"F61","v":30}]
[{"$f":"IF($E131<>\"\",MAX($A$1:INDIRECT(CONCATENATE(\"$A$\",ROW()-1)))+1,\"\")","v":""},""]
[{"$f":"IF($E132<>\"\",MAX($A$1:INDIRECT(CONCATENATE(\"$A$\",ROW()-1)))+1,\"\")","v":40},"ME14.40",null,{"$f":"D63","v":"4mm² x 3 core"},"No.",{"$f":"F63","v":10}]
[{"$f":"IF($E133<>\"\",MAX($A$1:INDIRECT(CONCATENATE(\"$A$\",ROW()-1)))+1,\"\")","v":""},""]
[null,null,null,{"$f":"D65","v":"Data Cables"}]
[]
[{"$f":"IF($E136<>\"\",MAX($A$1:INDIRECT(CONCATENATE(\"$A$\",ROW()-1)))+1,\"\")","v":41},{"$f":"IF(A136<>\"\",$A$3&A136,\"\")","v":"ME14.41"},null,{"$f":"D67","v":"8 Core Single Mode Fibre Optic cable"},"m",{"$f":"F67","v":600}]
[{"$f":"IF($E137<>\"\",MAX($A$1:INDIRECT(CONCATENATE(\"$A$\",ROW()-1)))+1,\"\")","v":""},{"$f":"IF(A137<>\"\",$A$3&A137,\"\")","v":""}]
[{"$f":"IF($E138<>\"\",MAX($A$1:INDIRECT(CONCATENATE(\"$A$\",ROW()-1)))+1,\"\")","v":42},{"$f":"IF(A138<>\"\",$A$3&A138,\"\")","v":"ME14.42"},null,{"$f":"D69","v":"CAT5 Cables"},"m",{"$f":"F69","v":200}]
[{"$f":"IF($E139<>\"\",MAX($A$1:INDIRECT(CONCATENATE(\"$A$\",ROW()-1)))+1,\"\")","v":""},{"$f":"IF(A139<>\"\",$A$3&A139,\"\")","v":""}]
[{"$f":"IF($E140<>\"\",MAX($A$1:INDIRECT(CONCATENATE(\"$A$\",ROW()-1)))+1,\"\")","v":""},{"$f":"IF(A140<>\"\",$A$3&A140,\"\")","v":""},null,{"$f":"D71","v":"Terminations for Data Cables"}]
[{"$f":"IF($E141<>\"\",MAX($A$1:INDIRECT(CONCATENATE(\"$A$\",ROW()-1)))+1,\"\")","v":""},""]
[{"$f":"IF($E142<>\"\",MAX($A$1:INDIRECT(CONCATENATE(\"$A$\",ROW()-1)))+1,\"\")","v":43},"ME14.43",null,{"$f":"D73","v":"8 Core Single Mode Fibre Optic cable per core"},"No.",{"$f":"F73","v":16}]
[{"$f":"IF($E143<>\"\",MAX($A$1:INDIRECT(CONCATENATE(\"$A$\",ROW()-1)))+1,\"\")","v":""},{"$f":"IF(A143<>\"\",$A$3&A143,\"\")","v":""}]
[{"$f":"IF($E144<>\"\",MAX($A$1:INDIRECT(CONCATENATE(\"$A$\",ROW()-1)))+1,\"\")","v":44},{"$f":"IF(A144<>\"\",$A$3&A144,\"\")","v":"ME14.44"},null,{"$f":"D75","v":"CAT5 Cables"},"No.",{"$f":"F75","v":40}]
[]
[]
[]
[]
[]
[]
[]
[]
[null,null,null," Carried forward / …"]
[null,null,null," Brought forward / …"]
[]
[{"$f":"IF($E156<>\"\",MAX($A$1:INDIRECT(CONCATENATE(\"$A$\",ROW()-1)))+1,\"\")","v":""},{"$f":"IF(A156<>\"\",$A$3&A156,\"\")","v":""},null,"Other:-"]
[]
[{"$f":"IF($E158<>\"\",MAX($A$1:INDIRECT(CONCATENATE(\"$A$\",ROW()-1)))+1,\"\")","v":45},{"$f":"IF(A158<>\"\",$A$3&A158,\"\")","v":"ME14.45"},null,"All other items not included above but which are nevertheless necessary to meet the Scope of Work and/or are required for the proper, safe and effective operation of the plant (Specify)","Sum","-"]
[{"$f":"IF($E159<>\"\",MAX($A$1:INDIRECT(CONCATENATE(\"$A$\",ROW()-1)))+1,\"\")","v":""},"",null,"……………………………………………….."]
[{"$f":"IF($E160<>\"\",MAX($A$1:INDIRECT(CONCATENATE(\"$A$\",ROW()-1)))+1,\"\")","v":""},"",null,"……………………………………………….."]
[null,null,null,"……………………………………………….."]
[null,null,null,"……………………………………………….."]
[]
[]
[]
[]
[]
[]
[]
[]
[]
[]
[]
[]
[]
[]
[]
[]
[]
[]
[]
[]
[]
[]
[]
[]
[]
[]
[]
[]
[]
[]
[]
[]
[]
[]
[]
[]
[]
[]
[]
[]
[{"$f":"IF($E203<>\"\",MAX($A$1:INDIRECT(CONCATENATE(\"$A$\",ROW()-1)))+1,\"\")","v":""},""]
[null,null,null,{"$f":"\" TOTAL SECTION \"&$A$3&\":\n Carried to Summary\"","v":" TOTAL SECTION ME14.:\n Carried to Summary"},null,null,"R"]

{"sheet":"ME15","index":26,"n_rows":43,"n_cols":8,"rows_kept":43,"cut":false,"hidden":false,"merged":[]}
["Item No","Item No","Chief Reference","Short Description","Unit","Quantity","Rate","Amount\n R             c"]
[]
["ME15.",null,null,{"$f":"\"SECTION \"&A3","v":"SECTION ME15."}]
[null,null,null,"M&E WORKS - PUMP STATION"]
[null,null,"PS 9.31","PROGRAMMABLE LOGIC CONTROLLER"]
[]
[{"$f":"IF($E7<>\"\",MAX($A$1:INDIRECT(CONCATENATE(\"$A$\",ROW()-1)))+1,\"\")","v":""},{"$f":"IF(A7<>\"\",$A$3&A7,\"\")","v":""},null,"Allow for all the costs and expenses in connection with the design, manufacture, programming, simulation, routine testing, factory testing, supply, delivery, offloading and storage of the following materials and equipment:"]
[{"$f":"IF($E8<>\"\",MAX($A$1:INDIRECT(CONCATENATE(\"$A$\",ROW()-1)))+1,\"\")","v":""},""]
[{"$f":"IF($E9<>\"\",MAX($A$1:INDIRECT(CONCATENATE(\"$A$\",ROW()-1)))+1,\"\")","v":""},"",null,"PLC per Pump"]
[{"$f":"IF($E10<>\"\",MAX($A$1:INDIRECT(CONCATENATE(\"$A$\",ROW()-1)))+1,\"\")","v":""},""]
[{"$f":"IF($E11<>\"\",MAX($A$1:INDIRECT(CONCATENATE(\"$A$\",ROW()-1)))+1,\"\")","v":1},"ME15.1",null,"Control Desk (Steelwork)","Sum","-"]
[{"$f":"IF($E12<>\"\",MAX($A$1:INDIRECT(CONCATENATE(\"$A$\",ROW()-1)))+1,\"\")","v":""},""]
[{"$f":"IF($E13<>\"\",MAX($A$1:INDIRECT(CONCATENATE(\"$A$\",ROW()-1)))+1,\"\")","v":2},"ME15.2",null,"PLC and HMI hardware, complete","No.",4]
[{"$f":"IF($E14<>\"\",MAX($A$1:INDIRECT(CONCATENATE(\"$A$\",ROW()-1)))+1,\"\")","v":""},""]
[{"$f":"IF($E15<>\"\",MAX($A$1:INDIRECT(CONCATENATE(\"$A$\",ROW()-1)))+1,\"\")","v":3},"ME15.3",null,"PLC and HMI Software, complete","No.",4]
[{"$f":"IF($E16<>\"\",MAX($A$1:INDIRECT(CONCATENATE(\"$A$\",ROW()-1)))+1,\"\")","v":""},""]
[{"$f":"IF($E17<>\"\",MAX($A$1:INDIRECT(CONCATENATE(\"$A$\",ROW()-1)))+1,\"\")","v":""},"",null,"Master PLC"]
[{"$f":"IF($E18<>\"\",MAX($A$1:INDIRECT(CONCATENATE(\"$A$\",ROW()-1)))+1,\"\")","v":""},""]
[{"$f":"IF($E19<>\"\",MAX($A$1:INDIRECT(CONCATENATE(\"$A$\",ROW()-1)))+1,\"\")","v":4},"ME15.4",null,"PLC panel (steelwork)","Sum","-"]
[{"$f":"IF($E20<>\"\",MAX($A$1:INDIRECT(CONCATENATE(\"$A$\",ROW()-1)))+1,\"\")","v":""},""]
[{"$f":"IF($E21<>\"\",MAX($A$1:INDIRECT(CONCATENATE(\"$A$\",ROW()-1)))+1,\"\")","v":5},"ME15.5",null,"PLC and HMI hardware, complete","Sum","-"]
[{"$f":"IF($E22<>\"\",MAX($A$1:INDIRECT(CONCATENATE(\"$A$\",ROW()-1)))+1,\"\")","v":""},""]
[{"$f":"IF($E23<>\"\",MAX($A$1:INDIRECT(CONCATENATE(\"$A$\",ROW()-1)))+1,\"\")","v":6},"ME15.6",null,"PLC and HMI Software, complete","Sum","-"]
[{"$f":"IF($E24<>\"\",MAX($A$1:INDIRECT(CONCATENATE(\"$A$\",ROW()-1)))+1,\"\")","v":""},""]
[{"$f":"IF($E25<>\"\",MAX($A$1:INDIRECT(CONCATENATE(\"$A$\",ROW()-1)))+1,\"\")","v":""},"",null,"Allow for all costs and expenses in connection with the Site installation, programming, configuring, simulation, testing and commissioning of the following:-"]
[{"$f":"IF($E26<>\"\",MAX($A$1:INDIRECT(CONCATENATE(\"$A$\",ROW()-1)))+1,\"\")","v":""},""]
[{"$f":"IF($E27<>\"\",MAX($A$1:INDIRECT(CONCATENATE(\"$A$\",ROW()-1)))+1,\"\")","v":7},"ME15.7",null,{"$f":"\"All materials and equipment summarized in Section \"&$A$3&\" complete\"","v":"All materials and equipment summarized in Section ME15. complete"},"Sum","-"]
[]
[{"$f":"IF($E29<>\"\",MAX($A$1:INDIRECT(CONCATENATE(\"$A$\",ROW()-1)))+1,\"\")","v":""},{"$f":"IF(A29<>\"\",$A$3&A29,\"\")","v":""},null,"Other:-"]
[{"$f":"IF($E30<>\"\",MAX($A$1:INDIRECT(CONCATENATE(\"$A$\",ROW()-1)))+1,\"\")","v":""},""]
[{"$f":"IF($E31<>\"\",MAX($A$1:INDIRECT(CONCATENATE(\"$A$\",ROW()-1)))+1,\"\")","v":8},"ME15.8",null,"All other items not included above but which are nevertheless necessary to meet the Scope of Work and/or are required for the proper, safe and effective operation of the plant (Specify)","Sum","-"]
[{"$f":"IF($E32<>\"\",MAX($A$1:INDIRECT(CONCATENATE(\"$A$\",ROW()-1)))+1,\"\")","v":""},"",null,"……………………………………………….."]
[{"$f":"IF($E33<>\"\",MAX($A$1:INDIRECT(CONCATENATE(\"$A$\",ROW()-1)))+1,\"\")","v":""},"",null,"……………………………………………….."]
[null,null,null,"……………………………………………….."]
[null,null,null,"……………………………………………….."]
[]
[]
[]
[]
[]
[]
[{"$f":"IF($E42<>\"\",MAX($A$1:INDIRECT(CONCATENATE(\"$A$\",ROW()-1)))+1,\"\")","v":""},""]
[null,null,null,{"$f":"\" TOTAL SECTION \"&$A$3&\":\n Carried to Summary\"","v":" TOTAL SECTION ME15.:\n Carried to Summary"},null,null,"R"]

{"sheet":"ME16","index":27,"n_rows":114,"n_cols":8,"rows_kept":114,"cut":false,"hidden":false,"merged":[]}
["Item No","Item No","Chief Reference","Short Description","Unit","Quantity","Rate","Amount\n R             c"]
[]
["ME16.",null,null,{"$f":"\"SECTION \"&A3","v":"SECTION ME16."}]
[null,null,null,"M&E WORKS - PUMP STATION"]
[null,null,"PS 9.32","INSTRUMENTATION"]
[]
[null,null,null,"Allow for all the costs and expenses in connection with the design, manufacture, routine testing, factory testing, supply, delivery, offloading and storage of the following materials and equipment:"]
[]
[{"$f":"IF($E9<>\"\",MAX($A$1:INDIRECT(CONCATENATE(\"$A$\",ROW()-1)))+1,\"\")","v":1},{"$f":"IF(A9<>\"\",$A$3&A9,\"\")","v":"ME16.1"},null,"Temperature Transmitter for Motor Winding Temperature PT100 RTDs, including mounting materials (2 sets per motor)","No.",24]
[{"$f":"IF($E10<>\"\",MAX($A$1:INDIRECT(CONCATENATE(\"$A$\",ROW()-1)))+1,\"\")","v":""},""]
[{"$f":"IF($E11<>\"\",MAX($A$1:INDIRECT(CONCATENATE(\"$A$\",ROW()-1)))+1,\"\")","v":2},"ME16.2",null,"Temperature Transmitter for Pump and Motor Bearing Temperature PT100 RTDs, built into the Motors and Pumps","No.",16]
[{"$f":"IF($E12<>\"\",MAX($A$1:INDIRECT(CONCATENATE(\"$A$\",ROW()-1)))+1,\"\")","v":""},""]
[{"$f":"IF($E13<>\"\",MAX($A$1:INDIRECT(CONCATENATE(\"$A$\",ROW()-1)))+1,\"\")","v":3},"ME16.3",null,"Temperature Transmitter PT100 RTD for Pump Casing Temperature, including mounting materials","No.",5]
[{"$f":"IF($E14<>\"\",MAX($A$1:INDIRECT(CONCATENATE(\"$A$\",ROW()-1)))+1,\"\")","v":""},""]
[{"$f":"IF($E15<>\"\",MAX($A$1:INDIRECT(CONCATENATE(\"$A$\",ROW()-1)))+1,\"\")","v":4},"ME16.4",null,"Vibration Transmitter for Pumps including two sensors (x,y), electronic vibration monitoring system, transmitter and mounting materials","No.",4]
[{"$f":"IF($E16<>\"\",MAX($A$1:INDIRECT(CONCATENATE(\"$A$\",ROW()-1)))+1,\"\")","v":""},""]
[{"$f":"IF($E17<>\"\",MAX($A$1:INDIRECT(CONCATENATE(\"$A$\",ROW()-1)))+1,\"\")","v":5},"ME16.5",null,"Ultrasonic Flow Transmitter (DN 700) (Clamp On) including sensor, transmitter and mounting materials","No.",1]
[{"$f":"IF($E18<>\"\",MAX($A$1:INDIRECT(CONCATENATE(\"$A$\",ROW()-1)))+1,\"\")","v":""},""]
[{"$f":"IF($E19<>\"\",MAX($A$1:INDIRECT(CONCATENATE(\"$A$\",ROW()-1)))+1,\"\")","v":6},"ME16.6",null,"Insertion Magnetic Flow Meter for Pump Leg including mounting materials","No.",4]
[{"$f":"IF($E20<>\"\",MAX($A$1:INDIRECT(CONCATENATE(\"$A$\",ROW()-1)))+1,\"\")","v":""},""]
[{"$f":"IF($E21<>\"\",MAX($A$1:INDIRECT(CONCATENATE(\"$A$\",ROW()-1)))+1,\"\")","v":7},"ME16.7",null,"Pump circulation flow switch including mounting materials","No.",4]
[{"$f":"IF($E22<>\"\",MAX($A$1:INDIRECT(CONCATENATE(\"$A$\",ROW()-1)))+1,\"\")","v":""},""]
[{"$f":"IF($E23<>\"\",MAX($A$1:INDIRECT(CONCATENATE(\"$A$\",ROW()-1)))+1,\"\")","v":8},"ME16.8",null,"Level Transmitter (Hydrostatic) for reservoirs including sensor and transmitter ","No.",2]
[{"$f":"IF($E24<>\"\",MAX($A$1:INDIRECT(CONCATENATE(\"$A$\",ROW()-1)))+1,\"\")","v":""},""]
[{"$f":"IF($E25<>\"\",MAX($A$1:INDIRECT(CONCATENATE(\"$A$\",ROW()-1)))+1,\"\")","v":9},"ME16.9",null,"Level Switch (float) for reservoirs including mounting materials","No.",3]
[{"$f":"IF($E26<>\"\",MAX($A$1:INDIRECT(CONCATENATE(\"$A$\",ROW()-1)))+1,\"\")","v":""},""]
[{"$f":"IF($E27<>\"\",MAX($A$1:INDIRECT(CONCATENATE(\"$A$\",ROW()-1)))+1,\"\")","v":10},"ME16.10",null,"Pressure Transmitter including sensor, transmitter and mounting materials","No.",9]
[{"$f":"IF($E28<>\"\",MAX($A$1:INDIRECT(CONCATENATE(\"$A$\",ROW()-1)))+1,\"\")","v":""},""]
[{"$f":"IF($E29<>\"\",MAX($A$1:INDIRECT(CONCATENATE(\"$A$\",ROW()-1)))+1,\"\")","v":11},{"$f":"IF(A29<>\"\",$A$3&A29,\"\")","v":"ME16.11"},null,"Proximity Sensors including mounted materials","No.",8]
[{"$f":"IF($E30<>\"\",MAX($A$1:INDIRECT(CONCATENATE(\"$A$\",ROW()-1)))+1,\"\")","v":""},{"$f":"IF(A30<>\"\",$A$3&A30,\"\")","v":""}]
[{"$f":"IF($E31<>\"\",MAX($A$1:INDIRECT(CONCATENATE(\"$A$\",ROW()-1)))+1,\"\")","v":12},"ME16.12",null,"JB-01 to JB-04: Pump Instrumentation and Contol junction box complete with terminations and accessories etc.","No.",4]
[]
[null,null,null," Carried forward / …"]
[null,null,null," Brought forward / …"]
[]
[{"$f":"IF($E36<>\"\",MAX($A$1:INDIRECT(CONCATENATE(\"$A$\",ROW()-1)))+1,\"\")","v":13},"ME16.13",null," Instrumentation Transmitter Outdoor housing box complete with terminations and accessories etc.","No.",2]
[{"$f":"IF($E37<>\"\",MAX($A$1:INDIRECT(CONCATENATE(\"$A$\",ROW()-1)))+1,\"\")","v":""},""]
[{"$f":"IF($E38<>\"\",MAX($A$1:INDIRECT(CONCATENATE(\"$A$\",ROW()-1)))+1,\"\")","v":""},"",null,"Allow for all costs and expenses in connection with the Site installation, programming, configuring, simulation, testing and commissioning of the following:-"]
[{"$f":"IF($E39<>\"\",MAX($A$1:INDIRECT(CONCATENATE(\"$A$\",ROW()-1)))+1,\"\")","v":""},""]
[{"$f":"IF($E40<>\"\",MAX($A$1:INDIRECT(CONCATENATE(\"$A$\",ROW()-1)))+1,\"\")","v":14},"ME16.14",null,"Temperature Transmitter for Motor Winding Temperature PT100 RTDs, including mounting materials (2 sets per pump)","No.",{"$f":"F9","v":24}]
[{"$f":"IF($E41<>\"\",MAX($A$1:INDIRECT(CONCATENATE(\"$A$\",ROW()-1)))+1,\"\")","v":""},""]
[{"$f":"IF($E42<>\"\",MAX($A$1:INDIRECT(CONCATENATE(\"$A$\",ROW()-1)))+1,\"\")","v":15},"ME16.15",null,"Temperature Transmitter for Pump and Motor Bearing Temperature PT100 RTDs, built into the Motors and Pumps","No.",{"$f":"F11","v":16}]
[{"$f":"IF($E43<>\"\",MAX($A$1:INDIRECT(CONCATENATE(\"$A$\",ROW()-1)))+1,\"\")","v":""},""]
[{"$f":"IF($E44<>\"\",MAX($A$1:INDIRECT(CONCATENATE(\"$A$\",ROW()-1)))+1,\"\")","v":16},"ME16.16",null,"Temperature Transmitter PT100 RTD for Pump Casing Temperature, including mounting materials","No.",{"$f":"F13","v":5}]
[{"$f":"IF($E45<>\"\",MAX($A$1:INDIRECT(CONCATENATE(\"$A$\",ROW()-1)))+1,\"\")","v":""},""]
[{"$f":"IF($E46<>\"\",MAX($A$1:INDIRECT(CONCATENATE(\"$A$\",ROW()-1)))+1,\"\")","v":17},"ME16.17",null,"Vibration Transmitter for Pumps including two sensors, transmitter and mounting materials","No.",{"$f":"F15","v":4}]
[{"$f":"IF($E47<>\"\",MAX($A$1:INDIRECT(CONCATENATE(\"$A$\",ROW()-1)))+1,\"\")","v":""},""]
[{"$f":"IF($E48<>\"\",MAX($A$1:INDIRECT(CONCATENATE(\"$A$\",ROW()-1)))+1,\"\")","v":18},"ME16.18",null,"Ultrasonic Flow Transmitter (DN 700) (Clamp On) including sensor, transmitter and mounting materials","No.",{"$f":"F17","v":1}]
[{"$f":"IF($E49<>\"\",MAX($A$1:INDIRECT(CONCATENATE(\"$A$\",ROW()-1)))+1,\"\")","v":""},""]
[{"$f":"IF($E50<>\"\",MAX($A$1:INDIRECT(CONCATENATE(\"$A$\",ROW()-1)))+1,\"\")","v":19},"ME16.19",null,"Insertion Magnetic Flow Meter for Pump Leg including mounting materials","No.",{"$f":"F19","v":4}]
[]
[{"$f":"IF($E52<>\"\",MAX($A$1:INDIRECT(CONCATENATE(\"$A$\",ROW()-1)))+1,\"\")","v":20},{"$f":"IF(A52<>\"\",$A$3&A52,\"\")","v":"ME16.20"},null,"Pump circulation flow switch including mounting materials","No.",4]
[{"$f":"IF($E53<>\"\",MAX($A$1:INDIRECT(CONCATENATE(\"$A$\",ROW()-1)))+1,\"\")","v":""},""]
[{"$f":"IF($E54<>\"\",MAX($A$1:INDIRECT(CONCATENATE(\"$A$\",ROW()-1)))+1,\"\")","v":21},"ME16.21",null,"Level Transmitter (Hydrostatic) for reservoirs including sensor and transmitter ","No.",{"$f":"F23","v":2}]
[{"$f":"IF($E55<>\"\",MAX($A$1:INDIRECT(CONCATENATE(\"$A$\",ROW()-1)))+1,\"\")","v":""},{"$f":"IF(A55<>\"\",$A$3&A55,\"\")","v":""}]
[{"$f":"IF($E56<>\"\",MAX($A$1:INDIRECT(CONCATENATE(\"$A$\",ROW()-1)))+1,\"\")","v":22},"ME16.22",null,"Level Switch (Float) for reservoirs including mounting materials","No.",{"$f":"F25","v":3}]
[{"$f":"IF($E57<>\"\",MAX($A$1:INDIRECT(CONCATENATE(\"$A$\",ROW()-1)))+1,\"\")","v":""},""]
[{"$f":"IF($E58<>\"\",MAX($A$1:INDIRECT(CONCATENATE(\"$A$\",ROW()-1)))+1,\"\")","v":23},"ME16.23",null,"Pressure Transmitter including sensor, transmitter and mounting materials","No.",{"$f":"F27","v":9}]
[]
[{"$f":"IF($E60<>\"\",MAX($A$1:INDIRECT(CONCATENATE(\"$A$\",ROW()-1)))+1,\"\")","v":24},{"$f":"IF(A60<>\"\",$A$3&A60,\"\")","v":"ME16.24"},null,"Proximity Sensors including mounted materials","No.",{"$f":"F29","v":8}]
[{"$f":"IF($E61<>\"\",MAX($A$1:INDIRECT(CONCATENATE(\"$A$\",ROW()-1)))+1,\"\")","v":""},""]
[{"$f":"IF($E62<>\"\",MAX($A$1:INDIRECT(CONCATENATE(\"$A$\",ROW()-1)))+1,\"\")","v":25},"ME16.25",null,"JB-01 to JB-04: Pump Instrumentation and Contol junction box complete with terminations and accessories etc.","No.",{"$f":"F31","v":4}]
[]
[]
[null,null,null," Carried forward / …"]
[null,null,null," Brought forward / …"]
[]
[{"$f":"IF($E68<>\"\",MAX($A$1:INDIRECT(CONCATENATE(\"$A$\",ROW()-1)))+1,\"\")","v":26},"ME16.26",null,"Instrumentation Transmitter Outdoor housing box complete with terminations and accessories etc.","No.",{"$f":"F36","v":2}]
[{"$f":"IF($E69<>\"\",MAX($A$1:INDIRECT(CONCATENATE(\"$A$\",ROW()-1)))+1,\"\")","v":""},""]
[{"$f":"IF($E70<>\"\",MAX($A$1:INDIRECT(CONCATENATE(\"$A$\",ROW()-1)))+1,\"\")","v":""},"",null,"Other:-"]
[{"$f":"IF($E71<>\"\",MAX($A$1:INDIRECT(CONCATENATE(\"$A$\",ROW()-1)))+1,\"\")","v":""},""]
[{"$f":"IF($E72<>\"\",MAX($A$1:INDIRECT(CONCATENATE(\"$A$\",ROW()-1)))+1,\"\")","v":27},"ME16.27",null,"All other items not included above but which are nevertheless necessary to meet the Scope of Work and/or are required for the proper, safe and effective operation of the plant (Specify)","Sum","-"]
[{"$f":"IF($E73<>\"\",MAX($A$1:INDIRECT(CONCATENATE(\"$A$\",ROW()-1)))+1,\"\")","v":""},"",null,"……………………………………………….."]
[{"$f":"IF($E74<>\"\",MAX($A$1:INDIRECT(CONCATENATE(\"$A$\",ROW()-1)))+1,\"\")","v":""},"",null,"……………………………………………….."]
[{"$f":"IF($E75<>\"\",MAX($A$1:INDIRECT(CONCATENATE(\"$A$\",ROW()-1)))+1,\"\")","v":""},"",null,"……………………………………………….."]
[{"$f":"IF($E76<>\"\",MAX($A$1:INDIRECT(CONCATENATE(\"$A$\",ROW()-1)))+1,\"\")","v":""},"",null,"……………………………………………….."]
[{"$f":"IF($E77<>\"\",MAX($A$1:INDIRECT(CONCATENATE(\"$A$\",ROW()-1)))+1,\"\")","v":""},"",null,"……………………………………………….."]
[{"$f":"IF($E78<>\"\",MAX($A$1:INDIRECT(CONCATENATE(\"$A$\",ROW()-1)))+1,\"\")","v":""},""]
[{"$f":"IF($E79<>\"\",MAX($A$1:INDIRECT(CONCATENATE(\"$A$\",ROW()-1)))+1,\"\")","v":""},""]
[{"$f":"IF($E80<>\"\",MAX($A$1:INDIRECT(CONCATENATE(\"$A$\",ROW()-1)))+1,\"\")","v":""},""]
[{"$f":"IF($E81<>\"\",MAX($A$1:INDIRECT(CONCATENATE(\"$A$\",ROW()-1)))+1,\"\")","v":""},""]
[{"$f":"IF($E82<>\"\",MAX($A$1:INDIRECT(CONCATENATE(\"$A$\",ROW()-1)))+1,\"\")","v":""},""]
[{"$f":"IF($E83<>\"\",MAX($A$1:INDIRECT(CONCATENATE(\"$A$\",ROW()-1)))+1,\"\")","v":""},""]
[{"$f":"IF($E84<>\"\",MAX($A$1:INDIRECT(CONCATENATE(\"$A$\",ROW()-1)))+1,\"\")","v":""},""]
[{"$f":"IF($E85<>\"\",MAX($A$1:INDIRECT(CONCATENATE(\"$A$\",ROW()-1)))+1,\"\")","v":""},""]
[{"$f":"IF($E86<>\"\",MAX($A$1:INDIRECT(CONCATENATE(\"$A$\",ROW()-1)))+1,\"\")","v":""},""]
[{"$f":"IF($E87<>\"\",MAX($A$1:INDIRECT(CONCATENATE(\"$A$\",ROW()-1)))+1,\"\")","v":""},""]
[]
[]
[]
[]
[]
[]
[]
[]
[]
[]
[]
[]
[]
[]
[]
[]
[]
[]
[{"$f":"IF($E106<>\"\",MAX($A$1:INDIRECT(CONCATENATE(\"$A$\",ROW()-1)))+1,\"\")","v":""},""]
[]
[{"$f":"IF($E108<>\"\",MAX($A$1:INDIRECT(CONCATENATE(\"$A$\",ROW()-1)))+1,\"\")","v":""},""]
[{"$f":"IF($E109<>\"\",MAX($A$1:INDIRECT(CONCATENATE(\"$A$\",ROW()-1)))+1,\"\")","v":""},""]
[{"$f":"IF($E110<>\"\",MAX($A$1:INDIRECT(CONCATENATE(\"$A$\",ROW()-1)))+1,\"\")","v":""},""]
[{"$f":"IF($E111<>\"\",MAX($A$1:INDIRECT(CONCATENATE(\"$A$\",ROW()-1)))+1,\"\")","v":""},""]
[{"$f":"IF($E112<>\"\",MAX($A$1:INDIRECT(CONCATENATE(\"$A$\",ROW()-1)))+1,\"\")","v":""},""]
[{"$f":"IF($E113<>\"\",MAX($A$1:INDIRECT(CONCATENATE(\"$A$\",ROW()-1)))+1,\"\")","v":""},""]
[null,null,null,{"$f":"\" TOTAL SECTION \"&$A$3&\":\n Carried to Summary\"","v":" TOTAL SECTION ME16.:\n Carried to Summary"},null,null,"R"]

{"sheet":"ME17","index":28,"n_rows":43,"n_cols":8,"rows_kept":43,"cut":false,"hidden":false,"merged":[]}
["Item No","Item No","Chief Reference","Short Description","Unit","Quantity","Rate","Amount\n R             c"]
[]
["ME17.",null,null,{"$f":"\"SECTION \"&A3","v":"SECTION ME17."}]
[null,null,null,"M&E WORKS - PUMP STATION"]
[null,null,"PS 9.33","SCADA"]
[{"$f":"IF($E6<>\"\",MAX($A$1:INDIRECT(CONCATENATE(\"$A$\",ROW()-1)))+1,\"\")","v":""},{"$f":"IF(A6<>\"\",$A$3&A6,\"\")","v":""}]
[{"$f":"IF($E7<>\"\",MAX($A$1:INDIRECT(CONCATENATE(\"$A$\",ROW()-1)))+1,\"\")","v":""},"",null,"Allow for all the costs and expenses in connection with the design, manufacture, programming, simulation, routine testing, factory testing, supply, delivery, offloading and storage of the following materials and equipment:"]
[{"$f":"IF($E8<>\"\",MAX($A$1:INDIRECT(CONCATENATE(\"$A$\",ROW()-1)))+1,\"\")","v":""},""]
[{"$f":"IF($E9<>\"\",MAX($A$1:INDIRECT(CONCATENATE(\"$A$\",ROW()-1)))+1,\"\")","v":1},"ME17.1",null,"SCADA Software Pump Station","Sum","-"]
[{"$f":"IF($E10<>\"\",MAX($A$1:INDIRECT(CONCATENATE(\"$A$\",ROW()-1)))+1,\"\")","v":""},""]
[{"$f":"IF($E11<>\"\",MAX($A$1:INDIRECT(CONCATENATE(\"$A$\",ROW()-1)))+1,\"\")","v":2},"ME17.2",null,"SCADA Hardware Pump Station","Sum","-"]
[]
[{"$f":"IF($E13<>\"\",MAX($A$1:INDIRECT(CONCATENATE(\"$A$\",ROW()-1)))+1,\"\")","v":3},{"$f":"IF(A13<>\"\",$A$3&A13,\"\")","v":"ME17.3"},null,"SCADA Software Tsomo WTW","Sum","-"]
[{"$f":"IF($E14<>\"\",MAX($A$1:INDIRECT(CONCATENATE(\"$A$\",ROW()-1)))+1,\"\")","v":""},""]
[{"$f":"IF($E15<>\"\",MAX($A$1:INDIRECT(CONCATENATE(\"$A$\",ROW()-1)))+1,\"\")","v":4},"ME17.4",null,"SCADA Hardware Tsomo WTW","Sum","-"]
[{"$f":"IF($E16<>\"\",MAX($A$1:INDIRECT(CONCATENATE(\"$A$\",ROW()-1)))+1,\"\")","v":""},""]
[{"$f":"IF($E17<>\"\",MAX($A$1:INDIRECT(CONCATENATE(\"$A$\",ROW()-1)))+1,\"\")","v":""},"",null,"Allow for all costs and expenses in connection with the Site installation, programming, configuring, simulation, testing and commissioning of the following:-"]
[{"$f":"IF($E18<>\"\",MAX($A$1:INDIRECT(CONCATENATE(\"$A$\",ROW()-1)))+1,\"\")","v":""},""]
[{"$f":"IF($E19<>\"\",MAX($A$1:INDIRECT(CONCATENATE(\"$A$\",ROW()-1)))+1,\"\")","v":5},"ME17.5",null,{"$f":"\"All materials and equipment summarized in Section \"&$A$3&\" complete\"","v":"All materials and equipment summarized in Section ME17. complete"},"Sum","-"]
[]
[{"$f":"IF($E21<>\"\",MAX($A$1:INDIRECT(CONCATENATE(\"$A$\",ROW()-1)))+1,\"\")","v":""},{"$f":"IF(A21<>\"\",$A$3&A21,\"\")","v":""},null,"Other:-"]
[{"$f":"IF($E22<>\"\",MAX($A$1:INDIRECT(CONCATENATE(\"$A$\",ROW()-1)))+1,\"\")","v":""},""]
[{"$f":"IF($E23<>\"\",MAX($A$1:INDIRECT(CONCATENATE(\"$A$\",ROW()-1)))+1,\"\")","v":6},"ME17.6",null,"All other items not included above but which are nevertheless necessary to meet the Scope of Work and/or are required for the proper, safe and effective operation of the plant (Specify)","Sum","-"]
[{"$f":"IF($E24<>\"\",MAX($A$1:INDIRECT(CONCATENATE(\"$A$\",ROW()-1)))+1,\"\")","v":""},"",null,"……………………………………………….."]
[{"$f":"IF($E25<>\"\",MAX($A$1:INDIRECT(CONCATENATE(\"$A$\",ROW()-1)))+1,\"\")","v":""},"",null,"……………………………………………….."]
[{"$f":"IF($E26<>\"\",MAX($A$1:INDIRECT(CONCATENATE(\"$A$\",ROW()-1)))+1,\"\")","v":""},"",null,"……………………………………………….."]
[{"$f":"IF($E27<>\"\",MAX($A$1:INDIRECT(CONCATENATE(\"$A$\",ROW()-1)))+1,\"\")","v":""},"",null,"……………………………………………….."]
[{"$f":"IF($E28<>\"\",MAX($A$1:INDIRECT(CONCATENATE(\"$A$\",ROW()-1)))+1,\"\")","v":""},""]
[]
[{"$f":"IF($E30<>\"\",MAX($A$1:INDIRECT(CONCATENATE(\"$A$\",ROW()-1)))+1,\"\")","v":""},""]
[]
[]
[{"$f":"IF($E33<>\"\",MAX($A$1:INDIRECT(CONCATENATE(\"$A$\",ROW()-1)))+1,\"\")","v":""},""]
[]
[]
[]
[]
[]
[]
[]
[{"$f":"IF($E41<>\"\",MAX($A$1:INDIRECT(CONCATENATE(\"$A$\",ROW()-1)))+1,\"\")","v":""},""]
[{"$f":"IF($E42<>\"\",MAX($A$1:INDIRECT(CONCATENATE(\"$A$\",ROW()-1)))+1,\"\")","v":""},""]
[null,null,null,{"$f":"\" TOTAL SECTION \"&$A$3&\":\n Carried to Summary\"","v":" TOTAL SECTION ME17.:\n Carried to Summary"},null,null,"R"]

{"sheet":"ME18","index":29,"n_rows":193,"n_cols":8,"rows_kept":193,"cut":false,"hidden":false,"merged":[]}
["Item No","Item No","Chief Reference","Short Description","Unit","Quantity","Rate","Amount\n R             c"]
[]
["ME18.",null,null,{"$f":"\"SECTION \"&A3","v":"SECTION ME18."}]
["",null,null,"M&E WORKS - PUMP STATION"]
[null,null,"PS 9.35","BUILDING ELECTRICAL"]
[{"$f":"IF($E6<>\"\",MAX($A$1:INDIRECT(CONCATENATE(\"$A$\",ROW()-1)))+1,\"\")","v":""},{"$f":"IF(A6<>\"\",$A$3&A6,\"\")","v":""}]
[{"$f":"IF($E7<>\"\",MAX($A$1:INDIRECT(CONCATENATE(\"$A$\",ROW()-1)))+1,\"\")","v":""},"",null,"Allow for all the costs and expenses in connection with the design, manufacture, routine testing, factory testing, supply, delivery, offloading and storage of the following materials and equipment:"]
[{"$f":"IF($E8<>\"\",MAX($A$1:INDIRECT(CONCATENATE(\"$A$\",ROW()-1)))+1,\"\")","v":""},""]
[{"$f":"IF($E9<>\"\",MAX($A$1:INDIRECT(CONCATENATE(\"$A$\",ROW()-1)))+1,\"\")","v":""},"",null,"LUMINAIRES"]
[{"$f":"IF($E10<>\"\",MAX($A$1:INDIRECT(CONCATENATE(\"$A$\",ROW()-1)))+1,\"\")","v":""},""]
[{"$f":"IF($E11<>\"\",MAX($A$1:INDIRECT(CONCATENATE(\"$A$\",ROW()-1)))+1,\"\")","v":1},"ME18.1",null,"108W LED Flood Light","No",6]
[{"$f":"IF($E12<>\"\",MAX($A$1:INDIRECT(CONCATENATE(\"$A$\",ROW()-1)))+1,\"\")","v":""},""]
[{"$f":"IF($E13<>\"\",MAX($A$1:INDIRECT(CONCATENATE(\"$A$\",ROW()-1)))+1,\"\")","v":2},"ME18.2",null,"65W LED Tube Vapour Proof Fitting","No",100]
[{"$f":"IF($E14<>\"\",MAX($A$1:INDIRECT(CONCATENATE(\"$A$\",ROW()-1)))+1,\"\")","v":""},""]
[{"$f":"IF($E15<>\"\",MAX($A$1:INDIRECT(CONCATENATE(\"$A$\",ROW()-1)))+1,\"\")","v":3},"ME18.3",null,"40W LED Luminare complete with parabolic reflector","No",9]
[{"$f":"IF($E16<>\"\",MAX($A$1:INDIRECT(CONCATENATE(\"$A$\",ROW()-1)))+1,\"\")","v":""}]
[{"$f":"IF($E17<>\"\",MAX($A$1:INDIRECT(CONCATENATE(\"$A$\",ROW()-1)))+1,\"\")","v":4},{"$f":"IF(A17<>\"\",$A$3&A17,\"\")","v":"ME18.4"},null,"18W LED wall mounted exterior bulkhead","No",15]
[{"$f":"IF($E18<>\"\",MAX($A$1:INDIRECT(CONCATENATE(\"$A$\",ROW()-1)))+1,\"\")","v":""},""]
[{"$f":"IF($E19<>\"\",MAX($A$1:INDIRECT(CONCATENATE(\"$A$\",ROW()-1)))+1,\"\")","v":5},"ME18.5",null,"Emergency exit light fitting","No",10]
[{"$f":"IF($E20<>\"\",MAX($A$1:INDIRECT(CONCATENATE(\"$A$\",ROW()-1)))+1,\"\")","v":""},""]
[{"$f":"IF($E21<>\"\",MAX($A$1:INDIRECT(CONCATENATE(\"$A$\",ROW()-1)))+1,\"\")","v":6},"ME18.6",null,"Photocell","No",2]
[{"$f":"IF($E22<>\"\",MAX($A$1:INDIRECT(CONCATENATE(\"$A$\",ROW()-1)))+1,\"\")","v":""},""]
[{"$f":"IF($E23<>\"\",MAX($A$1:INDIRECT(CONCATENATE(\"$A$\",ROW()-1)))+1,\"\")","v":7},"ME18.7",null,"Battery Packs (installed into light fittings)","No",18]
[]
[{"$f":"IF($E25<>\"\",MAX($A$1:INDIRECT(CONCATENATE(\"$A$\",ROW()-1)))+1,\"\")","v":""},{"$f":"IF(A25<>\"\",$A$3&A25,\"\")","v":""},null,"POWER"]
[{"$f":"IF($E26<>\"\",MAX($A$1:INDIRECT(CONCATENATE(\"$A$\",ROW()-1)))+1,\"\")","v":""},""]
[{"$f":"IF($E27<>\"\",MAX($A$1:INDIRECT(CONCATENATE(\"$A$\",ROW()-1)))+1,\"\")","v":8},"ME18.8",null,"16 Amp 3-pin 250V Power Skirting Modular Outlets double switched socket","No",2]
[{"$f":"IF($E28<>\"\",MAX($A$1:INDIRECT(CONCATENATE(\"$A$\",ROW()-1)))+1,\"\")","v":""},""]
[{"$f":"IF($E29<>\"\",MAX($A$1:INDIRECT(CONCATENATE(\"$A$\",ROW()-1)))+1,\"\")","v":9},"ME18.9",null,"16 Amp 3-pin 250V double switched socket outlet","No",10]
[{"$f":"IF($E30<>\"\",MAX($A$1:INDIRECT(CONCATENATE(\"$A$\",ROW()-1)))+1,\"\")","v":""},""]
[{"$f":"IF($E31<>\"\",MAX($A$1:INDIRECT(CONCATENATE(\"$A$\",ROW()-1)))+1,\"\")","v":10},"ME18.10",null,"16 Amp 3-pin 250V Power Skirting Modular single dedicated switched socket outlet","No",2]
[]
[{"$f":"IF($E33<>\"\",MAX($A$1:INDIRECT(CONCATENATE(\"$A$\",ROW()-1)))+1,\"\")","v":11},{"$f":"IF(A33<>\"\",$A$3&A33,\"\")","v":"ME18.11"},null,"32 Amp 5-pin 400V industrial switched socket outlet","No",5]
[{"$f":"IF($E34<>\"\",MAX($A$1:INDIRECT(CONCATENATE(\"$A$\",ROW()-1)))+1,\"\")","v":""},""]
[{"$f":"IF($E35<>\"\",MAX($A$1:INDIRECT(CONCATENATE(\"$A$\",ROW()-1)))+1,\"\")","v":""},"",null,"Industrial Flush Mounted 16A Light Switches complete with boxes, cover plates switches etc; Similar or equivalent to Crabtree Classic Range"]
[{"$f":"IF($E36<>\"\",MAX($A$1:INDIRECT(CONCATENATE(\"$A$\",ROW()-1)))+1,\"\")","v":""},{"$f":"IF(A36<>\"\",$A$3&A36,\"\")","v":""}]
[{"$f":"IF($E37<>\"\",MAX($A$1:INDIRECT(CONCATENATE(\"$A$\",ROW()-1)))+1,\"\")","v":12},{"$f":"IF(A37<>\"\",$A$3&A37,\"\")","v":"ME18.12"},null,"1-Lever, 1-Way","No",8]
[]
[{"$f":"IF($E39<>\"\",MAX($A$1:INDIRECT(CONCATENATE(\"$A$\",ROW()-1)))+1,\"\")","v":13},"ME18.13",null,"1-Lever, 2-Way","No",8]
[{"$f":"IF($E40<>\"\",MAX($A$1:INDIRECT(CONCATENATE(\"$A$\",ROW()-1)))+1,\"\")","v":""},""]
[{"$f":"IF($E41<>\"\",MAX($A$1:INDIRECT(CONCATENATE(\"$A$\",ROW()-1)))+1,\"\")","v":14},"ME18.14",null,"1-Lever, 3-Way","No",3]
[]
[]
[null,null,null," Carried forward / …"]
[null,null,null," Brought forward / …"]
[]
[{"$f":"IF($E47<>\"\",MAX($A$1:INDIRECT(CONCATENATE(\"$A$\",ROW()-1)))+1,\"\")","v":""},{"$f":"IF(A47<>\"\",$A$3&A47,\"\")","v":""},null,"Power Skirting"]
[{"$f":"IF($E48<>\"\",MAX($A$1:INDIRECT(CONCATENATE(\"$A$\",ROW()-1)))+1,\"\")","v":""},{"$f":"IF(A48<>\"\",$A$3&A48,\"\")","v":""}]
[{"$f":"IF($E49<>\"\",MAX($A$1:INDIRECT(CONCATENATE(\"$A$\",ROW()-1)))+1,\"\")","v":15},{"$f":"IF(A49<>\"\",$A$3&A49,\"\")","v":"ME18.15"},null,"Double compartment power skirting","m",16]
[]
[{"$f":"IF($E51<>\"\",MAX($A$1:INDIRECT(CONCATENATE(\"$A$\",ROW()-1)))+1,\"\")","v":16},"ME18.16",null,"Double compartment power skirting: End Cap","No",2]
[]
[{"$f":"IF($E53<>\"\",MAX($A$1:INDIRECT(CONCATENATE(\"$A$\",ROW()-1)))+1,\"\")","v":17},{"$f":"IF(A53<>\"\",$A$3&A53,\"\")","v":"ME18.17"},null,"Double compartment power skirting: Internal Bend","No",2]
[{"$f":"IF($E54<>\"\",MAX($A$1:INDIRECT(CONCATENATE(\"$A$\",ROW()-1)))+1,\"\")","v":""},{"$f":"IF(A54<>\"\",$A$3&A54,\"\")","v":""}]
[{"$f":"IF($E55<>\"\",MAX($A$1:INDIRECT(CONCATENATE(\"$A$\",ROW()-1)))+1,\"\")","v":""},{"$f":"IF(A55<>\"\",$A$3&A55,\"\")","v":""},null,"WIRING"]
[{"$f":"IF($E56<>\"\",MAX($A$1:INDIRECT(CONCATENATE(\"$A$\",ROW()-1)))+1,\"\")","v":""},""]
[{"$f":"IF($E57<>\"\",MAX($A$1:INDIRECT(CONCATENATE(\"$A$\",ROW()-1)))+1,\"\")","v":""},"",null,"Single core PVC insulated house wire"]
[{"$f":"IF($E58<>\"\",MAX($A$1:INDIRECT(CONCATENATE(\"$A$\",ROW()-1)))+1,\"\")","v":""},""]
[{"$f":"IF($E59<>\"\",MAX($A$1:INDIRECT(CONCATENATE(\"$A$\",ROW()-1)))+1,\"\")","v":18},"ME18.18",null,"1.5mm²","m",25]
[]
[{"$f":"IF($E61<>\"\",MAX($A$1:INDIRECT(CONCATENATE(\"$A$\",ROW()-1)))+1,\"\")","v":19},{"$f":"IF(A61<>\"\",$A$3&A61,\"\")","v":"ME18.19"},null,"2.5mm²","m",3000]
[{"$f":"IF($E62<>\"\",MAX($A$1:INDIRECT(CONCATENATE(\"$A$\",ROW()-1)))+1,\"\")","v":""},{"$f":"IF(A62<>\"\",$A$3&A62,\"\")","v":""}]
[{"$f":"IF($E63<>\"\",MAX($A$1:INDIRECT(CONCATENATE(\"$A$\",ROW()-1)))+1,\"\")","v":20},{"$f":"IF(A63<>\"\",$A$3&A63,\"\")","v":"ME18.20"},null,"4mm²","m",400]
[{"$f":"IF($E64<>\"\",MAX($A$1:INDIRECT(CONCATENATE(\"$A$\",ROW()-1)))+1,\"\")","v":""},{"$f":"IF(A64<>\"\",$A$3&A64,\"\")","v":""}]
[{"$f":"IF($E65<>\"\",MAX($A$1:INDIRECT(CONCATENATE(\"$A$\",ROW()-1)))+1,\"\")","v":""},{"$f":"IF(A65<>\"\",$A$3&A65,\"\")","v":""},null,"Single core PVC insulated earth wire"]
[]
[{"$f":"IF($E67<>\"\",MAX($A$1:INDIRECT(CONCATENATE(\"$A$\",ROW()-1)))+1,\"\")","v":21},{"$f":"IF(A67<>\"\",$A$3&A67,\"\")","v":"ME18.21"},null,"1.5mm²","m",25]
[]
[{"$f":"IF($E69<>\"\",MAX($A$1:INDIRECT(CONCATENATE(\"$A$\",ROW()-1)))+1,\"\")","v":22},{"$f":"IF(A69<>\"\",$A$3&A69,\"\")","v":"ME18.22"},null,"2.5mm²","m",850]
[{"$f":"IF($E70<>\"\",MAX($A$1:INDIRECT(CONCATENATE(\"$A$\",ROW()-1)))+1,\"\")","v":""},{"$f":"IF(A70<>\"\",$A$3&A70,\"\")","v":""}]
[{"$f":"IF($E71<>\"\",MAX($A$1:INDIRECT(CONCATENATE(\"$A$\",ROW()-1)))+1,\"\")","v":23},{"$f":"IF(A71<>\"\",$A$3&A71,\"\")","v":"ME18.23"},null,"uPVC sleeve class 6 piping","m",1000]
[{"$f":"IF($E72<>\"\",MAX($A$1:INDIRECT(CONCATENATE(\"$A$\",ROW()-1)))+1,\"\")","v":""},{"$f":"IF(A72<>\"\",$A$3&A72,\"\")","v":""}]
[{"$f":"IF($E73<>\"\",MAX($A$1:INDIRECT(CONCATENATE(\"$A$\",ROW()-1)))+1,\"\")","v":24},{"$f":"IF(A73<>\"\",$A$3&A73,\"\")","v":"ME18.24"},null,"Hot-dipped Galvanised Steel P9000 cable trunking","m",200]
[]
[{"$f":"IF($E75<>\"\",MAX($A$1:INDIRECT(CONCATENATE(\"$A$\",ROW()-1)))+1,\"\")","v":""},{"$f":"IF(A75<>\"\",$A$3&A75,\"\")","v":""},null,"Allow for all costs and expenses in connection with the Site installation, testing and commissioning of the following:"]
[{"$f":"IF($E76<>\"\",MAX($A$1:INDIRECT(CONCATENATE(\"$A$\",ROW()-1)))+1,\"\")","v":""},""]
[{"$f":"IF($E77<>\"\",MAX($A$1:INDIRECT(CONCATENATE(\"$A$\",ROW()-1)))+1,\"\")","v":""},"",null,"LUMINAIRES"]
[{"$f":"IF($E78<>\"\",MAX($A$1:INDIRECT(CONCATENATE(\"$A$\",ROW()-1)))+1,\"\")","v":""},""]
[{"$f":"IF($E79<>\"\",MAX($A$1:INDIRECT(CONCATENATE(\"$A$\",ROW()-1)))+1,\"\")","v":25},"ME18.25",null,"108W LED Flood Light","No",{"$f":"F11","v":6}]
[{"$f":"IF($E80<>\"\",MAX($A$1:INDIRECT(CONCATENATE(\"$A$\",ROW()-1)))+1,\"\")","v":""},""]
[{"$f":"IF($E81<>\"\",MAX($A$1:INDIRECT(CONCATENATE(\"$A$\",ROW()-1)))+1,\"\")","v":26},"ME18.26",null,"65W LED Tube Vapour Proof Fitting","No",{"$f":"F13","v":100}]
[{"$f":"IF($E82<>\"\",MAX($A$1:INDIRECT(CONCATENATE(\"$A$\",ROW()-1)))+1,\"\")","v":""},""]
[{"$f":"IF($E83<>\"\",MAX($A$1:INDIRECT(CONCATENATE(\"$A$\",ROW()-1)))+1,\"\")","v":27},"ME18.27",null,"40W LED Luminare complete with parabolic reflector","No",{"$f":"F15","v":9}]
[{"$f":"IF($E84<>\"\",MAX($A$1:INDIRECT(CONCATENATE(\"$A$\",ROW()-1)))+1,\"\")","v":""},""]
[{"$f":"IF($E85<>\"\",MAX($A$1:INDIRECT(CONCATENATE(\"$A$\",ROW()-1)))+1,\"\")","v":28},"ME18.28",null,"18W LED wall mounted exterior bulkhead","No",{"$f":"F17","v":15}]
[{"$f":"IF($E86<>\"\",MAX($A$1:INDIRECT(CONCATENATE(\"$A$\",ROW()-1)))+1,\"\")","v":""},""]
[{"$f":"IF($E87<>\"\",MAX($A$1:INDIRECT(CONCATENATE(\"$A$\",ROW()-1)))+1,\"\")","v":29},"ME18.29",null,"Emergency exit light fitting","No",{"$f":"F19","v":10}]
[{"$f":"IF($E88<>\"\",MAX($A$1:INDIRECT(CONCATENATE(\"$A$\",ROW()-1)))+1,\"\")","v":""},""]
[{"$f":"IF($E89<>\"\",MAX($A$1:INDIRECT(CONCATENATE(\"$A$\",ROW()-1)))+1,\"\")","v":30},"ME18.30",null,"Photocell","No",{"$f":"F21","v":2}]
[]
[{"$f":"IF($E91<>\"\",MAX($A$1:INDIRECT(CONCATENATE(\"$A$\",ROW()-1)))+1,\"\")","v":31},{"$f":"IF(A91<>\"\",$A$3&A91,\"\")","v":"ME18.31"},null,"Battery Packs (installed into light fittings)","No",{"$f":"F23","v":18}]
[]
[null,null,null," Carried forward / …"]
[null,null,null," Brought forward / …"]
[]
[{"$f":"IF($E96<>\"\",MAX($A$1:INDIRECT(CONCATENATE(\"$A$\",ROW()-1)))+1,\"\")","v":""},{"$f":"IF(A96<>\"\",$A$3&A96,\"\")","v":""},null,"POWER"]
[{"$f":"IF($E97<>\"\",MAX($A$1:INDIRECT(CONCATENATE(\"$A$\",ROW()-1)))+1,\"\")","v":""},{"$f":"IF(A97<>\"\",$A$3&A97,\"\")","v":""}]
[{"$f":"IF($E98<>\"\",MAX($A$1:INDIRECT(CONCATENATE(\"$A$\",ROW()-1)))+1,\"\")","v":32},{"$f":"IF(A98<>\"\",$A$3&A98,\"\")","v":"ME18.32"},null,"16 Amp 3-pin 250V Power Skirting Modular Outlets single switched socket","No",{"$f":"F27","v":2}]
[]
[{"$f":"IF($E100<>\"\",MAX($A$1:INDIRECT(CONCATENATE(\"$A$\",ROW()-1)))+1,\"\")","v":33},{"$f":"IF(A100<>\"\",$A$3&A100,\"\")","v":"ME18.33"},null,"16 Amp 3-pin 250V double switched socket outlet","No",{"$f":"F29","v":10}]
[{"$f":"IF($E101<>\"\",MAX($A$1:INDIRECT(CONCATENATE(\"$A$\",ROW()-1)))+1,\"\")","v":""},{"$f":"IF(A101<>\"\",$A$3&A101,\"\")","v":""}]
[{"$f":"IF($E102<>\"\",MAX($A$1:INDIRECT(CONCATENATE(\"$A$\",ROW()-1)))+1,\"\")","v":34},{"$f":"IF(A102<>\"\",$A$3&A102,\"\")","v":"ME18.34"},null,"16 Amp 3-pin 250V Power Skirting Modular single dedicated switched socket outlet","No",{"$f":"F31","v":2}]
[]
[{"$f":"IF($E104<>\"\",MAX($A$1:INDIRECT(CONCATENATE(\"$A$\",ROW()-1)))+1,\"\")","v":35},{"$f":"IF(A104<>\"\",$A$3&A104,\"\")","v":"ME18.35"},null,"32 Amp 5-pin 400V industrial switched socket outlet","No",{"$f":"F33","v":5}]
[]
[{"$f":"IF($E106<>\"\",MAX($A$1:INDIRECT(CONCATENATE(\"$A$\",ROW()-1)))+1,\"\")","v":""},{"$f":"IF(A106<>\"\",$A$3&A106,\"\")","v":""},null,"Industrial Flush Mounted 16A Light Switches complete with boxes, cover plates switches etc; Similar or equivalent to Crabtree Classic Range"]
[]
[{"$f":"IF($E108<>\"\",MAX($A$1:INDIRECT(CONCATENATE(\"$A$\",ROW()-1)))+1,\"\")","v":36},"ME18.36",null,"1-Lever, 1-Way","No",{"$f":"F37","v":8}]
[{"$f":"IF($E109<>\"\",MAX($A$1:INDIRECT(CONCATENATE(\"$A$\",ROW()-1)))+1,\"\")","v":""},""]
[{"$f":"IF($E110<>\"\",MAX($A$1:INDIRECT(CONCATENATE(\"$A$\",ROW()-1)))+1,\"\")","v":37},"ME18.37",null,"1-Lever, 2-Way","No",{"$f":"F39","v":8}]
[{"$f":"IF($E111<>\"\",MAX($A$1:INDIRECT(CONCATENATE(\"$A$\",ROW()-1)))+1,\"\")","v":""},""]
[{"$f":"IF($E112<>\"\",MAX($A$1:INDIRECT(CONCATENATE(\"$A$\",ROW()-1)))+1,\"\")","v":38},"ME18.38",null,"1-Lever, 3-Way","No",{"$f":"F41","v":3}]
[{"$f":"IF($E113<>\"\",MAX($A$1:INDIRECT(CONCATENATE(\"$A$\",ROW()-1)))+1,\"\")","v":""},""]
[{"$f":"IF($E114<>\"\",MAX($A$1:INDIRECT(CONCATENATE(\"$A$\",ROW()-1)))+1,\"\")","v":""},"",null,"Power Skirting"]
[{"$f":"IF($E115<>\"\",MAX($A$1:INDIRECT(CONCATENATE(\"$A$\",ROW()-1)))+1,\"\")","v":""},""]
[{"$f":"IF($E116<>\"\",MAX($A$1:INDIRECT(CONCATENATE(\"$A$\",ROW()-1)))+1,\"\")","v":39},"ME18.39",null,"Double compartment power skirting","m",{"$f":"F49","v":16}]
[{"$f":"IF($E117<>\"\",MAX($A$1:INDIRECT(CONCATENATE(\"$A$\",ROW()-1)))+1,\"\")","v":""},""]
[{"$f":"IF($E118<>\"\",MAX($A$1:INDIRECT(CONCATENATE(\"$A$\",ROW()-1)))+1,\"\")","v":40},"ME18.40",null,"Double compartment power skirting: End Cap","No",{"$f":"F51","v":2}]
[]
[{"$f":"IF($E120<>\"\",MAX($A$1:INDIRECT(CONCATENATE(\"$A$\",ROW()-1)))+1,\"\")","v":41},{"$f":"IF(A120<>\"\",$A$3&A120,\"\")","v":"ME18.41"},null,"Double compartment power skirting: Internal Bend","No",{"$f":"F53","v":2}]
[{"$f":"IF($E121<>\"\",MAX($A$1:INDIRECT(CONCATENATE(\"$A$\",ROW()-1)))+1,\"\")","v":""},""]
[{"$f":"IF($E122<>\"\",MAX($A$1:INDIRECT(CONCATENATE(\"$A$\",ROW()-1)))+1,\"\")","v":""},"",null,"WIRING"]
[{"$f":"IF($E123<>\"\",MAX($A$1:INDIRECT(CONCATENATE(\"$A$\",ROW()-1)))+1,\"\")","v":""},""]
[{"$f":"IF($E124<>\"\",MAX($A$1:INDIRECT(CONCATENATE(\"$A$\",ROW()-1)))+1,\"\")","v":""},"",null,"Single core PVC insulated house wire"]
[{"$f":"IF($E125<>\"\",MAX($A$1:INDIRECT(CONCATENATE(\"$A$\",ROW()-1)))+1,\"\")","v":""},""]
[{"$f":"IF($E126<>\"\",MAX($A$1:INDIRECT(CONCATENATE(\"$A$\",ROW()-1)))+1,\"\")","v":42},"ME18.42",null,"1.5mm²","m",{"$f":"F59","v":25}]
[]
[{"$f":"IF($E128<>\"\",MAX($A$1:INDIRECT(CONCATENATE(\"$A$\",ROW()-1)))+1,\"\")","v":43},{"$f":"IF(A128<>\"\",$A$3&A128,\"\")","v":"ME18.43"},null,"2.5mm²","m",{"$f":"F61","v":3000}]
[{"$f":"IF($E129<>\"\",MAX($A$1:INDIRECT(CONCATENATE(\"$A$\",ROW()-1)))+1,\"\")","v":""},""]
[{"$f":"IF($E130<>\"\",MAX($A$1:INDIRECT(CONCATENATE(\"$A$\",ROW()-1)))+1,\"\")","v":44},"ME18.44",null,"4mm²","m",{"$f":"F63","v":400}]
[{"$f":"IF($E131<>\"\",MAX($A$1:INDIRECT(CONCATENATE(\"$A$\",ROW()-1)))+1,\"\")","v":""},""]
[{"$f":"IF($E132<>\"\",MAX($A$1:INDIRECT(CONCATENATE(\"$A$\",ROW()-1)))+1,\"\")","v":""},{"$f":"IF(A132<>\"\",$A$3&A132,\"\")","v":""},null,"Single core PVC insulated earth wire"]
[{"$f":"IF($E133<>\"\",MAX($A$1:INDIRECT(CONCATENATE(\"$A$\",ROW()-1)))+1,\"\")","v":""},{"$f":"IF(A133<>\"\",$A$3&A133,\"\")","v":""}]
[{"$f":"IF($E134<>\"\",MAX($A$1:INDIRECT(CONCATENATE(\"$A$\",ROW()-1)))+1,\"\")","v":45},{"$f":"IF(A134<>\"\",$A$3&A134,\"\")","v":"ME18.45"},null,"1.5mm²","m",{"$f":"F67","v":25}]
[]
[{"$f":"IF($E136<>\"\",MAX($A$1:INDIRECT(CONCATENATE(\"$A$\",ROW()-1)))+1,\"\")","v":46},{"$f":"IF(A136<>\"\",$A$3&A136,\"\")","v":"ME18.46"},null,"2.5mm²","m",{"$f":"F69","v":850}]
[{"$f":"IF($E137<>\"\",MAX($A$1:INDIRECT(CONCATENATE(\"$A$\",ROW()-1)))+1,\"\")","v":""},{"$f":"IF(A137<>\"\",$A$3&A137,\"\")","v":""}]
[{"$f":"IF($E138<>\"\",MAX($A$1:INDIRECT(CONCATENATE(\"$A$\",ROW()-1)))+1,\"\")","v":47},{"$f":"IF(A138<>\"\",$A$3&A138,\"\")","v":"ME18.47"},null,"uPVC sleeve class 6 piping","m",{"$f":"F71","v":1000}]
[{"$f":"IF($E139<>\"\",MAX($A$1:INDIRECT(CONCATENATE(\"$A$\",ROW()-1)))+1,\"\")","v":""},{"$f":"IF(A139<>\"\",$A$3&A139,\"\")","v":""}]
[{"$f":"IF($E140<>\"\",MAX($A$1:INDIRECT(CONCATENATE(\"$A$\",ROW()-1)))+1,\"\")","v":48},{"$f":"IF(A140<>\"\",$A$3&A140,\"\")","v":"ME18.48"},null,"Hot-dipped Galvanised Steel P9000 cable trunking","m",{"$f":"F73","v":200}]
[]
[null,null,null," Carried forward / …"]
[null,null,null," Brought forward / …"]
[]
[{"$f":"IF($E145<>\"\",MAX($A$1:INDIRECT(CONCATENATE(\"$A$\",ROW()-1)))+1,\"\")","v":""},{"$f":"IF(A145<>\"\",$A$3&A145,\"\")","v":""},null,"Other:-"]
[{"$f":"IF($E146<>\"\",MAX($A$1:INDIRECT(CONCATENATE(\"$A$\",ROW()-1)))+1,\"\")","v":""},""]
[{"$f":"IF($E147<>\"\",MAX($A$1:INDIRECT(CONCATENATE(\"$A$\",ROW()-1)))+1,\"\")","v":49},"ME18.49",null,"All other items not included above but which are nevertheless necessary to meet the Scope of Work and/or are required for the proper, safe and effective operation of the plant (Specify)","Sum","-"]
[{"$f":"IF($E148<>\"\",MAX($A$1:INDIRECT(CONCATENATE(\"$A$\",ROW()-1)))+1,\"\")","v":""},"",null,"……………………………………………….."]
[{"$f":"IF($E149<>\"\",MAX($A$1:INDIRECT(CONCATENATE(\"$A$\",ROW()-1)))+1,\"\")","v":""},"",null,"……………………………………………….."]
[{"$f":"IF($E150<>\"\",MAX($A$1:INDIRECT(CONCATENATE(\"$A$\",ROW()-1)))+1,\"\")","v":""},"",null,"……………………………………………….."]
[{"$f":"IF($E151<>\"\",MAX($A$1:INDIRECT(CONCATENATE(\"$A$\",ROW()-1)))+1,\"\")","v":""},"",null,"……………………………………………….."]
[]
[]
[]
[]
[]
[]
[]
[]
[]
[]
[]
[]
[]
[]
[]
[]
[]
[]
[]
[]
[]
[]
[]
[]
[]
[]
[]
[]
[]
[]
[]
[]
[]
[]
[]
[]
[]
[{"$f":"IF($E189<>\"\",MAX($A$1:INDIRECT(CONCATENATE(\"$A$\",ROW()-1)))+1,\"\")","v":""},""]
[{"$f":"IF($E190<>\"\",MAX($A$1:INDIRECT(CONCATENATE(\"$A$\",ROW()-1)))+1,\"\")","v":""},""]
[{"$f":"IF($E191<>\"\",MAX($A$1:INDIRECT(CONCATENATE(\"$A$\",ROW()-1)))+1,\"\")","v":""},""]
[{"$f":"IF($E192<>\"\",MAX($A$1:INDIRECT(CONCATENATE(\"$A$\",ROW()-1)))+1,\"\")","v":""},""]
[null,null,null,{"$f":"\" TOTAL SECTION \"&$A$3&\":\n Carried to Summary\"","v":" TOTAL SECTION ME18.:\n Carried to Summary"},null,null,"R"]

{"sheet":"ME19","index":30,"n_rows":98,"n_cols":8,"rows_kept":98,"cut":false,"hidden":false,"merged":[]}
["Item No","Item No","Chief Reference","Short Description","Unit","Quantity","Rate","Amount\n R             c"]
[]
["ME19.",null,null,{"$f":"\"SECTION \"&A3","v":"SECTION ME19."}]
[null,null,null,"M&E WORKS - PUMP STATION"]
[null,null,"PS 9.36 & PS 9.37","BUILDING ELECTRONICS"]
[{"$f":"IF($E6<>\"\",MAX($A$1:INDIRECT(CONCATENATE(\"$A$\",ROW()-1)))+1,\"\")","v":""},{"$f":"IF(A6<>\"\",$A$3&A6,\"\")","v":""}]
[{"$f":"IF($E7<>\"\",MAX($A$1:INDIRECT(CONCATENATE(\"$A$\",ROW()-1)))+1,\"\")","v":""},"",null,"Allow for all the costs and expenses in connection with the design, manufacture, routine testing, factory testing, supply, delivery, offloading and storage of the following materials and equipment:"]
[{"$f":"IF($E8<>\"\",MAX($A$1:INDIRECT(CONCATENATE(\"$A$\",ROW()-1)))+1,\"\")","v":""},""]
[{"$f":"IF($E9<>\"\",MAX($A$1:INDIRECT(CONCATENATE(\"$A$\",ROW()-1)))+1,\"\")","v":""},"",null,"INTRUDER DETECTION"]
[{"$f":"IF($E10<>\"\",MAX($A$1:INDIRECT(CONCATENATE(\"$A$\",ROW()-1)))+1,\"\")","v":""},""]
[{"$f":"IF($E11<>\"\",MAX($A$1:INDIRECT(CONCATENATE(\"$A$\",ROW()-1)))+1,\"\")","v":1},"ME19.1",null,"Alarm Intruder Panel","No",1]
[]
[{"$f":"IF($E13<>\"\",MAX($A$1:INDIRECT(CONCATENATE(\"$A$\",ROW()-1)))+1,\"\")","v":2},{"$f":"IF(A13<>\"\",$A$3&A13,\"\")","v":"ME19.2"},null,"Long Range PIR Detector, 90° Wide","No",16]
[{"$f":"IF($E14<>\"\",MAX($A$1:INDIRECT(CONCATENATE(\"$A$\",ROW()-1)))+1,\"\")","v":""},""]
[{"$f":"IF($E15<>\"\",MAX($A$1:INDIRECT(CONCATENATE(\"$A$\",ROW()-1)))+1,\"\")","v":3},"ME19.3",null,"Magnetic Door Monitor","No",8]
[{"$f":"IF($E16<>\"\",MAX($A$1:INDIRECT(CONCATENATE(\"$A$\",ROW()-1)))+1,\"\")","v":""},""]
[{"$f":"IF($E17<>\"\",MAX($A$1:INDIRECT(CONCATENATE(\"$A$\",ROW()-1)))+1,\"\")","v":4},"ME19.4",null,"Intruder Detection Keypad","No",1]
[{"$f":"IF($E18<>\"\",MAX($A$1:INDIRECT(CONCATENATE(\"$A$\",ROW()-1)))+1,\"\")","v":""},""]
[{"$f":"IF($E19<>\"\",MAX($A$1:INDIRECT(CONCATENATE(\"$A$\",ROW()-1)))+1,\"\")","v":5},"ME19.5",null,"Intruder Detection Loop Cable","m",1000]
[]
[{"$f":"IF($E21<>\"\",MAX($A$1:INDIRECT(CONCATENATE(\"$A$\",ROW()-1)))+1,\"\")","v":""},{"$f":"IF(A21<>\"\",$A$3&A21,\"\")","v":""},null,"FIRE DETECTION"]
[{"$f":"IF($E22<>\"\",MAX($A$1:INDIRECT(CONCATENATE(\"$A$\",ROW()-1)))+1,\"\")","v":""},""]
[{"$f":"IF($E23<>\"\",MAX($A$1:INDIRECT(CONCATENATE(\"$A$\",ROW()-1)))+1,\"\")","v":6},"ME19.6",null,"Fire Detection Panel","No",1]
[{"$f":"IF($E24<>\"\",MAX($A$1:INDIRECT(CONCATENATE(\"$A$\",ROW()-1)))+1,\"\")","v":""},""]
[{"$f":"IF($E25<>\"\",MAX($A$1:INDIRECT(CONCATENATE(\"$A$\",ROW()-1)))+1,\"\")","v":7},"ME19.7",null,"Fire Detection Loop Cable","m",1000]
[{"$f":"IF($E26<>\"\",MAX($A$1:INDIRECT(CONCATENATE(\"$A$\",ROW()-1)))+1,\"\")","v":""},""]
[{"$f":"IF($E27<>\"\",MAX($A$1:INDIRECT(CONCATENATE(\"$A$\",ROW()-1)))+1,\"\")","v":8},"ME19.8",null,"Optical Smoke Detector","No",10]
[{"$f":"IF($E28<>\"\",MAX($A$1:INDIRECT(CONCATENATE(\"$A$\",ROW()-1)))+1,\"\")","v":""},""]
[{"$f":"IF($E29<>\"\",MAX($A$1:INDIRECT(CONCATENATE(\"$A$\",ROW()-1)))+1,\"\")","v":9},"ME19.9",null,"Laser Smoke Detector and Reflector","No",2]
[{"$f":"IF($E30<>\"\",MAX($A$1:INDIRECT(CONCATENATE(\"$A$\",ROW()-1)))+1,\"\")","v":""},""]
[{"$f":"IF($E31<>\"\",MAX($A$1:INDIRECT(CONCATENATE(\"$A$\",ROW()-1)))+1,\"\")","v":10},"ME19.10",null,"Break Glass Unit","No",6]
[{"$f":"IF($E32<>\"\",MAX($A$1:INDIRECT(CONCATENATE(\"$A$\",ROW()-1)))+1,\"\")","v":""},""]
[{"$f":"IF($E33<>\"\",MAX($A$1:INDIRECT(CONCATENATE(\"$A$\",ROW()-1)))+1,\"\")","v":""},"",null,"ALARM NOTIFICATION"]
[{"$f":"IF($E34<>\"\",MAX($A$1:INDIRECT(CONCATENATE(\"$A$\",ROW()-1)))+1,\"\")","v":""},""]
[{"$f":"IF($E35<>\"\",MAX($A$1:INDIRECT(CONCATENATE(\"$A$\",ROW()-1)))+1,\"\")","v":11},"ME19.11",null,"Strobe Lights","No",2]
[{"$f":"IF($E36<>\"\",MAX($A$1:INDIRECT(CONCATENATE(\"$A$\",ROW()-1)))+1,\"\")","v":""},""]
[{"$f":"IF($E37<>\"\",MAX($A$1:INDIRECT(CONCATENATE(\"$A$\",ROW()-1)))+1,\"\")","v":12},"ME19.12",null,"Siren/Strobe Light Combination","No",1]
[{"$f":"IF($E38<>\"\",MAX($A$1:INDIRECT(CONCATENATE(\"$A$\",ROW()-1)))+1,\"\")","v":""},""]
[{"$f":"IF($E39<>\"\",MAX($A$1:INDIRECT(CONCATENATE(\"$A$\",ROW()-1)))+1,\"\")","v":""},"",null,"Allow for all costs and expenses in connection with the Site installation, programming, configuring, simulation, testing and commissioning of the following:-"]
[{"$f":"IF($E40<>\"\",MAX($A$1:INDIRECT(CONCATENATE(\"$A$\",ROW()-1)))+1,\"\")","v":""},""]
[{"$f":"IF($E41<>\"\",MAX($A$1:INDIRECT(CONCATENATE(\"$A$\",ROW()-1)))+1,\"\")","v":13},"ME19.13",null,{"$f":"\"All materials and equipment summarized in Section \"&$A$3&\" complete\"","v":"All materials and equipment summarized in Section ME19. complete"},"Sum","-"]
[]
[]
[]
[]
[]
[null,null,null," Carried forward / …"]
[null,null,null," Brought forward / …"]
[]
[{"$f":"IF($E50<>\"\",MAX($A$1:INDIRECT(CONCATENATE(\"$A$\",ROW()-1)))+1,\"\")","v":""},{"$f":"IF(A50<>\"\",$A$3&A50,\"\")","v":""},null,"Other:-"]
[{"$f":"IF($E51<>\"\",MAX($A$1:INDIRECT(CONCATENATE(\"$A$\",ROW()-1)))+1,\"\")","v":""},""]
[{"$f":"IF($E52<>\"\",MAX($A$1:INDIRECT(CONCATENATE(\"$A$\",ROW()-1)))+1,\"\")","v":14},"ME19.14",null,"All other items not included above but which are nevertheless necessary to meet the Scope of Work and/or are required for the proper, safe and effective operation of the plant (Specify)","Sum","-"]
[{"$f":"IF($E53<>\"\",MAX($A$1:INDIRECT(CONCATENATE(\"$A$\",ROW()-1)))+1,\"\")","v":""},"",null,"……………………………………………….."]
[{"$f":"IF($E54<>\"\",MAX($A$1:INDIRECT(CONCATENATE(\"$A$\",ROW()-1)))+1,\"\")","v":""},"",null,"……………………………………………….."]
[{"$f":"IF($E55<>\"\",MAX($A$1:INDIRECT(CONCATENATE(\"$A$\",ROW()-1)))+1,\"\")","v":""},"",null,"……………………………………………….."]
[{"$f":"IF($E56<>\"\",MAX($A$1:INDIRECT(CONCATENATE(\"$A$\",ROW()-1)))+1,\"\")","v":""},"",null,"……………………………………………….."]
[]
[]
[]
[]
[]
[]
[]
[]
[]
[]
[]
[]
[]
[]
[]
[]
[]
[]
[]
[]
[]
[]
[]
[]
[]
[]
[]
[]
[]
[]
[]
[]
[]
[]
[]
[]
[]
[{"$f":"IF($E94<>\"\",MAX($A$1:INDIRECT(CONCATENATE(\"$A$\",ROW()-1)))+1,\"\")","v":""},""]
[{"$f":"IF($E95<>\"\",MAX($A$1:INDIRECT(CONCATENATE(\"$A$\",ROW()-1)))+1,\"\")","v":""},""]
[{"$f":"IF($E96<>\"\",MAX($A$1:INDIRECT(CONCATENATE(\"$A$\",ROW()-1)))+1,\"\")","v":""},""]
[{"$f":"IF($E97<>\"\",MAX($A$1:INDIRECT(CONCATENATE(\"$A$\",ROW()-1)))+1,\"\")","v":""},""]
[null,null,null,{"$f":"\" TOTAL SECTION \"&$A$3&\":\n Carried to Summary\"","v":" TOTAL SECTION ME19.:\n Carried to Summary"},null,null,"R"]

{"sheet":"ME20","index":31,"n_rows":38,"n_cols":8,"rows_kept":38,"cut":false,"hidden":false,"merged":[]}
["Item No","Item No","Chief Reference","Short Description","Unit","Quantity","Rate","Amount\n R             c"]
[]
["ME20.",null,null,{"$f":"\"SECTION \"&A3","v":"SECTION ME20."}]
[null,null,null,"M&E WORKS - PUMP STATION"]
[null,null,null,"LIFTING & ACCESS EQUIPMENT"]
[]
[null,null,null,"Allow for all the costs and expenses in connection with the design, manufacture, painting, factory testing and supplying of the following materials and equipment:"]
[]
[{"$f":"IF($E9<>\"\",MAX($A$1:INDIRECT(CONCATENATE(\"$A$\",ROW()-1)))+1,\"\")","v":1},{"$f":"IF(A9<>\"\",$A$3&A9,\"\")","v":"ME20.1"},"PS 9.14","Cat ladder for access to travelling crane","No",1]
[{"$f":"IF($E10<>\"\",MAX($A$1:INDIRECT(CONCATENATE(\"$A$\",ROW()-1)))+1,\"\")","v":""},{"$f":"IF(A10<>\"\",$A$3&A10,\"\")","v":""}]
[{"$f":"IF($E11<>\"\",MAX($A$1:INDIRECT(CONCATENATE(\"$A$\",ROW()-1)))+1,\"\")","v":2},"ME20.2","PS 9.14","Cat ladder for access to travelling crane service platform","No",4," "]
[{"$f":"IF($E12<>\"\",MAX($A$1:INDIRECT(CONCATENATE(\"$A$\",ROW()-1)))+1,\"\")","v":""},"",null,null,null,null,null," "]
[{"$f":"IF($E13<>\"\",MAX($A$1:INDIRECT(CONCATENATE(\"$A$\",ROW()-1)))+1,\"\")","v":3},{"$f":"IF(A13<>\"\",$A$3&A13,\"\")","v":"ME20.3"},"PS 9.14","Stainless Steel Grade 304 cat ladder for access to roof of electrical rooms","No",1]
[{"$f":"IF($E14<>\"\",MAX($A$1:INDIRECT(CONCATENATE(\"$A$\",ROW()-1)))+1,\"\")","v":""},{"$f":"IF(A14<>\"\",$A$3&A14,\"\")","v":""}]
[{"$f":"IF($E15<>\"\",MAX($A$1:INDIRECT(CONCATENATE(\"$A$\",ROW()-1)))+1,\"\")","v":4},{"$f":"IF(A15<>\"\",$A$3&A15,\"\")","v":"ME20.4"},"PS 9.14","Access platform for discharge isolation valve to allow easy manual operation","No",4]
[{"$f":"IF($E16<>\"\",MAX($A$1:INDIRECT(CONCATENATE(\"$A$\",ROW()-1)))+1,\"\")","v":""},{"$f":"IF(A16<>\"\",$A$3&A16,\"\")","v":""}]
[{"$f":"IF($E17<>\"\",MAX($A$1:INDIRECT(CONCATENATE(\"$A$\",ROW()-1)))+1,\"\")","v":5},{"$f":"IF(A17<>\"\",$A$3&A17,\"\")","v":"ME20.5"},"PS 9.13","Overhead travelling crane","No",1]
[{"$f":"IF($E18<>\"\",MAX($A$1:INDIRECT(CONCATENATE(\"$A$\",ROW()-1)))+1,\"\")","v":""},""]
[{"$f":"IF($E19<>\"\",MAX($A$1:INDIRECT(CONCATENATE(\"$A$\",ROW()-1)))+1,\"\")","v":""},"",null,"Allow for all the costs and expenses in connection with the delivery, offloading and storage of the following:"]
[{"$f":"IF($E20<>\"\",MAX($A$1:INDIRECT(CONCATENATE(\"$A$\",ROW()-1)))+1,\"\")","v":""},""]
[{"$f":"IF($E21<>\"\",MAX($A$1:INDIRECT(CONCATENATE(\"$A$\",ROW()-1)))+1,\"\")","v":6},"ME20.6",null,{"$f":"\"All materials and equipment summarized in \"&$D$3&\" complete\"","v":"All materials and equipment summarized in SECTION ME20. complete"},"Sum","-","-"]
[{"$f":"IF($E22<>\"\",MAX($A$1:INDIRECT(CONCATENATE(\"$A$\",ROW()-1)))+1,\"\")","v":""},""]
[{"$f":"IF($E23<>\"\",MAX($A$1:INDIRECT(CONCATENATE(\"$A$\",ROW()-1)))+1,\"\")","v":""},"",null,"Allow for all costs and expenses in connection with the Site installation of the following:-"]
[{"$f":"IF($E24<>\"\",MAX($A$1:INDIRECT(CONCATENATE(\"$A$\",ROW()-1)))+1,\"\")","v":""},""]
[{"$f":"IF($E25<>\"\",MAX($A$1:INDIRECT(CONCATENATE(\"$A$\",ROW()-1)))+1,\"\")","v":7},"ME20.7",null,{"$f":"\"All materials and equipment summarized in \"&$D$3&\" complete\"","v":"All materials and equipment summarized in SECTION ME20. complete"},"Sum","-","-"]
[{"$f":"IF($E26<>\"\",MAX($A$1:INDIRECT(CONCATENATE(\"$A$\",ROW()-1)))+1,\"\")","v":""},""]
[{"$f":"IF($E27<>\"\",MAX($A$1:INDIRECT(CONCATENATE(\"$A$\",ROW()-1)))+1,\"\")","v":""},"",null,"Other:-"]
[{"$f":"IF($E28<>\"\",MAX($A$1:INDIRECT(CONCATENATE(\"$A$\",ROW()-1)))+1,\"\")","v":""},""]
[{"$f":"IF($E29<>\"\",MAX($A$1:INDIRECT(CONCATENATE(\"$A$\",ROW()-1)))+1,\"\")","v":8},"ME20.8",null,"All other items not included above but which are nevertheless necessary to meet the Scope of Work and/or are required for the proper, safe and effective operation of the plant (Specify)","Sum","-","-"]
[{"$f":"IF($E30<>\"\",MAX($A$1:INDIRECT(CONCATENATE(\"$A$\",ROW()-1)))+1,\"\")","v":""},"",null,"……………………………………………….."]
[null,null,null,"……………………………………………….."]
[null,null,null,"……………………………………………….."]
[null,null,null,"……………………………………………….."]
[]
[]
[]
[{"$f":"IF($E37<>\"\",MAX($A$1:INDIRECT(CONCATENATE(\"$A$\",ROW()-1)))+1,\"\")","v":""},""]
[null,null,null,{"$f":"\" TOTAL SECTION \"&$A$3&\":\n Carried to Summary\"","v":" TOTAL SECTION ME20.:\n Carried to Summary"},null,null,"R"]

{"sheet":"ME21","index":32,"n_rows":50,"n_cols":8,"rows_kept":50,"cut":false,"hidden":false,"merged":[]}
["Item No","Item No","Chief Reference","Short Description","Unit","Quantity","Rate","Amount\n R             c"]
[]
["ME21.",null,null,{"$f":"\"SECTION \"&A3","v":"SECTION ME21."}]
[null,null,null,"M&E WORKS - PUMP STATION"]
[null,null,null,"SPARES"]
[]
[null,null,null,"Allow for all costs and expenses in connection with the following items:-"]
[{"$f":"IF($E8<>\"\",MAX($A$1:INDIRECT(CONCATENATE(\"$A$\",ROW()-1)))+1,\"\")","v":""}]
[{"$f":"IF($E9<>\"\",MAX($A$1:INDIRECT(CONCATENATE(\"$A$\",ROW()-1)))+1,\"\")","v":1},{"$f":"IF(A9<>\"\",$A$3&A9,\"\")","v":"ME21.1"},null,"Pumpset complete with motor, coupling and baseframe","No",1]
[{"$f":"IF($E10<>\"\",MAX($A$1:INDIRECT(CONCATENATE(\"$A$\",ROW()-1)))+1,\"\")","v":""},""]
[{"$f":"IF($E11<>\"\",MAX($A$1:INDIRECT(CONCATENATE(\"$A$\",ROW()-1)))+1,\"\")","v":2},"ME21.2","PS 9.5","DN600 eccentric axis butterfly valve (PN10)","No",1]
[{"$f":"IF($E12<>\"\",MAX($A$1:INDIRECT(CONCATENATE(\"$A$\",ROW()-1)))+1,\"\")","v":""},{"$f":"IF(A12<>\"\",$A$3&A12,\"\")","v":""}]
[{"$f":"IF($E13<>\"\",MAX($A$1:INDIRECT(CONCATENATE(\"$A$\",ROW()-1)))+1,\"\")","v":3},{"$f":"IF(A13<>\"\",$A$3&A13,\"\")","v":"ME21.3"},"PS 9.5","DN400 eccentric axis butterfly valve (PN63)","No",1]
[{"$f":"IF($E14<>\"\",MAX($A$1:INDIRECT(CONCATENATE(\"$A$\",ROW()-1)))+1,\"\")","v":""},""]
[{"$f":"IF($E15<>\"\",MAX($A$1:INDIRECT(CONCATENATE(\"$A$\",ROW()-1)))+1,\"\")","v":4},"ME21.4","PS 9.6","DN400 metal seated wedge gate valve (PN63)","No",1]
[{"$f":"IF($E16<>\"\",MAX($A$1:INDIRECT(CONCATENATE(\"$A$\",ROW()-1)))+1,\"\")","v":""},{"$f":"IF(A16<>\"\",$A$3&A16,\"\")","v":""}]
[{"$f":"IF($E17<>\"\",MAX($A$1:INDIRECT(CONCATENATE(\"$A$\",ROW()-1)))+1,\"\")","v":5},{"$f":"IF(A17<>\"\",$A$3&A17,\"\")","v":"ME21.5"},"PS 9.5","DN500 eccentric axis butterfly valve (PN63)","No",1]
[{"$f":"IF($E18<>\"\",MAX($A$1:INDIRECT(CONCATENATE(\"$A$\",ROW()-1)))+1,\"\")","v":""},""]
[{"$f":"IF($E19<>\"\",MAX($A$1:INDIRECT(CONCATENATE(\"$A$\",ROW()-1)))+1,\"\")","v":6},"ME21.6","PS 9.15","Filter set for main ventilation system","No",2]
[{"$f":"IF($E20<>\"\",MAX($A$1:INDIRECT(CONCATENATE(\"$A$\",ROW()-1)))+1,\"\")","v":""},""]
[{"$f":"IF($E21<>\"\",MAX($A$1:INDIRECT(CONCATENATE(\"$A$\",ROW()-1)))+1,\"\")","v":7},"ME21.7","PS 9.15","Filter set for MV switchgear room louvre with fan","No",2]
[{"$f":"IF($E22<>\"\",MAX($A$1:INDIRECT(CONCATENATE(\"$A$\",ROW()-1)))+1,\"\")","v":""},""]
[{"$f":"IF($E23<>\"\",MAX($A$1:INDIRECT(CONCATENATE(\"$A$\",ROW()-1)))+1,\"\")","v":8},"ME21.8","PS 9.15","Filter set for cable gallery inlet louvre","No",1]
[{"$f":"IF($E24<>\"\",MAX($A$1:INDIRECT(CONCATENATE(\"$A$\",ROW()-1)))+1,\"\")","v":""},""]
[{"$f":"IF($E25<>\"\",MAX($A$1:INDIRECT(CONCATENATE(\"$A$\",ROW()-1)))+1,\"\")","v":9},"ME21.9","PS 9.15","Filter set for cable gallery outlet louvre","No",1]
[{"$f":"IF($E26<>\"\",MAX($A$1:INDIRECT(CONCATENATE(\"$A$\",ROW()-1)))+1,\"\")","v":""},""]
[{"$f":"IF($E27<>\"\",MAX($A$1:INDIRECT(CONCATENATE(\"$A$\",ROW()-1)))+1,\"\")","v":10},"ME21.10","PS 9.7","Spares for plunger valve","Sum","-"]
[]
[]
[]
[]
[]
[]
[]
[]
[]
[]
[]
[]
[]
[]
[]
[]
[]
[]
[]
[]
[{"$f":"IF($E48<>\"\",MAX($A$1:INDIRECT(CONCATENATE(\"$A$\",ROW()-1)))+1,\"\")","v":""},""]
[{"$f":"IF($E49<>\"\",MAX($A$1:INDIRECT(CONCATENATE(\"$A$\",ROW()-1)))+1,\"\")","v":""},""]
[null,null,null,{"$f":"\" TOTAL SECTION \"&$A$3&\":\n Carried to Summary\"","v":" TOTAL SECTION ME21.:\n Carried to Summary"},null,null,"R"]

{"sheet":"ME22","index":33,"n_rows":108,"n_cols":10,"rows_kept":108,"cut":false,"hidden":false,"merged":[]}
["Item No","Item No","Chief Reference","Short Description","Unit","Quantity","Rate","Amount\n R             c"]
[]
["ME22.",null,null,{"$f":"\"SECTION \"&A3","v":"SECTION ME22."}]
[null,null,null,"M&E WORKS - PUMP STATION"]
[null,null,null,"SUNDRIES"]
[]
[null,null,null,"Allow for all costs and expenses in connnection with the following items:"]
[]
[{"$f":"IF($E9<>\"\",MAX($A$1:INDIRECT(CONCATENATE(\"$A$\",ROW()-1)))+1,\"\")","v":1},{"$f":"IF(A9<>\"\",$A$3&A9,\"\")","v":"ME22.1"},"PS 5.5","Hazop Study","Sum","-","-"]
[{"$f":"IF($E10<>\"\",MAX($A$1:INDIRECT(CONCATENATE(\"$A$\",ROW()-1)))+1,\"\")","v":""},""]
[{"$f":"IF($E11<>\"\",MAX($A$1:INDIRECT(CONCATENATE(\"$A$\",ROW()-1)))+1,\"\")","v":2},{"$f":"IF(A11<>\"\",$A$3&A11,\"\")","v":"ME22.2"},"PS 6","Submission of Contractor's Documents","Sum","-","-"]
[]
[{"$f":"IF($E13<>\"\",MAX($A$1:INDIRECT(CONCATENATE(\"$A$\",ROW()-1)))+1,\"\")","v":3},"ME22.3","PS 6.2","Providing 2 draft copies of the Installation, Operation and Maintenance Manual prior to commissioning of the Works; until acceptance","Sum","-","-"]
[{"$f":"IF($E14<>\"\",MAX($A$1:INDIRECT(CONCATENATE(\"$A$\",ROW()-1)))+1,\"\")","v":""},""]
[{"$f":"IF($E15<>\"\",MAX($A$1:INDIRECT(CONCATENATE(\"$A$\",ROW()-1)))+1,\"\")","v":4},"ME22.4","PS 6.2","Providing 6 final copies of the Installation, Operation and Maintenance Manual prior to the Issue of the Taking-Over Certificate","Sum","-","-"]
[{"$f":"IF($E16<>\"\",MAX($A$1:INDIRECT(CONCATENATE(\"$A$\",ROW()-1)))+1,\"\")","v":""},""]
[{"$f":"IF($E17<>\"\",MAX($A$1:INDIRECT(CONCATENATE(\"$A$\",ROW()-1)))+1,\"\")","v":5},"ME22.5",null,"Operating instructions and signage, as specified","Sum","-","-"]
[{"$f":"IF($E18<>\"\",MAX($A$1:INDIRECT(CONCATENATE(\"$A$\",ROW()-1)))+1,\"\")","v":""},""]
[{"$f":"IF($E19<>\"\",MAX($A$1:INDIRECT(CONCATENATE(\"$A$\",ROW()-1)))+1,\"\")","v":6},"ME22.6","PS 9.4","Factory inspection of pumps","Sum","-","-"]
[{"$f":"IF($E20<>\"\",MAX($A$1:INDIRECT(CONCATENATE(\"$A$\",ROW()-1)))+1,\"\")","v":""},""]
[{"$f":"IF($E21<>\"\",MAX($A$1:INDIRECT(CONCATENATE(\"$A$\",ROW()-1)))+1,\"\")","v":7},"ME22.7","PS 9.4","Witnessed testing for pumps, including all travel and accommodation costs for 2 Engineers and 2 persons from Employer; and test report ","Sum","-","-"]
[{"$f":"IF($E22<>\"\",MAX($A$1:INDIRECT(CONCATENATE(\"$A$\",ROW()-1)))+1,\"\")","v":""},""]
[{"$f":"IF($E23<>\"\",MAX($A$1:INDIRECT(CONCATENATE(\"$A$\",ROW()-1)))+1,\"\")","v":8},"ME22.8","PS 9.7","Witnessed testing for plunger valves, including all travel and accommodation costs for 1 Engineer and 1 Employer; and test certificate","Sum","-","-"]
[{"$f":"IF($E24<>\"\",MAX($A$1:INDIRECT(CONCATENATE(\"$A$\",ROW()-1)))+1,\"\")","v":""},""]
[{"$f":"IF($E25<>\"\",MAX($A$1:INDIRECT(CONCATENATE(\"$A$\",ROW()-1)))+1,\"\")","v":9},"ME22.9","PS 9.4","Factory inspection of butterfly valves","Sum","-","-"]
[{"$f":"IF($E26<>\"\",MAX($A$1:INDIRECT(CONCATENATE(\"$A$\",ROW()-1)))+1,\"\")","v":""},""]
[{"$f":"IF($E27<>\"\",MAX($A$1:INDIRECT(CONCATENATE(\"$A$\",ROW()-1)))+1,\"\")","v":10},"ME22.10","PS 9.4","Witnessed testing for butterfly valves, including all travel and accommodation costs for 2 Engineers and 2 Employers; and test certificate","Sum","-","-"]
[{"$f":"IF($E28<>\"\",MAX($A$1:INDIRECT(CONCATENATE(\"$A$\",ROW()-1)))+1,\"\")","v":""},""]
[{"$f":"IF($E29<>\"\",MAX($A$1:INDIRECT(CONCATENATE(\"$A$\",ROW()-1)))+1,\"\")","v":11},"ME22.11","PS 9.5","Factory inspection of gate valves","Sum","-","-"]
[]
[{"$f":"IF($E31<>\"\",MAX($A$1:INDIRECT(CONCATENATE(\"$A$\",ROW()-1)))+1,\"\")","v":12},{"$f":"IF(A31<>\"\",$A$3&A31,\"\")","v":"ME22.12"},"PS 9.5","Witnessed testing for gate valves, including all travel and accommodation costs for 1 Engineers and 1 Employer; and test certificate","Sum","-","-"]
[{"$f":"IF($E32<>\"\",MAX($A$1:INDIRECT(CONCATENATE(\"$A$\",ROW()-1)))+1,\"\")","v":""},{"$f":"IF(A32<>\"\",$A$3&A32,\"\")","v":""}]
[{"$f":"IF($E33<>\"\",MAX($A$1:INDIRECT(CONCATENATE(\"$A$\",ROW()-1)))+1,\"\")","v":13},{"$f":"IF(A33<>\"\",$A$3&A33,\"\")","v":"ME22.13"},"PS 9.8","Factory inspection of nozzle check valve","Sum","-","-"]
[]
[]
[]
[]
[]
[null,null,null," Carried forward / …"]
[null,null,null," Brought forward / …"]
[]
[{"$f":"IF($E42<>\"\",MAX($A$1:INDIRECT(CONCATENATE(\"$A$\",ROW()-1)))+1,\"\")","v":14},"ME22.14","PS 9.8","Witnessed testing for nozzle check valve, including all travel and accommodation costs for 1 Engineer and 1 Employer; and test certificate","Sum","-","-"]
[]
[{"$f":"IF($E44<>\"\",MAX($A$1:INDIRECT(CONCATENATE(\"$A$\",ROW()-1)))+1,\"\")","v":15},"ME22.15",null,"Factory acceptance tesing of electric motors (including temperature rise test) including all travel and accommodation costs for 1 Engineers and 1 person from Employer; and test certificate","Sum","-","-"]
[{"$f":"IF($E45<>\"\",MAX($A$1:INDIRECT(CONCATENATE(\"$A$\",ROW()-1)))+1,\"\")","v":""},""]
[{"$f":"IF($E46<>\"\",MAX($A$1:INDIRECT(CONCATENATE(\"$A$\",ROW()-1)))+1,\"\")","v":16},"ME22.16","PS 9.9","Factory inspections of pipework  (six occasions)","Sum","-","-"," "," "," "]
[{"$f":"IF($E47<>\"\",MAX($A$1:INDIRECT(CONCATENATE(\"$A$\",ROW()-1)))+1,\"\")","v":""},""]
[{"$f":"IF($E48<>\"\",MAX($A$1:INDIRECT(CONCATENATE(\"$A$\",ROW()-1)))+1,\"\")","v":17},"ME22.17","PS 9.10","Inspection of couplings and flange adaptors for compliance prior to payment","Sum","-","-"]
[{"$f":"IF($E49<>\"\",MAX($A$1:INDIRECT(CONCATENATE(\"$A$\",ROW()-1)))+1,\"\")","v":""},""]
[{"$f":"IF($E50<>\"\",MAX($A$1:INDIRECT(CONCATENATE(\"$A$\",ROW()-1)))+1,\"\")","v":18},"ME22.18","PS 9.11","Inspection of pipework supports for compliance prior to payment","Sum","-","-"]
[{"$f":"IF($E51<>\"\",MAX($A$1:INDIRECT(CONCATENATE(\"$A$\",ROW()-1)))+1,\"\")","v":""},""]
[{"$f":"IF($E52<>\"\",MAX($A$1:INDIRECT(CONCATENATE(\"$A$\",ROW()-1)))+1,\"\")","v":19},"ME22.19","PS 9.12","Calibration and test certificates for ultrasonic flow meter unit after installation","Sum","-","-"]
[{"$f":"IF($E53<>\"\",MAX($A$1:INDIRECT(CONCATENATE(\"$A$\",ROW()-1)))+1,\"\")","v":""},""]
[{"$f":"IF($E54<>\"\",MAX($A$1:INDIRECT(CONCATENATE(\"$A$\",ROW()-1)))+1,\"\")","v":20},"ME22.20","PS 9.13","Load test certificate for overhead travelling crane","Sum","-","-"]
[]
[{"$f":"IF($E56<>\"\",MAX($A$1:INDIRECT(CONCATENATE(\"$A$\",ROW()-1)))+1,\"\")","v":21},{"$f":"IF(A56<>\"\",$A$3&A56,\"\")","v":"ME22.21"},"PS 12.19","Factory acceptance testing of MV Switchgear, including all travel and accommodation costs for 2 Engineers and 2 persons from Employers, and test report ","Sum","-","-"]
[{"$f":"IF($E57<>\"\",MAX($A$1:INDIRECT(CONCATENATE(\"$A$\",ROW()-1)))+1,\"\")","v":""},{"$f":"IF(A57<>\"\",$A$3&A57,\"\")","v":""}]
[{"$f":"IF($E58<>\"\",MAX($A$1:INDIRECT(CONCATENATE(\"$A$\",ROW()-1)))+1,\"\")","v":22},{"$f":"IF(A58<>\"\",$A$3&A58,\"\")","v":"ME22.22"},null,"Factory acceptance testing of transformers including all travel and accommodation costs for 1 Engineers and 1 person from Employer, and test report ","Sum","-","-"]
[{"$f":"IF($E59<>\"\",MAX($A$1:INDIRECT(CONCATENATE(\"$A$\",ROW()-1)))+1,\"\")","v":""},""]
[{"$f":"IF($E60<>\"\",MAX($A$1:INDIRECT(CONCATENATE(\"$A$\",ROW()-1)))+1,\"\")","v":23},"ME22.23",null,"Factory acceptance testing of LV MCC  including all travel and accommodation costs for 1 Engineer and 1 person from Employer and test report ","Sum","-","-"]
[{"$f":"IF($E61<>\"\",MAX($A$1:INDIRECT(CONCATENATE(\"$A$\",ROW()-1)))+1,\"\")","v":""},""]
[{"$f":"IF($E62<>\"\",MAX($A$1:INDIRECT(CONCATENATE(\"$A$\",ROW()-1)))+1,\"\")","v":24},"ME22.24",null,"Factory acceptance testing including simulation of Control System including all travel and accommodation costs for 2 Engineers and 2 persons from Employer and test report ","Sum","-","-"]
[]
[{"$f":"IF($E64<>\"\",MAX($A$1:INDIRECT(CONCATENATE(\"$A$\",ROW()-1)))+1,\"\")","v":25},"ME22.25",null,"Provision of all test certificates and certificate of compliance in terms of the Code of Practice for Wiring of Premises (for each MCC and DB)","Sum","-","-"]
[]
[]
[]
[null,null,null," Carried forward / …"]
[null,null,null," Brought forward / …"]
[{"$f":"IF($E70<>\"\",MAX($A$1:INDIRECT(CONCATENATE(\"$A$\",ROW()-1)))+1,\"\")","v":""},""]
[{"$f":"IF($E71<>\"\",MAX($A$1:INDIRECT(CONCATENATE(\"$A$\",ROW()-1)))+1,\"\")","v":26},"ME22.26","PS 7","Checking, starting up, pre- commissioning testing and commissioning of the Works; including reports","Sum","-","-"]
[{"$f":"IF($E72<>\"\",MAX($A$1:INDIRECT(CONCATENATE(\"$A$\",ROW()-1)))+1,\"\")","v":""},""]
[{"$f":"IF($E73<>\"\",MAX($A$1:INDIRECT(CONCATENATE(\"$A$\",ROW()-1)))+1,\"\")","v":27},"ME22.27","PS 7","Performance Acceptance Testing","Sum","-","-"]
[{"$f":"IF($E74<>\"\",MAX($A$1:INDIRECT(CONCATENATE(\"$A$\",ROW()-1)))+1,\"\")","v":""},""]
[{"$f":"IF($E75<>\"\",MAX($A$1:INDIRECT(CONCATENATE(\"$A$\",ROW()-1)))+1,\"\")","v":28},"ME22.28","PS 7","Trial Operation Period","Sum","-","-"]
[{"$f":"IF($E76<>\"\",MAX($A$1:INDIRECT(CONCATENATE(\"$A$\",ROW()-1)))+1,\"\")","v":""},""]
[{"$f":"IF($E77<>\"\",MAX($A$1:INDIRECT(CONCATENATE(\"$A$\",ROW()-1)))+1,\"\")","v":29},"ME22.29","PS 7","Operational and Maintenance Training, including certification","Sum","-","-"]
[{"$f":"IF($E78<>\"\",MAX($A$1:INDIRECT(CONCATENATE(\"$A$\",ROW()-1)))+1,\"\")","v":""},""]
[{"$f":"IF($E79<>\"\",MAX($A$1:INDIRECT(CONCATENATE(\"$A$\",ROW()-1)))+1,\"\")","v":30},"ME22.30","PS 7","Tuition","Sum","-","-"]
[{"$f":"IF($E80<>\"\",MAX($A$1:INDIRECT(CONCATENATE(\"$A$\",ROW()-1)))+1,\"\")","v":""},""]
[{"$f":"IF($E81<>\"\",MAX($A$1:INDIRECT(CONCATENATE(\"$A$\",ROW()-1)))+1,\"\")","v":31},"ME22.31","PS 7","Performing the specified duties during the Defects Notification Period","Sum","-","-"]
[{"$f":"IF($E82<>\"\",MAX($A$1:INDIRECT(CONCATENATE(\"$A$\",ROW()-1)))+1,\"\")","v":""},""]
[{"$f":"IF($E83<>\"\",MAX($A$1:INDIRECT(CONCATENATE(\"$A$\",ROW()-1)))+1,\"\")","v":32},"ME22.32","PS 9.15","Performing routine maintenance of pump station during Defects Notification Period, over and above duties already included as part of the Defects Notification Period.","Month",12]
[{"$f":"IF($E84<>\"\",MAX($A$1:INDIRECT(CONCATENATE(\"$A$\",ROW()-1)))+1,\"\")","v":""},""]
[{"$f":"IF($E85<>\"\",MAX($A$1:INDIRECT(CONCATENATE(\"$A$\",ROW()-1)))+1,\"\")","v":33},"ME22.33","PS 9.15","Performing routine maintenance of pump station.","Month",12]
[{"$f":"IF($E86<>\"\",MAX($A$1:INDIRECT(CONCATENATE(\"$A$\",ROW()-1)))+1,\"\")","v":""},""]
[{"$f":"IF($E87<>\"\",MAX($A$1:INDIRECT(CONCATENATE(\"$A$\",ROW()-1)))+1,\"\")","v":34},"ME22.34","PS 9.15","Testing of the ventilation system","Sum","-","-"]
[{"$f":"IF($E88<>\"\",MAX($A$1:INDIRECT(CONCATENATE(\"$A$\",ROW()-1)))+1,\"\")","v":""},""]
[{"$f":"IF($E89<>\"\",MAX($A$1:INDIRECT(CONCATENATE(\"$A$\",ROW()-1)))+1,\"\")","v":35},"ME22.35","PS 9.4","Provision for the completed installation to be suitable for testing to ISO 9906 Grade 2B on Site during commissioning.","Sum","-","-"]
[]
[{"$f":"IF($E91<>\"\",MAX($A$1:INDIRECT(CONCATENATE(\"$A$\",ROW()-1)))+1,\"\")","v":36},{"$f":"IF(A91<>\"\",$A$3&A91,\"\")","v":"ME22.36"},"PS 6","Providing \"as built\" drawings","Sum","-","-"]
[{"$f":"IF($E92<>\"\",MAX($A$1:INDIRECT(CONCATENATE(\"$A$\",ROW()-1)))+1,\"\")","v":""},{"$f":"IF(A92<>\"\",$A$3&A92,\"\")","v":""}]
[{"$f":"IF($E93<>\"\",MAX($A$1:INDIRECT(CONCATENATE(\"$A$\",ROW()-1)))+1,\"\")","v":37},{"$f":"IF(A93<>\"\",$A$3&A93,\"\")","v":"ME22.37"},null,"Point cloud 3D model of complete finished pump station, including reservoir.","Sum","-","-"]
[]
[{"$f":"IF($E95<>\"\",MAX($A$1:INDIRECT(CONCATENATE(\"$A$\",ROW()-1)))+1,\"\")","v":38},{"$f":"IF(A95<>\"\",$A$3&A95,\"\")","v":"ME22.38"},null,"Independent inspectorate for inspection of equipment","Prov sum","-","-",180000]
[]
[{"$f":"IF($E97<>\"\",MAX($A$1:INDIRECT(CONCATENATE(\"$A$\",ROW()-1)))+1,\"\")","v":39},{"$f":"IF(A97<>\"\",$A$3&A97,\"\")","v":"ME22.39"},null,"Charges and profit on independent inspectorate (expressed as a percentage of the provisional sum amount)","%",{"$f":"H95","v":180000}]
[]
[{"$f":"IF($E99<>\"\",MAX($A$1:INDIRECT(CONCATENATE(\"$A$\",ROW()-1)))+1,\"\")","v":40},{"$f":"IF(A99<>\"\",$A$3&A99,\"\")","v":"ME22.40"},"PS 6","Submission of method statements","Sum","-","-"]
[{"$f":"IF($E100<>\"\",MAX($A$1:INDIRECT(CONCATENATE(\"$A$\",ROW()-1)))+1,\"\")","v":""},""]
[{"$f":"IF($E101<>\"\",MAX($A$1:INDIRECT(CONCATENATE(\"$A$\",ROW()-1)))+1,\"\")","v":41},"ME22.41","PS 5.4","Design Workshops"," Sum","-","-"]
[]
[]
[]
[]
[]
[]
[null,null,null,{"$f":"\" TOTAL SECTION \"&$A$3&\":\n Carried to Summary\"","v":" TOTAL SECTION ME22.:\n Carried to Summary"},null,null,"R"]

{"sheet":"SS&66kV line Flysheet ","index":34,"n_rows":22,"n_cols":1,"rows_kept":22,"cut":false,"hidden":false,"merged":[[21,0,21,9]]}
[]
[]
[]
[]
[]
[]
[]
[]
[]
[]
[]
[]
[]
[]
[]
[]
[]
[]
[]
[]
[]
["Sub-Station and 66kV Line"]

{"sheet":"Section SS1","index":35,"n_rows":47,"n_cols":8,"rows_kept":47,"cut":false,"hidden":false,"merged":[]}
["Item No","Item No","Chief Reference","Short Description","Unit","Quantity","Rate","Amount\n R             c"]
[]
["SS1.",null,null,{"$f":"\"SECTION \"&A3","v":"SECTION SS1."}]
[null,null,null,"SUB-STATION AND 66kV LINE"]
[]
[]
[null,null,null,"Allow for all costs and expenses in connnection with the following items:"]
[null,{"$f":"IF(A8<>\"\",$A$3&A8,\"\")","v":""}]
[{"$f":"IF($E9<>\"\",MAX($A$1:INDIRECT(CONCATENATE(\"$A$\",ROW()-1)))+1,\"\")","v":1},"SS1.1",null,"7km Double Circuit 66kV line","Prov sum","-","-",17200000]
[{"$f":"IF($E10<>\"\",MAX($A$1:INDIRECT(CONCATENATE(\"$A$\",ROW()-1)))+1,\"\")","v":""},"",null,null,null,null," "]
[{"$f":"IF($E11<>\"\",MAX($A$1:INDIRECT(CONCATENATE(\"$A$\",ROW()-1)))+1,\"\")","v":2},"SS1.2",null,"Charges and profit on 7km double circuit 66kV line (expressed as a percentage of the provisional sum amount)","%",{"$f":"H9","v":17200000},null," "]
[{"$f":"IF($E12<>\"\",MAX($A$1:INDIRECT(CONCATENATE(\"$A$\",ROW()-1)))+1,\"\")","v":""},""]
[{"$f":"IF($E13<>\"\",MAX($A$1:INDIRECT(CONCATENATE(\"$A$\",ROW()-1)))+1,\"\")","v":3},"SS1.3",null,"66/11kV, 2 x 10MVA TRF Sub-Station","Prov sum","-","-",33800000]
[{"$f":"IF($E14<>\"\",MAX($A$1:INDIRECT(CONCATENATE(\"$A$\",ROW()-1)))+1,\"\")","v":""},""]
[{"$f":"IF($E15<>\"\",MAX($A$1:INDIRECT(CONCATENATE(\"$A$\",ROW()-1)))+1,\"\")","v":4},"SS1.4",null,"Charges and profit on 66/11kV, 2 x 10MVA TRF Sub-Station (expressed as a percentage of the provisional sum amount)","%",{"$f":"H13","v":33800000}]
[{"$f":"IF($E16<>\"\",MAX($A$1:INDIRECT(CONCATENATE(\"$A$\",ROW()-1)))+1,\"\")","v":""},""]
[{"$f":"IF($E17<>\"\",MAX($A$1:INDIRECT(CONCATENATE(\"$A$\",ROW()-1)))+1,\"\")","v":5},"SS1.5",null,"Distribution Connection Charge","Prov sum","-","-",15000000]
[{"$f":"IF($E18<>\"\",MAX($A$1:INDIRECT(CONCATENATE(\"$A$\",ROW()-1)))+1,\"\")","v":""},""]
[{"$f":"IF($E19<>\"\",MAX($A$1:INDIRECT(CONCATENATE(\"$A$\",ROW()-1)))+1,\"\")","v":6},"SS1.6",null,"Charges and profit on Distributiona nd Connection Charge (expressed as a percentage of the provisional sum amount)","%",{"$f":"H17","v":15000000}]
[{"$f":"IF($E20<>\"\",MAX($A$1:INDIRECT(CONCATENATE(\"$A$\",ROW()-1)))+1,\"\")","v":""},""]
[]
[]
[]
[]
[]
[]
[]
[]
[]
[]
[]
[]
[]
[]
[]
[]
[]
[]
[]
[]
[]
[]
[]
[]
[]
[{"$f":"IF($E46<>\"\",MAX($A$1:INDIRECT(CONCATENATE(\"$A$\",ROW()-1)))+1,\"\")","v":""},""]
[null,null,null,{"$f":"\" TOTAL SECTION \"&$A$3&\":\n Carried to Summary\"","v":" TOTAL SECTION SS1.:\n Carried to Summary"},null,null,"R"]

{"sheet":"Summary Flysheet ","index":36,"n_rows":22,"n_cols":1,"rows_kept":22,"cut":false,"hidden":false,"merged":[[21,0,21,9]]}
[]
[]
[]
[]
[]
[]
[]
[]
[]
[]
[]
[]
[]
[]
[]
[]
[]
[]
[]
[]
[]
["Summary"]

{"sheet":"Summary","index":37,"n_rows":58,"n_cols":4,"rows_kept":58,"cut":false,"hidden":false,"merged":[[0,1,3,4]]}
[null,"SUMMARY"]
[]
[]
[]
[null,"SECTION A:","PRELIMINARY AND GENERAL\n","R"]
[]
[null,null,"CIVIL WORKS"]
[]
[null,"SECTION C1:","DN 700 STEEL PIPELINE","R"]
[null,"SECTION C2:","DN 400 PVC PIPELINE","R"]
[null,"SECTION C3:","SITE LAYOUT AND CIVIL WORKS","R"]
[null,"SECTION C4:","PUMP STATION ","R"]
[null,"SECTION C5:","5 Ml RESERVOIR","R"]
[null,"SECTION C6:","RIVER PROTECTION AND CROSSINGS","R"]
[null,"SECTION C7:","MAIN ACCESS ROAD","R"]
[]
[null,null,"MECHANICAL AND ELECTRICAL WORKS"]
[]
[null,"SECTION ME1:","MULTI-STAGE PUMPS","R"]
[null,"SECTION ME2:","PLUNGER VALVE","R"]
[null,"SECTION ME3:","ISOLATION AND CHECK VALVES","R"]
[null,"SECTION ME4:","PIPEWORK AND SUPPORTS","R"]
[null,"SECTION ME5:","VENTILATION","R"]
[null,"SECTION ME6:","MV CABLE INSTALLATION","R"]
[null,"SECTION ME7:","11 kV OVERHEAD LINE","R"]
[null,"SECTION ME8:","MV SWITCHGEAR","R"]
[null,"SECTION ME9:","DISTRIBUTION TRANSFORMERS","R"]
[null,"SECTION ME10:","LOW VOLTAGE CABLES","R"]
[null,"SECTION ME11:","CABLE SUPPORTS","R"]
[null,"SECTION ME12:","LV SWITCHGEAR AND CONTROLGEAR ASSEMBLIES","R"]
[null,"SECTION ME13:","EARTHING AND LIGHTNING PROTECTION","R"]
[null,"SECTION ME14:","CONTROL, INSTRUMENTATION DATA CABLING","R"]
[null,"SECTION ME15:","PROGRAMMABLE LOGIC CONTROLLER","R"]
[null,"SECTION ME16:","INSTRUMENTATION","R"]
[null,"SECTION ME17:","SCADA","R"]
[null,"SECTION ME18:","BUILDING ELECTRICAL","R"]
[null,"SECTION ME19:","BUILDING ELECTRONICS","R"]
[null,"SECTION ME20:","LIFTING & ACCESS EQUIPMENT","R"]
[null,"SECTION ME21:","SPARES","R"]
[null,"SECTION ME22:","SUNDRIES","R"]
[]
[null,null,"SUB-STATION AND 66kV LINE"]
[]
[null,"SECTION SS1","SUB-STATION AND 66kV LINE","R"]
[]
[null,null,"TOTAL OF PRICED ITEMS","R"]
[]
[null,null,"Allow 15% contingencies (to be expended as directed by the\nEngineer and to be deducted in whole or in part if not required)","R"]
[]
[null,null,"SUB-TOTAL OF TENDER","R"]
[]
[null,null,"Allow 10% contract price adjustment (the provisional sum\nprovided here may be employed only as  necessary in terms \nof the Contract Price Adjustment Schedule)","R"]
[]
[null,null,"NET TOTAL OF TENDER","R"]
[]
[null,null,"Add 14% for Value Added Tax","R"]
[]
[null,null,"GROSS TOTAL OF TENDER\nCarried to Form C1.1, Form of Offer","R"]